Generates the latest/greatest Maven-based artifacts for the Openfire project, every night.

Build: #1102 failed

Job: Run Maven failed

Stages & jobs

  1. Build and Package

  2. Deploy

  3. copy nightlies to website

Job result summary

Completed
Duration
53 seconds
Agent
Default Agent
Revision
736a13d79b52f168f4f327fd266c57036f632607 736a13d79b52f168f4f327fd266c57036f632607
Total tests
401
Fixed in
#1103 (Scheduled)

Tests

  • 401 tests in total
  • 1 test failed
  • 1 failure is new
  • 4 tests were quarantined / skipped
  • 12 seconds taken in total.
New test failures 1
Status Test Duration
Collapse Failed FlattenNestedGroupsTest testFlattenUsersOfGroupsPosix History
< 1 sec
org.jivesoftware.openfire.group.GroupNotFoundException: Group with name admins not found.
	at org.jivesoftware.openfire.ldap.FlattenNestedGroupsTest.testFlattenUsersOfGroups(FlattenNestedGroupsTest.java:214)
	at org.jivesoftware.openfire.ldap.FlattenNestedGroupsTest.testFlattenUsersOfGroupsPosix(FlattenNestedGroupsTest.java:157)
Caused by: javax.naming.CommunicationException: connection closed
	at org.jivesoftware.openfire.ldap.FlattenNestedGroupsTest.testFlattenUsersOfGroups(FlattenNestedGroupsTest.java:214)
	at org.jivesoftware.openfire.ldap.FlattenNestedGroupsTest.testFlattenUsersOfGroupsPosix(FlattenNestedGroupsTest.java:157)
Caused by: java.io.IOException: connection closed
	at org.jivesoftware.openfire.ldap.FlattenNestedGroupsTest.testFlattenUsersOfGroups(FlattenNestedGroupsTest.java:214)
(1 more lines...)