Verifies the integrety of the projects, as builds are executed immediately after a code change was detected. This plan provides no artifiacts (use a nightly build instead).

Build: #689 failed Changes by Florian Schmaus <flo@geekplace.eu>

Build result summary

Details

Completed
Duration
3 minutes
Labels
None
Agent
Default Agent
Revision
fdeaaf368e58f845484650a956514b3ba6e5a5a4 fdeaaf368e58f845484650a956514b3ba6e5a5a4
Fixed in
#690 (Changes by Florian Schmaus <flo@geekplace.eu>)
No failed test found. A possible compilation error occurred.

Responsible

Code commits

Author Commit Message Commit date
Florian Schmaus <flo@geekplace.eu> Florian Schmaus <flo@geekplace.eu> fdeaaf368e58f845484650a956514b3ba6e5a5a4 fdeaaf368e58f845484650a956514b3ba6e5a5a4 Merge pull request #350 from adiaholic/pepOverPubsub
Make use of `pep` instead of `pubsub` in GeoLocations
Florian Schmaus <flo@geekplace.eu> Florian Schmaus <flo@geekplace.eu> 31d69b07f9c00f9bba55f7133a2524b49f65ce98 31d69b07f9c00f9bba55f7133a2524b49f65ce98 Merge pull request #354 from vanitasvitae/smackomemoStyleFixes
omemo: style fixes
Paul Schaub <vanitasvitae@fsfe.org> Paul Schaub <vanitasvitae@fsfe.org> 85ff749d89d2d14e038880150dabc05761c7b39b m 85ff749d89d2d14e038880150dabc05761c7b39b Use StringBuilder instead of String concatenation
Paul Schaub <vanitasvitae@fsfe.org> Paul Schaub <vanitasvitae@fsfe.org> 6d0bf04c1eb7f309a568ad99973eea02e8ea692a m 6d0bf04c1eb7f309a568ad99973eea02e8ea692a Improve Javadoc readability by adding separating lines
Paul Schaub <vanitasvitae@fsfe.org> Paul Schaub <vanitasvitae@fsfe.org> 2391cffa978037132dcbeda53ad74478f9f486a6 m 2391cffa978037132dcbeda53ad74478f9f486a6 Avoid returning empty set of deviceIds in caching store

Error summary for Default Job

The job generated some errors, drill down into the full build log for more details.

        at org.gradle.api.internal.tasks.execution.CleanupStaleOutputsExecuter.execute(CleanupStaleOutputsExecuter.java:94)
        at org.gradle.api.internal.tasks.execution.FinalizePropertiesTaskExecuter.execute(FinalizePropertiesTaskExecuter.java:46)
        at org.gradle.api.internal.tasks.execution.ResolveTaskExecutionModeExecuter.execute(ResolveTaskExecutionModeExecuter.java:95)
        at org.gradle.api.internal.tasks.execution.SkipTaskWithNoActionsExecuter.execute(SkipTaskWithNoActionsExecuter.java:57)
        at org.gradle.api.internal.tasks.execution.SkipOnlyIfTaskExecuter.execute(SkipOnlyIfTaskExecuter.java:56)
        at org.gradle.api.internal.tasks.execution.CatchExceptionTaskExecuter.execute(CatchExceptionTaskExecuter.java:36)
        at org.gradle.api.internal.tasks.execution.EventFiringTaskExecuter$1.executeTask(EventFiringTaskExecuter.java:77)
        at org.gradle.api.internal.tasks.execution.EventFiringTaskExecuter$1.call(EventFiringTaskExecuter.java:55)
        at org.gradle.api.internal.tasks.execution.EventFiringTaskExecuter$1.call(EventFiringTaskExecuter.java:52)
        at org.gradle.internal.operations.DefaultBuildOperationExecutor$CallableBuildOperationWorker.execute(DefaultBuildOperationExecutor.java:416)
        at org.gradle.internal.operations.DefaultBuildOperationExecutor$CallableBuildOperationWorker.execute(DefaultBuildOperationExecutor.java:406)
        at org.gradle.internal.operations.DefaultBuildOperationExecutor$1.execute(DefaultBuildOperationExecutor.java:165)
        at org.gradle.internal.operations.DefaultBuildOperationExecutor.execute(DefaultBuildOperationExecutor.java:250)
        at org.gradle.internal.operations.DefaultBuildOperationExecutor.execute(DefaultBuildOperationExecutor.java:158)
        at org.gradle.internal.operations.DefaultBuildOperationExecutor.call(DefaultBuildOperationExecutor.java:102)
        at org.gradle.internal.operations.DelegatingBuildOperationExecutor.call(DelegatingBuildOperationExecutor.java:36)
        at org.gradle.api.internal.tasks.execution.EventFiringTaskExecuter.execute(EventFiringTaskExecuter.java:52)
        at org.gradle.execution.plan.LocalTaskNodeExecutor.execute(LocalTaskNodeExecutor.java:43)
        at org.gradle.execution.taskgraph.DefaultTaskExecutionGraph$InvokeNodeExecutorsAction.execute(DefaultTaskExecutionGraph.java:355)
        at org.gradle.execution.taskgraph.DefaultTaskExecutionGraph$InvokeNodeExecutorsAction.execute(DefaultTaskExecutionGraph.java:343)
        at org.gradle.execution.taskgraph.DefaultTaskExecutionGraph$BuildOperationAwareExecutionAction.execute(DefaultTaskExecutionGraph.java:336)
        at org.gradle.execution.taskgraph.DefaultTaskExecutionGraph$BuildOperationAwareExecutionAction.execute(DefaultTaskExecutionGraph.java:322)
        at org.gradle.execution.plan.DefaultPlanExecutor$ExecutorWorker$1.execute(DefaultPlanExecutor.java:134)
        at org.gradle.execution.plan.DefaultPlanExecutor$ExecutorWorker$1.execute(DefaultPlanExecutor.java:129)
        at org.gradle.execution.plan.DefaultPlanExecutor$ExecutorWorker.execute(DefaultPlanExecutor.java:202)
        at org.gradle.execution.plan.DefaultPlanExecutor$ExecutorWorker.executeNextNode(DefaultPlanExecutor.java:193)
        at org.gradle.execution.plan.DefaultPlanExecutor$ExecutorWorker.run(DefaultPlanExecutor.java:129)
        at org.gradle.internal.concurrent.ExecutorPolicy$CatchAndRecordFailures.onExecute(ExecutorPolicy.java:64)
        at org.gradle.internal.concurrent.ManagedExecutorImpl$1.run(ManagedExecutorImpl.java:48)
        at org.gradle.internal.concurrent.ThreadFactoryImpl$ManagedThreadRunnable.run(ThreadFactoryImpl.java:56)
Caused by: org.gradle.api.GradleException: Javadoc generation failed. Generated Javadoc options file (useful for troubleshooting): '/var/atlassian/bamboo-home/xml-data/build-dir/SMACK-CIMASTER-JOB1/smack-omemo/build/tmp/javadoc/javadoc.options'
        at org.gradle.api.tasks.javadoc.internal.JavadocGenerator.execute(JavadocGenerator.java:58)
        at org.gradle.api.tasks.javadoc.internal.JavadocGenerator.execute(JavadocGenerator.java:31)
        at org.gradle.api.tasks.javadoc.Javadoc.executeExternalJavadoc(Javadoc.java:158)
        at org.gradle.api.tasks.javadoc.Javadoc.generate(Javadoc.java:146)
        at org.gradle.internal.reflect.JavaMethod.invoke(JavaMethod.java:103)
        at org.gradle.api.internal.project.taskfactory.StandardTaskAction.doExecute(StandardTaskAction.java:49)
        at org.gradle.api.internal.project.taskfactory.StandardTaskAction.execute(StandardTaskAction.java:42)
        at org.gradle.api.internal.project.taskfactory.StandardTaskAction.execute(StandardTaskAction.java:28)
        at org.gradle.api.internal.AbstractTask$TaskActionWrapper.execute(AbstractTask.java:717)
        at org.gradle.api.internal.AbstractTask$TaskActionWrapper.execute(AbstractTask.java:684)
        at org.gradle.api.internal.tasks.execution.ExecuteActionsTaskExecuter$5.run(ExecuteActionsTaskExecuter.java:476)
        at org.gradle.internal.operations.DefaultBuildOperationExecutor$RunnableBuildOperationWorker.execute(DefaultBuildOperationExecutor.java:402)
        at org.gradle.internal.operations.DefaultBuildOperationExecutor$RunnableBuildOperationWorker.execute(DefaultBuildOperationExecutor.java:394)
        at org.gradle.internal.operations.DefaultBuildOperationExecutor$1.execute(DefaultBuildOperationExecutor.java:165)
        at org.gradle.internal.operations.DefaultBuildOperationExecutor.execute(DefaultBuildOperationExecutor.java:250)
        at org.gradle.internal.operations.DefaultBuildOperationExecutor.execute(DefaultBuildOperationExecutor.java:158)
        at org.gradle.internal.operations.DefaultBuildOperationExecutor.run(DefaultBuildOperationExecutor.java:92)
        at org.gradle.internal.operations.DelegatingBuildOperationExecutor.run(DelegatingBuildOperationExecutor.java:31)
        at org.gradle.api.internal.tasks.execution.ExecuteActionsTaskExecuter.executeAction(ExecuteActionsTaskExecuter.java:461)
        at org.gradle.api.internal.tasks.execution.ExecuteActionsTaskExecuter.executeActions(ExecuteActionsTaskExecuter.java:444)
        at org.gradle.api.internal.tasks.execution.ExecuteActionsTaskExecuter.access$200(ExecuteActionsTaskExecuter.java:93)
        at org.gradle.api.internal.tasks.execution.ExecuteActionsTaskExecuter$TaskExecution.execute(ExecuteActionsTaskExecuter.java:237)
        at org.gradle.internal.execution.steps.ExecuteStep.lambda$execute$1(ExecuteStep.java:33)
        at org.gradle.internal.execution.steps.ExecuteStep.execute(ExecuteStep.java:33)
        at org.gradle.internal.execution.steps.ExecuteStep.execute(ExecuteStep.java:26)
        at org.gradle.internal.execution.steps.CleanupOutputsStep.execute(CleanupOutputsStep.java:58)
        at org.gradle.internal.execution.steps.CleanupOutputsStep.execute(CleanupOutputsStep.java:35)
        at org.gradle.internal.execution.steps.ResolveInputChangesStep.execute(ResolveInputChangesStep.java:48)
        at org.gradle.internal.execution.steps.ResolveInputChangesStep.execute(ResolveInputChangesStep.java:33)
        at org.gradle.internal.execution.steps.CancelExecutionStep.execute(CancelExecutionStep.java:39)
        at org.gradle.internal.execution.steps.TimeoutStep.executeWithoutTimeout(TimeoutStep.java:73)
        at org.gradle.internal.execution.steps.TimeoutStep.execute(TimeoutStep.java:54)
        at org.gradle.internal.execution.steps.CatchExceptionStep.execute(CatchExceptionStep.java:35)
        at org.gradle.internal.execution.steps.CreateOutputsStep.execute(CreateOutputsStep.java:51)
        at org.gradle.internal.execution.steps.SnapshotOutputsStep.execute(SnapshotOutputsStep.java:45)
        at org.gradle.internal.execution.steps.SnapshotOutputsStep.execute(SnapshotOutputsStep.java:31)
        at org.gradle.internal.execution.steps.CacheStep.executeWithoutCache(CacheStep.java:208)
        at org.gradle.internal.execution.steps.CacheStep.execute(CacheStep.java:70)
        at org.gradle.internal.execution.steps.CacheStep.execute(CacheStep.java:45)
        at org.gradle.internal.execution.steps.BroadcastChangingOutputsStep.execute(BroadcastChangingOutputsStep.java:49)
        at org.gradle.internal.execution.steps.StoreSnapshotsStep.execute(StoreSnapshotsStep.java:43)
        at org.gradle.internal.execution.steps.StoreSnapshotsStep.execute(StoreSnapshotsStep.java:32)
        at org.gradle.internal.execution.steps.RecordOutputsStep.execute(RecordOutputsStep.java:38)
        at org.gradle.internal.execution.steps.RecordOutputsStep.execute(RecordOutputsStep.java:24)
        at org.gradle.internal.execution.steps.SkipUpToDateStep.executeBecause(SkipUpToDateStep.java:96)
        at org.gradle.internal.execution.steps.SkipUpToDateStep.lambda$execute$0(SkipUpToDateStep.java:89)
        at org.gradle.internal.execution.steps.SkipUpToDateStep.execute(SkipUpToDateStep.java:54)
        at org.gradle.internal.execution.steps.SkipUpToDateStep.execute(SkipUpToDateStep.java:38)
        at org.gradle.internal.execution.steps.ResolveChangesStep.execute(ResolveChangesStep.java:76)
        at org.gradle.internal.execution.steps.ResolveChangesStep.execute(ResolveChangesStep.java:37)
        at org.gradle.internal.execution.steps.legacy.MarkSnapshottingInputsFinishedStep.execute(MarkSnapshottingInputsFinishedStep.java:36)
        at org.gradle.internal.execution.steps.legacy.MarkSnapshottingInputsFinishedStep.execute(MarkSnapshottingInputsFinishedStep.java:26)
        at org.gradle.internal.execution.steps.ResolveCachingStateStep.execute(ResolveCachingStateStep.java:90)
        at org.gradle.internal.execution.steps.ResolveCachingStateStep.execute(ResolveCachingStateStep.java:48)
        at org.gradle.internal.execution.steps.CaptureStateBeforeExecutionStep.execute(CaptureStateBeforeExecutionStep.java:69)
        at org.gradle.internal.execution.steps.CaptureStateBeforeExecutionStep.execute(CaptureStateBeforeExecutionStep.java:47)
        at org.gradle.internal.execution.impl.DefaultWorkExecutor.execute(DefaultWorkExecutor.java:33)
        at org.gradle.api.internal.tasks.execution.ExecuteActionsTaskExecuter.execute(ExecuteActionsTaskExecuter.java:140)
        ... 34 more
Caused by: org.gradle.process.internal.ExecException: Process 'command '/usr/lib/jvm/java-1.8.0-openjdk-1.8.0.242.b08-0.50.amzn1.x86_64/bin/javadoc'' finished with non-zero exit value 1
        at org.gradle.process.internal.DefaultExecHandle$ExecResultImpl.assertNormalExitValue(DefaultExecHandle.java:409)
        at org.gradle.process.internal.DefaultExecAction.execute(DefaultExecAction.java:38)
        at org.gradle.api.tasks.javadoc.internal.JavadocGenerator.execute(JavadocGenerator.java:53)
        ... 91 more


* Get more help at https://help.gradle.org

BUILD FAILED in 3m 13s