Verifies the integrety of the projects, as builds are executed immediately after a code change was detected. This plan provides no artifiacts (use a nightly build instead).

Build: #651 was successful

Job: Default Job was successful

Stages & jobs

  1. Default Stage

Job result summary

Completed
Duration
4 minutes
Agent
Default Agent
Revision
2f667f95a8bad867d837b4acb6e4c29cfe9ef0c9 2f667f95a8bad867d837b4acb6e4c29cfe9ef0c9
Total tests
737
First to pass since
#650 (Code changes detected – )

Tests

  • 737 tests in total
  • 5 tests were quarantined / skipped
  • 23 seconds taken in total.

Error summary

The build generated some errors. See the full build log for more details.

Found 0 errors
Exception in thread "main" java.lang.ExceptionInInitializerError
        at org.jivesoftware.smack.SmackConfiguration.getVersion(SmackConfiguration.java:108)
        at org.jivesoftware.smack.AbstractXMPPConnection.<clinit>(AbstractXMPPConnection.java:187)
        at org.igniterealtime.smack.smackrepl.StateGraph.main(StateGraph.java:37)
Caused by: java.lang.IllegalStateException: Could not parse Smack configuration file
        at org.jivesoftware.smack.SmackInitialization.<clinit>(SmackInitialization.java:100)
        ... 3 more
Caused by: java.lang.IllegalStateException: Could not load a XmlPullParserFactory via Service Provider Interface (SPI)
        at org.jivesoftware.smack.xml.SmackXmlParser.getXmlPullParserFactory(SmackXmlParser.java:34)
        at org.jivesoftware.smack.xml.SmackXmlParser.newXmlParser(SmackXmlParser.java:53)
        at org.jivesoftware.smack.util.PacketParserUtils.getParserFor(PacketParserUtils.java:76)
        at org.jivesoftware.smack.SmackInitialization.processConfigFile(SmackInitialization.java:144)
        at org.jivesoftware.smack.SmackInitialization.processConfigFile(SmackInitialization.java:139)
        at org.jivesoftware.smack.SmackInitialization.<clinit>(SmackInitialization.java:97)
        ... 3 more

FAILURE: Build failed with an exception.

* What went wrong:
Execution failed for task ':smack-repl:printXmppNioTcpConnectionStateGraph'.
> Process 'command '/usr/lib/jvm/java-1.8.0-openjdk-1.8.0.222.b10-0.47.amzn1.x86_64/bin/java'' finished with non-zero exit value 1

* Try:
Run with --stacktrace option to get the stack trace. Run with --info or --debug option to get more log output. Run with --scan to get full insights.

* Get more help at https://help.gradle.org

BUILD FAILED in 13s