Nightly Distribution of the master branch

Build: #1607 failed Manual run by Florian Schmaus

Stages & jobs

  1. Default Stage

  2. Deploy

Build result summary

Details

Completed
Duration
3 minutes
Labels
None
Revision
1136e8a2e9c80bff2e38ba2e40f5c6ad571f4f70 1136e8a2e9c80bff2e38ba2e40f5c6ad571f4f70
Failing since
#1606 (Changes by Florian Schmaus)
Fixed in
#1608 (Manual run by Florian Schmaus)
No failed tests found, a possible compilation error occurred.

Responsible

Error summary for Default Job

The job generated some errors, drill down into the full build log for more details.

/var/atlassian/bamboo-home/xml-data/build-dir/SMACK-NIGHTLY-JOB1/smack-omemo/src/main/java/org/jivesoftware/smackx/omemo/OmemoManager.java:706: warning: no description for @throws
     * @throws SmackException.NotLoggedInException
       ^
/var/atlassian/bamboo-home/xml-data/build-dir/SMACK-NIGHTLY-JOB1/smack-omemo/src/main/java/org/jivesoftware/smackx/omemo/OmemoManager.java:707: warning: no description for @throws
     * @throws InterruptedException
       ^
/var/atlassian/bamboo-home/xml-data/build-dir/SMACK-NIGHTLY-JOB1/smack-omemo/src/main/java/org/jivesoftware/smackx/omemo/OmemoManager.java:708: warning: no description for @throws
     * @throws XMPPException.XMPPErrorException
       ^
/var/atlassian/bamboo-home/xml-data/build-dir/SMACK-NIGHTLY-JOB1/smack-omemo/src/main/java/org/jivesoftware/smackx/omemo/OmemoManager.java:709: warning: no description for @throws
     * @throws SmackException.NotConnectedException
       ^
/var/atlassian/bamboo-home/xml-data/build-dir/SMACK-NIGHTLY-JOB1/smack-omemo/src/main/java/org/jivesoftware/smackx/omemo/OmemoManager.java:710: warning: no description for @throws
     * @throws SmackException.NoResponseException
       ^
/var/atlassian/bamboo-home/xml-data/build-dir/SMACK-NIGHTLY-JOB1/smack-omemo/src/main/java/org/jivesoftware/smackx/omemo/OmemoManager.java:730: warning: no description for @throws
     * @throws SmackException.NotLoggedInException
       ^
/var/atlassian/bamboo-home/xml-data/build-dir/SMACK-NIGHTLY-JOB1/smack-omemo/src/main/java/org/jivesoftware/smackx/omemo/OmemoManager.java:909: warning: no description for @throws
     * @throws InterruptedException
       ^
/var/atlassian/bamboo-home/xml-data/build-dir/SMACK-NIGHTLY-JOB1/smack-omemo/src/main/java/org/jivesoftware/smackx/omemo/OmemoManager.java:910: warning: no description for @throws
     * @throws SmackException.NoResponseException
       ^
/var/atlassian/bamboo-home/xml-data/build-dir/SMACK-NIGHTLY-JOB1/smack-omemo/src/main/java/org/jivesoftware/smackx/omemo/OmemoManager.java:912: warning: no description for @throws
     * @throws SmackException.NotConnectedException
       ^
/var/atlassian/bamboo-home/xml-data/build-dir/SMACK-NIGHTLY-JOB1/smack-omemo/src/main/java/org/jivesoftware/smackx/omemo/OmemoRatchet.java:64: warning: no description for @throws
     * @throws CorruptedOmemoKeyException
       ^

27 tests completed, 1 failed

FAILURE: Build failed with an exception.

* What went wrong:
Execution failed for task ':smack-openpgp:test'.
> There were failing tests. See the report at: file:///var/atlassian/bamboo-home/xml-data/build-dir/SMACK-NIGHTLY-JOB1/smack-openpgp/build/reports/tests/test/index.html

* Try:
Run with --info or --debug option to get more log output. Run with --scan to get full insights.

* Exception is:
org.gradle.api.tasks.TaskExecutionException: Execution failed for task ':smack-openpgp:test'.
        at org.gradle.api.internal.tasks.execution.ExecuteActionsTaskExecuter.executeActions(ExecuteActionsTaskExecuter.java:110)
        at org.gradle.api.internal.tasks.execution.ExecuteActionsTaskExecuter.execute(ExecuteActionsTaskExecuter.java:77)
        at org.gradle.api.internal.tasks.execution.OutputDirectoryCreatingTaskExecuter.execute(OutputDirectoryCreatingTaskExecuter.java:51)
        at org.gradle.api.internal.tasks.execution.SkipUpToDateTaskExecuter.execute(SkipUpToDateTaskExecuter.java:59)
        at org.gradle.api.internal.tasks.execution.ResolveTaskOutputCachingStateExecuter.execute(ResolveTaskOutputCachingStateExecuter.java:54)
        at org.gradle.api.internal.tasks.execution.ValidatingTaskExecuter.execute(ValidatingTaskExecuter.java:59)
        at org.gradle.api.internal.tasks.execution.SkipEmptySourceFilesTaskExecuter.execute(SkipEmptySourceFilesTaskExecuter.java:101)
        at org.gradle.api.internal.tasks.execution.FinalizeInputFilePropertiesTaskExecuter.execute(FinalizeInputFilePropertiesTaskExecuter.java:44)
        at org.gradle.api.internal.tasks.execution.CleanupStaleOutputsExecuter.execute(CleanupStaleOutputsExecuter.java:91)
        at org.gradle.api.internal.tasks.execution.ResolveTaskArtifactStateTaskExecuter.execute(ResolveTaskArtifactStateTaskExecuter.java:62)
        at org.gradle.api.internal.tasks.execution.SkipTaskWithNoActionsExecuter.execute(SkipTaskWithNoActionsExecuter.java:59)
        at org.gradle.api.internal.tasks.execution.SkipOnlyIfTaskExecuter.execute(SkipOnlyIfTaskExecuter.java:54)
        at org.gradle.api.internal.tasks.execution.ExecuteAtMostOnceTaskExecuter.execute(ExecuteAtMostOnceTaskExecuter.java:43)
        at org.gradle.api.internal.tasks.execution.CatchExceptionTaskExecuter.execute(CatchExceptionTaskExecuter.java:34)
        at org.gradle.api.internal.tasks.execution.EventFiringTaskExecuter$1.run(EventFiringTaskExecuter.java:51)
        at org.gradle.internal.operations.DefaultBuildOperationExecutor$RunnableBuildOperationWorker.execute(DefaultBuildOperationExecutor.java:300)
        at org.gradle.internal.operations.DefaultBuildOperationExecutor$RunnableBuildOperationWorker.execute(DefaultBuildOperationExecutor.java:292)
        at org.gradle.internal.operations.DefaultBuildOperationExecutor.execute(DefaultBuildOperationExecutor.java:174)
        at org.gradle.internal.operations.DefaultBuildOperationExecutor.run(DefaultBuildOperationExecutor.java:90)
        at org.gradle.internal.operations.DelegatingBuildOperationExecutor.run(DelegatingBuildOperationExecutor.java:31)
        at org.gradle.api.internal.tasks.execution.EventFiringTaskExecuter.execute(EventFiringTaskExecuter.java:46)
        at org.gradle.execution.taskgraph.LocalTaskInfoExecutor.execute(LocalTaskInfoExecutor.java:42)
        at org.gradle.execution.taskgraph.DefaultTaskExecutionGraph$BuildOperationAwareWorkItemExecutor.execute(DefaultTaskExecutionGraph.java:273)
        at org.gradle.execution.taskgraph.DefaultTaskExecutionGraph$BuildOperationAwareWorkItemExecutor.execute(DefaultTaskExecutionGraph.java:258)
        at org.gradle.execution.taskgraph.DefaultTaskPlanExecutor$ExecutorWorker$1.execute(DefaultTaskPlanExecutor.java:135)
        at org.gradle.execution.taskgraph.DefaultTaskPlanExecutor$ExecutorWorker$1.execute(DefaultTaskPlanExecutor.java:130)
        at org.gradle.execution.taskgraph.DefaultTaskPlanExecutor$ExecutorWorker.execute(DefaultTaskPlanExecutor.java:200)
        at org.gradle.execution.taskgraph.DefaultTaskPlanExecutor$ExecutorWorker.executeWithWork(DefaultTaskPlanExecutor.java:191)
        at org.gradle.execution.taskgraph.DefaultTaskPlanExecutor$ExecutorWorker.run(DefaultTaskPlanExecutor.java:130)
        at org.gradle.internal.concurrent.ExecutorPolicy$CatchAndRecordFailures.onExecute(ExecutorPolicy.java:63)
        at org.gradle.internal.concurrent.ManagedExecutorImpl$1.run(ManagedExecutorImpl.java:46)
        at org.gradle.internal.concurrent.ThreadFactoryImpl$ManagedThreadRunnable.run(ThreadFactoryImpl.java:55)
Caused by: org.gradle.api.GradleException: There were failing tests. See the report at: file:///var/atlassian/bamboo-home/xml-data/build-dir/SMACK-NIGHTLY-JOB1/smack-openpgp/build/reports/tests/test/index.html
        at org.gradle.api.tasks.testing.AbstractTestTask.handleTestFailures(AbstractTestTask.java:612)
        at org.gradle.api.tasks.testing.AbstractTestTask.executeTests(AbstractTestTask.java:484)
        at org.gradle.api.tasks.testing.Test.executeTests(Test.java:603)
        at org.gradle.internal.reflect.JavaMethod.invoke(JavaMethod.java:73)
        at org.gradle.api.internal.project.taskfactory.StandardTaskAction.doExecute(StandardTaskAction.java:46)
        at org.gradle.api.internal.project.taskfactory.StandardTaskAction.execute(StandardTaskAction.java:39)
        at org.gradle.api.internal.project.taskfactory.StandardTaskAction.execute(StandardTaskAction.java:26)
        at org.gradle.api.internal.AbstractTask$TaskActionWrapper.execute(AbstractTask.java:786)
        at org.gradle.api.internal.AbstractTask$TaskActionWrapper.execute(AbstractTask.java:753)
        at org.gradle.api.internal.tasks.execution.ExecuteActionsTaskExecuter$1.run(ExecuteActionsTaskExecuter.java:131)
        at org.gradle.internal.operations.DefaultBuildOperationExecutor$RunnableBuildOperationWorker.execute(DefaultBuildOperationExecutor.java:300)
        at org.gradle.internal.operations.DefaultBuildOperationExecutor$RunnableBuildOperationWorker.execute(DefaultBuildOperationExecutor.java:292)
        at org.gradle.internal.operations.DefaultBuildOperationExecutor.execute(DefaultBuildOperationExecutor.java:174)
        at org.gradle.internal.operations.DefaultBuildOperationExecutor.run(DefaultBuildOperationExecutor.java:90)
        at org.gradle.internal.operations.DelegatingBuildOperationExecutor.run(DelegatingBuildOperationExecutor.java:31)
        at org.gradle.api.internal.tasks.execution.ExecuteActionsTaskExecuter.executeAction(ExecuteActionsTaskExecuter.java:120)
        at org.gradle.api.internal.tasks.execution.ExecuteActionsTaskExecuter.executeActions(ExecuteActionsTaskExecuter.java:99)
        ... 31 more


* Get more help at https://help.gradle.org

BUILD FAILED in 3m 40s