Nightly Distribution of the master branch

Build: #1667 failed Changes by Florian Schmaus

Stages & jobs

  1. Default Stage

  2. Deploy

Build result summary

Details

Completed
Duration
8 minutes
Labels
None
Revision
178ae8abef4ee929dc4c3673fe3b78a61798075a 178ae8abef4ee929dc4c3673fe3b78a61798075a
Total tests
734
Failing since
#1655 (Changes by Florian Schmaus)
Fixed in
#1669 (Changes by Florian Schmaus)
No failed tests found, a possible compilation error occurred.

Tests

Responsible

Code commits

Author Commit Message Commit date
Florian Schmaus Florian Schmaus 178ae8abef4ee929dc4c3673fe3b78a61798075a 178ae8abef4ee929dc4c3673fe3b78a61798075a Merge branch 'master' of github.com:igniterealtime/Smack
Florian Schmaus Florian Schmaus aec648c34b81ba39baa57ac8b75936ef2a41ba4f m aec648c34b81ba39baa57ac8b75936ef2a41ba4f Improve PubSubIntegrationTest
Ensuring that the node has no items in
transientNotificationOnlyNodeWithoutItemTest() is not right. An
implementation is free to create an item with an ID and return it. The
item is just not guaranteed to be persistent.

Also add a dummy payload to
transientNotificationOnlyNodeWithItemTest().
Florian Schmaus Florian Schmaus df5899e72bbbdc83513a4570cb0ff04763303938 m df5899e72bbbdc83513a4570cb0ff04763303938 Introduce SmackConfiguration.SMACK_URL(_STRING)
Florian Schmaus Florian Schmaus f3b856c80bd04bc088d91d369be89e0ef964cad8 m f3b856c80bd04bc088d91d369be89e0ef964cad8 Improve shouldFailIfInitiatorCannotConnectToSocks5Proxy() unit test
If run in parallel with other unit tests, especially onces that open
up a proxy, this test could fail, because another unit test actually
had an proxy running on the very address this unit test assumes to be
no proxy running.

We now use an IP address from RFC 5737's TEST-NET-1 address block,
which should never be available.
Florian Schmaus Florian Schmaus 1b5a264d52a24a7a60b42963e1c6eafb0cf5e9df m 1b5a264d52a24a7a60b42963e1c6eafb0cf5e9df Add assert to IQ.initializeAsResultFor(IQ)
This method is not meant to be used to be invoked with the identity.

Jira issues

IssueDescriptionStatus
Unknown Issue TypeSMACK-872Could not obtain issue details from Jira
Unknown Issue TypeXEP-0315Could not obtain issue details from Jira

Error summary for Default Job

The job generated some errors, drill down into the full build log for more details.

/var/atlassian/bamboo-home/xml-data/build-dir/SMACK-NIGHTLY-JOB1/smack-omemo/src/main/java/org/jivesoftware/smackx/omemo/OmemoManager.java:692: warning: no description for @throws
     * @throws XMPPException.XMPPErrorException
       ^
/var/atlassian/bamboo-home/xml-data/build-dir/SMACK-NIGHTLY-JOB1/smack-omemo/src/main/java/org/jivesoftware/smackx/omemo/OmemoManager.java:693: warning: no description for @throws
     * @throws SmackException.NotConnectedException
       ^
/var/atlassian/bamboo-home/xml-data/build-dir/SMACK-NIGHTLY-JOB1/smack-omemo/src/main/java/org/jivesoftware/smackx/omemo/OmemoManager.java:694: warning: no description for @throws
     * @throws SmackException.NoResponseException
       ^
/var/atlassian/bamboo-home/xml-data/build-dir/SMACK-NIGHTLY-JOB1/smack-omemo/src/main/java/org/jivesoftware/smackx/omemo/OmemoManager.java:707: warning: no description for @throws
     * @throws SmackException.NotLoggedInException
       ^
/var/atlassian/bamboo-home/xml-data/build-dir/SMACK-NIGHTLY-JOB1/smack-omemo/src/main/java/org/jivesoftware/smackx/omemo/OmemoManager.java:708: warning: no description for @throws
     * @throws InterruptedException
       ^
/var/atlassian/bamboo-home/xml-data/build-dir/SMACK-NIGHTLY-JOB1/smack-omemo/src/main/java/org/jivesoftware/smackx/omemo/OmemoManager.java:709: warning: no description for @throws
     * @throws XMPPException.XMPPErrorException
       ^
/var/atlassian/bamboo-home/xml-data/build-dir/SMACK-NIGHTLY-JOB1/smack-omemo/src/main/java/org/jivesoftware/smackx/omemo/OmemoManager.java:710: warning: no description for @throws
     * @throws SmackException.NotConnectedException
       ^
/var/atlassian/bamboo-home/xml-data/build-dir/SMACK-NIGHTLY-JOB1/smack-omemo/src/main/java/org/jivesoftware/smackx/omemo/OmemoManager.java:711: warning: no description for @throws
     * @throws SmackException.NoResponseException
       ^
/var/atlassian/bamboo-home/xml-data/build-dir/SMACK-NIGHTLY-JOB1/smack-omemo/src/main/java/org/jivesoftware/smackx/omemo/OmemoManager.java:731: warning: no description for @throws
     * @throws SmackException.NotLoggedInException
       ^
/var/atlassian/bamboo-home/xml-data/build-dir/SMACK-NIGHTLY-JOB1/smack-omemo/src/main/java/org/jivesoftware/smackx/omemo/OmemoManager.java:910: warning: no description for @throws
     * @throws InterruptedException
       ^
/var/atlassian/bamboo-home/xml-data/build-dir/SMACK-NIGHTLY-JOB1/smack-omemo/src/main/java/org/jivesoftware/smackx/omemo/OmemoManager.java:911: warning: no description for @throws
     * @throws SmackException.NoResponseException
       ^
/var/atlassian/bamboo-home/xml-data/build-dir/SMACK-NIGHTLY-JOB1/smack-omemo/src/main/java/org/jivesoftware/smackx/omemo/OmemoManager.java:913: warning: no description for @throws
     * @throws SmackException.NotConnectedException
       ^
/var/atlassian/bamboo-home/xml-data/build-dir/SMACK-NIGHTLY-JOB1/smack-omemo/src/main/java/org/jivesoftware/smackx/omemo/OmemoRatchet.java:64: warning: no description for @throws
     * @throws CorruptedOmemoKeyException
       ^
/var/atlassian/bamboo-home/xml-data/build-dir/SMACK-NIGHTLY-JOB1/smack-omemo/src/main/java/org/jivesoftware/smackx/omemo/OmemoRatchet.java:66: warning: no description for @throws
     * @throws CryptoFailedException
       ^
/var/atlassian/bamboo-home/xml-data/build-dir/SMACK-NIGHTLY-JOB1/smack-omemo/src/main/java/org/jivesoftware/smackx/omemo/OmemoRatchet.java:67: warning: no description for @throws
     * @throws UntrustedOmemoIdentityException
       ^
/var/atlassian/bamboo-home/xml-data/build-dir/SMACK-NIGHTLY-JOB1/smack-omemo/src/main/java/org/jivesoftware/smackx/omemo/OmemoService.java:879: warning: no description for @throws
     * @throws CorruptedOmemoKeyException
       ^
Found 0 errors
/var/atlassian/bamboo-home/xml-data/build-dir/SMACK-NIGHTLY-JOB1/smack-tcp/src/main/java/org/jivesoftware/smack/tcp/XMPPTCPConnection.java:811: warning: no description for @throws
     * @throws SmackException
       ^
/var/atlassian/bamboo-home/xml-data/build-dir/SMACK-NIGHTLY-JOB1/smack-tcp/src/main/java/org/jivesoftware/smack/tcp/XMPPTCPConnection.java:812: warning: no description for @throws
     * @throws IOException
       ^
/var/atlassian/bamboo-home/xml-data/build-dir/SMACK-NIGHTLY-JOB1/smack-tcp/src/main/java/org/jivesoftware/smack/tcp/XMPPTCPConnection.java:813: warning: no description for @throws
     * @throws InterruptedException
       ^
/var/atlassian/bamboo-home/xml-data/build-dir/SMACK-NIGHTLY-JOB1/smack-tcp/src/main/java/org/jivesoftware/smack/tcp/XMPPTCPConnection.java:835: warning: no description for @param
     * @param writer
       ^
/var/atlassian/bamboo-home/xml-data/build-dir/SMACK-NIGHTLY-JOB1/smack-tcp/src/main/java/org/jivesoftware/smack/tcp/XMPPTCPConnection.java:1573: warning: no description for @throws
     * @throws InterruptedException
       ^
/var/atlassian/bamboo-home/xml-data/build-dir/SMACK-NIGHTLY-JOB1/smack-tcp/src/main/java/org/jivesoftware/smack/tcp/XMPPTCPConnection.java:1596: warning: no description for @throws
     * @throws InterruptedException
       ^
/var/atlassian/bamboo-home/xml-data/build-dir/SMACK-NIGHTLY-JOB1/smack-tcp/src/main/java/org/jivesoftware/smack/tcp/XMPPTCPConnection.java:1873: warning: no description for @param
     * @param defaultBundleAndDeferCallback
       ^
/var/atlassian/bamboo-home/xml-data/build-dir/SMACK-NIGHTLY-JOB1/smack-tcp/src/main/java/org/jivesoftware/smack/tcp/XMPPTCPConnection.java:317: warning: no description for @throws
     * @throws XmppStringprepException
       ^
/var/atlassian/bamboo-home/xml-data/build-dir/SMACK-NIGHTLY-JOB1/smack-tcp/src/main/java/org/jivesoftware/smack/tcp/XMPPTCPConnection.java:330: warning: no description for @param
     * @param username
       ^
/var/atlassian/bamboo-home/xml-data/build-dir/SMACK-NIGHTLY-JOB1/smack-tcp/src/main/java/org/jivesoftware/smack/tcp/XMPPTCPConnection.java:331: warning: no description for @param
     * @param password
       ^
/var/atlassian/bamboo-home/xml-data/build-dir/SMACK-NIGHTLY-JOB1/smack-tcp/src/main/java/org/jivesoftware/smack/tcp/XMPPTCPConnection.java:332: warning: no description for @param
     * @param serviceName
       ^
/var/atlassian/bamboo-home/xml-data/build-dir/SMACK-NIGHTLY-JOB1/smack-tcp/src/main/java/org/jivesoftware/smack/tcp/XMPPTCPConnection.java:333: warning: no description for @throws
     * @throws XmppStringprepException
       ^
/var/atlassian/bamboo-home/xml-data/build-dir/SMACK-NIGHTLY-JOB1/smack-tcp/src/main/java/org/jivesoftware/smack/tcp/XMPPTCPConnection.java:1240: warning: no description for @throws
         * @throws NotConnectedException
           ^
/var/atlassian/bamboo-home/xml-data/build-dir/SMACK-NIGHTLY-JOB1/smack-tcp/src/main/java/org/jivesoftware/smack/tcp/XMPPTCPConnection.java:1241: warning: no description for @throws
         * @throws InterruptedException
           ^
/var/atlassian/bamboo-home/xml-data/build-dir/SMACK-NIGHTLY-JOB1/smack-tcp/src/main/java/org/jivesoftware/smack/sm/SMUtils.java:33: warning: no description for @param
     * @param height
       ^
/var/atlassian/bamboo-home/xml-data/build-dir/SMACK-NIGHTLY-JOB1/smack-tcp/src/main/java/org/jivesoftware/smack/sm/SMUtils.java:45: warning: no description for @param
     * @param reportedHandledCount
       ^
/var/atlassian/bamboo-home/xml-data/build-dir/SMACK-NIGHTLY-JOB1/smack-tcp/src/main/java/org/jivesoftware/smack/sm/SMUtils.java:46: warning: no description for @param
     * @param lastKnownHandledCount
       ^
        at org.gradle.api.internal.tasks.execution.EventFiringTaskExecuter$1.call(EventFiringTaskExecuter.java:46)
        at org.gradle.internal.operations.DefaultBuildOperationExecutor$CallableBuildOperationWorker.execute(DefaultBuildOperationExecutor.java:416)
        at org.gradle.internal.operations.DefaultBuildOperationExecutor$CallableBuildOperationWorker.execute(DefaultBuildOperationExecutor.java:406)
        at org.gradle.internal.operations.DefaultBuildOperationExecutor$1.execute(DefaultBuildOperationExecutor.java:165)
        at org.gradle.internal.operations.DefaultBuildOperationExecutor.execute(DefaultBuildOperationExecutor.java:250)
        at org.gradle.internal.operations.DefaultBuildOperationExecutor.execute(DefaultBuildOperationExecutor.java:158)
        at org.gradle.internal.operations.DefaultBuildOperationExecutor.call(DefaultBuildOperationExecutor.java:102)
        at org.gradle.internal.operations.DelegatingBuildOperationExecutor.call(DelegatingBuildOperationExecutor.java:36)
        at org.gradle.api.internal.tasks.execution.EventFiringTaskExecuter.execute(EventFiringTaskExecuter.java:46)
        at org.gradle.execution.plan.LocalTaskNodeExecutor.execute(LocalTaskNodeExecutor.java:43)
        at org.gradle.execution.taskgraph.DefaultTaskExecutionGraph$InvokeNodeExecutorsAction.execute(DefaultTaskExecutionGraph.java:355)
        at org.gradle.execution.taskgraph.DefaultTaskExecutionGraph$InvokeNodeExecutorsAction.execute(DefaultTaskExecutionGraph.java:343)
        at org.gradle.execution.taskgraph.DefaultTaskExecutionGraph$BuildOperationAwareExecutionAction.execute(DefaultTaskExecutionGraph.java:336)
        at org.gradle.execution.taskgraph.DefaultTaskExecutionGraph$BuildOperationAwareExecutionAction.execute(DefaultTaskExecutionGraph.java:322)
        at org.gradle.execution.plan.DefaultPlanExecutor$ExecutorWorker$1.execute(DefaultPlanExecutor.java:134)
        at org.gradle.execution.plan.DefaultPlanExecutor$ExecutorWorker$1.execute(DefaultPlanExecutor.java:129)
        at org.gradle.execution.plan.DefaultPlanExecutor$ExecutorWorker.execute(DefaultPlanExecutor.java:202)
        at org.gradle.execution.plan.DefaultPlanExecutor$ExecutorWorker.executeNextNode(DefaultPlanExecutor.java:193)
        at org.gradle.execution.plan.DefaultPlanExecutor$ExecutorWorker.run(DefaultPlanExecutor.java:129)
        at org.gradle.internal.concurrent.ExecutorPolicy$CatchAndRecordFailures.onExecute(ExecutorPolicy.java:63)
        at org.gradle.internal.concurrent.ManagedExecutorImpl$1.run(ManagedExecutorImpl.java:46)
        at org.gradle.internal.concurrent.ThreadFactoryImpl$ManagedThreadRunnable.run(ThreadFactoryImpl.java:55)
Caused by: org.gradle.api.artifacts.PublishException: Could not publish configuration 'archives'
        at org.gradle.api.tasks.Upload.upload(Upload.java:68)
        at org.gradle.internal.reflect.JavaMethod.invoke(JavaMethod.java:103)
        at org.gradle.api.internal.project.taskfactory.StandardTaskAction.doExecute(StandardTaskAction.java:48)
        at org.gradle.api.internal.project.taskfactory.StandardTaskAction.execute(StandardTaskAction.java:41)
        at org.gradle.api.internal.project.taskfactory.StandardTaskAction.execute(StandardTaskAction.java:28)
        at org.gradle.api.internal.AbstractTask$TaskActionWrapper.execute(AbstractTask.java:705)
        at org.gradle.api.internal.AbstractTask$TaskActionWrapper.execute(AbstractTask.java:672)
        at org.gradle.api.internal.tasks.execution.ExecuteActionsTaskExecuter$4.run(ExecuteActionsTaskExecuter.java:338)
        at org.gradle.internal.operations.DefaultBuildOperationExecutor$RunnableBuildOperationWorker.execute(DefaultBuildOperationExecutor.java:402)
        at org.gradle.internal.operations.DefaultBuildOperationExecutor$RunnableBuildOperationWorker.execute(DefaultBuildOperationExecutor.java:394)
        at org.gradle.internal.operations.DefaultBuildOperationExecutor$1.execute(DefaultBuildOperationExecutor.java:165)
        at org.gradle.internal.operations.DefaultBuildOperationExecutor.execute(DefaultBuildOperationExecutor.java:250)
        at org.gradle.internal.operations.DefaultBuildOperationExecutor.execute(DefaultBuildOperationExecutor.java:158)
        at org.gradle.internal.operations.DefaultBuildOperationExecutor.run(DefaultBuildOperationExecutor.java:92)
        at org.gradle.internal.operations.DelegatingBuildOperationExecutor.run(DelegatingBuildOperationExecutor.java:31)
        at org.gradle.api.internal.tasks.execution.ExecuteActionsTaskExecuter.executeAction(ExecuteActionsTaskExecuter.java:327)
        at org.gradle.api.internal.tasks.execution.ExecuteActionsTaskExecuter.executeActions(ExecuteActionsTaskExecuter.java:312)
        at org.gradle.api.internal.tasks.execution.ExecuteActionsTaskExecuter.access$200(ExecuteActionsTaskExecuter.java:75)
        at org.gradle.api.internal.tasks.execution.ExecuteActionsTaskExecuter$TaskExecution.execute(ExecuteActionsTaskExecuter.java:158)
        at org.gradle.internal.execution.impl.steps.ExecuteStep.execute(ExecuteStep.java:46)
        at org.gradle.internal.execution.impl.steps.CancelExecutionStep.execute(CancelExecutionStep.java:34)
        at org.gradle.internal.execution.impl.steps.TimeoutStep.executeWithoutTimeout(TimeoutStep.java:69)
        at org.gradle.internal.execution.impl.steps.TimeoutStep.execute(TimeoutStep.java:49)
        at org.gradle.internal.execution.impl.steps.CatchExceptionStep.execute(CatchExceptionStep.java:34)
        at org.gradle.internal.execution.impl.steps.CreateOutputsStep.execute(CreateOutputsStep.java:49)
        at org.gradle.internal.execution.impl.steps.SnapshotOutputStep.execute(SnapshotOutputStep.java:42)
        at org.gradle.internal.execution.impl.steps.SnapshotOutputStep.execute(SnapshotOutputStep.java:28)
        at org.gradle.internal.execution.impl.steps.CacheStep.executeWithoutCache(CacheStep.java:133)
        at org.gradle.internal.execution.impl.steps.CacheStep.lambda$execute$5(CacheStep.java:83)
        at org.gradle.internal.execution.impl.steps.CacheStep.execute(CacheStep.java:82)
        at org.gradle.internal.execution.impl.steps.CacheStep.execute(CacheStep.java:37)
        at org.gradle.internal.execution.impl.steps.PrepareCachingStep.execute(PrepareCachingStep.java:33)
        at org.gradle.internal.execution.impl.steps.StoreSnapshotsStep.execute(StoreSnapshotsStep.java:38)
        at org.gradle.internal.execution.impl.steps.StoreSnapshotsStep.execute(StoreSnapshotsStep.java:23)
        at org.gradle.internal.execution.impl.steps.SkipUpToDateStep.executeBecause(SkipUpToDateStep.java:95)
        at org.gradle.internal.execution.impl.steps.SkipUpToDateStep.lambda$execute$0(SkipUpToDateStep.java:88)
        at org.gradle.internal.execution.impl.steps.SkipUpToDateStep.execute(SkipUpToDateStep.java:52)
        at org.gradle.internal.execution.impl.steps.SkipUpToDateStep.execute(SkipUpToDateStep.java:36)
        at org.gradle.internal.execution.impl.DefaultWorkExecutor.execute(DefaultWorkExecutor.java:34)
        at org.gradle.api.internal.tasks.execution.ExecuteActionsTaskExecuter.execute(ExecuteActionsTaskExecuter.java:109)
        ... 37 more
Caused by: org.gradle.api.UncheckedIOException: Could not write to file '/var/atlassian/bamboo-home/xml-data/build-dir/SMACK-NIGHTLY-JOB1/smack-android/build/poms/pom-default.xml'.
        at org.gradle.internal.IoActions$TextFileWriterIoAction.execute(IoActions.java:151)
        at org.gradle.internal.IoActions$TextFileWriterIoAction.execute(IoActions.java:127)
        at org.gradle.internal.IoActions.writeTextFile(IoActions.java:45)
        at org.gradle.api.publication.maven.internal.pom.DefaultMavenPom.writeTo(DefaultMavenPom.java:201)
        at org.gradle.api.publication.maven.internal.pom.DefaultMavenPom.writeTo(DefaultMavenPom.java:44)
        at org.gradle.api.publication.maven.internal.DefaultArtifactPom.writePom(DefaultArtifactPom.java:56)
        at org.gradle.api.publication.maven.internal.DefaultArtifactPomContainer.createDeployableFilesInfos(DefaultArtifactPomContainer.java:68)
        at org.gradle.api.publication.maven.internal.deployer.AbstractMavenResolver.publish(AbstractMavenResolver.java:121)
        at org.gradle.api.publication.maven.internal.deployer.AbstractMavenResolver.publish(AbstractMavenResolver.java:106)
        at org.gradle.api.publication.maven.internal.deployer.BaseMavenDeployer.publish(BaseMavenDeployer.java:36)
        at org.gradle.internal.component.external.ivypublish.DefaultArtifactPublisher.publish(DefaultArtifactPublisher.java:76)
        at org.gradle.api.internal.artifacts.ivyservice.IvyContextualArtifactPublisher$1.execute(IvyContextualArtifactPublisher.java:43)
        at org.gradle.api.internal.artifacts.ivyservice.IvyContextualArtifactPublisher$1.execute(IvyContextualArtifactPublisher.java:40)
        at org.gradle.internal.Transformers$4.transform(Transformers.java:133)
        at org.gradle.api.internal.artifacts.ivyservice.DefaultIvyContextManager.withIvy(DefaultIvyContextManager.java:63)
        at org.gradle.api.internal.artifacts.ivyservice.DefaultIvyContextManager.withIvy(DefaultIvyContextManager.java:41)
        at org.gradle.api.internal.artifacts.ivyservice.IvyContextualArtifactPublisher.publish(IvyContextualArtifactPublisher.java:40)
        at org.gradle.api.tasks.Upload.upload(Upload.java:66)
        ... 76 more
Caused by: org.gradle.api.InvalidUserDataException: The configuration to scope mapping is not unique. The following configurations have the same priority: [org.gradle.api.artifacts.maven.Conf2ScopeMapping@7e3f2a7e, org.gradle.api.artifacts.maven.Conf2ScopeMapping@4c251acb]
        at org.gradle.api.publication.maven.internal.pom.DefaultConf2ScopeMappingContainer.getMapping(DefaultConf2ScopeMappingContainer.java:41)
        at org.gradle.api.publication.maven.internal.pom.DefaultPomDependenciesConverter.createDependencyToScopeMap(DefaultPomDependenciesConverter.java:68)
        at org.gradle.api.publication.maven.internal.pom.DefaultPomDependenciesConverter.convert(DefaultPomDependenciesConverter.java:48)
        at org.gradle.api.publication.maven.internal.pom.DefaultMavenPom.getGeneratedDependencies(DefaultMavenPom.java:170)
        at org.gradle.api.publication.maven.internal.pom.DefaultMavenPom.getEffectivePom(DefaultMavenPom.java:176)
        at org.gradle.api.publication.maven.internal.pom.DefaultMavenPom.writeTo(DefaultMavenPom.java:193)
        at org.gradle.api.publication.maven.internal.pom.DefaultMavenPom$2.execute(DefaultMavenPom.java:203)
        at org.gradle.api.publication.maven.internal.pom.DefaultMavenPom$2.execute(DefaultMavenPom.java:201)
        at org.gradle.internal.IoActions$TextFileWriterIoAction.execute(IoActions.java:146)
        ... 93 more


* Get more help at https://help.gradle.org

BUILD FAILED in 3s