Nightly Distribution of the master branch

Build: #1679 failed Changes by Florian Schmaus

Stages & jobs

  1. Default Stage

  2. Deploy

Build result summary

Details

Completed
Duration
9 minutes
Labels
None
Revision
8f2eefaeb01eaff688bfa9b5fabe0c19342aae8c 8f2eefaeb01eaff688bfa9b5fabe0c19342aae8c
Total tests
735
Fixed in
#1682 (Manual run by Florian Schmaus)
No failed tests found, a possible compilation error occurred.

Tests

Responsible

Code commits

Author Commit Message Commit date
Florian Schmaus Florian Schmaus 8f2eefaeb01eaff688bfa9b5fabe0c19342aae8c 8f2eefaeb01eaff688bfa9b5fabe0c19342aae8c Fix whitespace errors in AbstractXMPPConnection
Florian Schmaus Florian Schmaus 9f0420be4f71aca2055fced3aca50a4f089dcee8 9f0420be4f71aca2055fced3aca50a4f089dcee8 Merge pull request #339 from bjalon/patch-5
Update muc.md
Florian Schmaus Florian Schmaus afcc0935efa08b53a9fe04c1e80ee658a9ca9508 afcc0935efa08b53a9fe04c1e80ee658a9ca9508 Merge pull request #336 from bjalon/patch-4
Update gettingstarted.md
Florian Schmaus Florian Schmaus 9dc24c2b1120b8e533d65f39c133c4f65f1d8e03 9dc24c2b1120b8e533d65f39c133c4f65f1d8e03 Merge pull request #335 from bjalon/patch-3
Update processing.md
Florian Schmaus Florian Schmaus d71ea55edc2edd654c1ef72c081272104e376266 d71ea55edc2edd654c1ef72c081272104e376266 Merge pull request #334 from bjalon/patch-2
Update providers.md

Jira issues

IssueDescriptionStatus
Unknown Issue TypeSMACK-718Could not obtain issue details from Jira

Error summary for Default Job

The job generated some errors, drill down into the full build log for more details.

/var/atlassian/bamboo-home/xml-data/build-dir/SMACK-NIGHTLY-JOB1/smack-omemo/src/main/java/org/jivesoftware/smackx/omemo/OmemoManager.java:351: warning: no description for @throws
     * @throws CryptoFailedException
       ^
/var/atlassian/bamboo-home/xml-data/build-dir/SMACK-NIGHTLY-JOB1/smack-omemo/src/main/java/org/jivesoftware/smackx/omemo/OmemoManager.java:352: warning: no description for @throws
     * @throws XMPPException.XMPPErrorException
       ^
/var/atlassian/bamboo-home/xml-data/build-dir/SMACK-NIGHTLY-JOB1/smack-omemo/src/main/java/org/jivesoftware/smackx/omemo/OmemoManager.java:353: warning: no description for @throws
     * @throws SmackException.NotConnectedException
       ^
/var/atlassian/bamboo-home/xml-data/build-dir/SMACK-NIGHTLY-JOB1/smack-omemo/src/main/java/org/jivesoftware/smackx/omemo/OmemoManager.java:354: warning: no description for @throws
     * @throws InterruptedException
       ^
/var/atlassian/bamboo-home/xml-data/build-dir/SMACK-NIGHTLY-JOB1/smack-omemo/src/main/java/org/jivesoftware/smackx/omemo/OmemoManager.java:355: warning: no description for @throws
     * @throws SmackException.NoResponseException
       ^
/var/atlassian/bamboo-home/xml-data/build-dir/SMACK-NIGHTLY-JOB1/smack-omemo/src/main/java/org/jivesoftware/smackx/omemo/OmemoManager.java:357: warning: no description for @throws
     * @throws SmackException.NotLoggedInException
       ^
/var/atlassian/bamboo-home/xml-data/build-dir/SMACK-NIGHTLY-JOB1/smack-omemo/src/main/java/org/jivesoftware/smackx/omemo/OmemoManager.java:358: warning: no description for @throws
     * @throws IOException
       ^
/var/atlassian/bamboo-home/xml-data/build-dir/SMACK-NIGHTLY-JOB1/smack-omemo/src/main/java/org/jivesoftware/smackx/omemo/OmemoManager.java:390: warning: no description for @throws
     * @throws IOException
       ^
/var/atlassian/bamboo-home/xml-data/build-dir/SMACK-NIGHTLY-JOB1/smack-omemo/src/main/java/org/jivesoftware/smackx/omemo/OmemoManager.java:405: warning: no description for @throws
     * @throws IOException
       ^
/var/atlassian/bamboo-home/xml-data/build-dir/SMACK-NIGHTLY-JOB1/smack-omemo/src/main/java/org/jivesoftware/smackx/omemo/OmemoManager.java:449: warning: no description for @return
     * @return
       ^
/var/atlassian/bamboo-home/xml-data/build-dir/SMACK-NIGHTLY-JOB1/smack-omemo/src/main/java/org/jivesoftware/smackx/omemo/OmemoManager.java:465: warning: no description for @return
     * @return
       ^
/var/atlassian/bamboo-home/xml-data/build-dir/SMACK-NIGHTLY-JOB1/smack-omemo/src/main/java/org/jivesoftware/smackx/omemo/OmemoManager.java:483: warning: no description for @throws
     * @throws SmackException.NotLoggedInException
       ^
/var/atlassian/bamboo-home/xml-data/build-dir/SMACK-NIGHTLY-JOB1/smack-omemo/src/main/java/org/jivesoftware/smackx/omemo/OmemoManager.java:484: warning: no description for @throws
     * @throws InterruptedException
       ^
/var/atlassian/bamboo-home/xml-data/build-dir/SMACK-NIGHTLY-JOB1/smack-omemo/src/main/java/org/jivesoftware/smackx/omemo/OmemoManager.java:485: warning: no description for @throws
     * @throws SmackException.NoResponseException
       ^
/var/atlassian/bamboo-home/xml-data/build-dir/SMACK-NIGHTLY-JOB1/smack-omemo/src/main/java/org/jivesoftware/smackx/omemo/OmemoManager.java:486: warning: no description for @throws
     * @throws NoSuchAlgorithmException
       ^
/var/atlassian/bamboo-home/xml-data/build-dir/SMACK-NIGHTLY-JOB1/smack-omemo/src/main/java/org/jivesoftware/smackx/omemo/OmemoManager.java:487: warning: no description for @throws
     * @throws SmackException.NotConnectedException
       ^
Found 0 errors
/var/atlassian/bamboo-home/xml-data/build-dir/SMACK-NIGHTLY-JOB1/smack-tcp/src/main/java/org/jivesoftware/smack/tcp/XMPPTCPConnection.java:811: warning: no description for @throws
     * @throws SmackException
       ^
/var/atlassian/bamboo-home/xml-data/build-dir/SMACK-NIGHTLY-JOB1/smack-tcp/src/main/java/org/jivesoftware/smack/tcp/XMPPTCPConnection.java:812: warning: no description for @throws
     * @throws IOException
       ^
/var/atlassian/bamboo-home/xml-data/build-dir/SMACK-NIGHTLY-JOB1/smack-tcp/src/main/java/org/jivesoftware/smack/tcp/XMPPTCPConnection.java:813: warning: no description for @throws
     * @throws InterruptedException
       ^
/var/atlassian/bamboo-home/xml-data/build-dir/SMACK-NIGHTLY-JOB1/smack-tcp/src/main/java/org/jivesoftware/smack/tcp/XMPPTCPConnection.java:835: warning: no description for @param
     * @param writer
       ^
/var/atlassian/bamboo-home/xml-data/build-dir/SMACK-NIGHTLY-JOB1/smack-tcp/src/main/java/org/jivesoftware/smack/tcp/XMPPTCPConnection.java:1573: warning: no description for @throws
     * @throws InterruptedException
       ^
/var/atlassian/bamboo-home/xml-data/build-dir/SMACK-NIGHTLY-JOB1/smack-tcp/src/main/java/org/jivesoftware/smack/tcp/XMPPTCPConnection.java:1596: warning: no description for @throws
     * @throws InterruptedException
       ^
/var/atlassian/bamboo-home/xml-data/build-dir/SMACK-NIGHTLY-JOB1/smack-tcp/src/main/java/org/jivesoftware/smack/tcp/XMPPTCPConnection.java:1873: warning: no description for @param
     * @param defaultBundleAndDeferCallback
       ^
/var/atlassian/bamboo-home/xml-data/build-dir/SMACK-NIGHTLY-JOB1/smack-tcp/src/main/java/org/jivesoftware/smack/tcp/XMPPTCPConnection.java:317: warning: no description for @throws
     * @throws XmppStringprepException
       ^
/var/atlassian/bamboo-home/xml-data/build-dir/SMACK-NIGHTLY-JOB1/smack-tcp/src/main/java/org/jivesoftware/smack/tcp/XMPPTCPConnection.java:330: warning: no description for @param
     * @param username
       ^
/var/atlassian/bamboo-home/xml-data/build-dir/SMACK-NIGHTLY-JOB1/smack-tcp/src/main/java/org/jivesoftware/smack/tcp/XMPPTCPConnection.java:331: warning: no description for @param
     * @param password
       ^
/var/atlassian/bamboo-home/xml-data/build-dir/SMACK-NIGHTLY-JOB1/smack-tcp/src/main/java/org/jivesoftware/smack/tcp/XMPPTCPConnection.java:332: warning: no description for @param
     * @param serviceName
       ^
/var/atlassian/bamboo-home/xml-data/build-dir/SMACK-NIGHTLY-JOB1/smack-tcp/src/main/java/org/jivesoftware/smack/tcp/XMPPTCPConnection.java:333: warning: no description for @throws
     * @throws XmppStringprepException
       ^
/var/atlassian/bamboo-home/xml-data/build-dir/SMACK-NIGHTLY-JOB1/smack-tcp/src/main/java/org/jivesoftware/smack/tcp/XMPPTCPConnection.java:1240: warning: no description for @throws
         * @throws NotConnectedException
           ^
/var/atlassian/bamboo-home/xml-data/build-dir/SMACK-NIGHTLY-JOB1/smack-tcp/src/main/java/org/jivesoftware/smack/tcp/XMPPTCPConnection.java:1241: warning: no description for @throws
         * @throws InterruptedException
           ^
/var/atlassian/bamboo-home/xml-data/build-dir/SMACK-NIGHTLY-JOB1/smack-tcp/src/main/java/org/jivesoftware/smack/sm/SMUtils.java:33: warning: no description for @param
     * @param height
       ^
/var/atlassian/bamboo-home/xml-data/build-dir/SMACK-NIGHTLY-JOB1/smack-tcp/src/main/java/org/jivesoftware/smack/sm/SMUtils.java:45: warning: no description for @param
     * @param reportedHandledCount
       ^
/var/atlassian/bamboo-home/xml-data/build-dir/SMACK-NIGHTLY-JOB1/smack-tcp/src/main/java/org/jivesoftware/smack/sm/SMUtils.java:46: warning: no description for @param
     * @param lastKnownHandledCount
       ^
        at org.gradle.api.internal.AbstractTask$TaskActionWrapper.execute(AbstractTask.java:669)
        at org.gradle.api.internal.tasks.execution.ExecuteActionsTaskExecuter$5.run(ExecuteActionsTaskExecuter.java:401)
        at org.gradle.internal.operations.DefaultBuildOperationExecutor$RunnableBuildOperationWorker.execute(DefaultBuildOperationExecutor.java:402)
        at org.gradle.internal.operations.DefaultBuildOperationExecutor$RunnableBuildOperationWorker.execute(DefaultBuildOperationExecutor.java:394)
        at org.gradle.internal.operations.DefaultBuildOperationExecutor$1.execute(DefaultBuildOperationExecutor.java:165)
        at org.gradle.internal.operations.DefaultBuildOperationExecutor.execute(DefaultBuildOperationExecutor.java:250)
        at org.gradle.internal.operations.DefaultBuildOperationExecutor.execute(DefaultBuildOperationExecutor.java:158)
        at org.gradle.internal.operations.DefaultBuildOperationExecutor.run(DefaultBuildOperationExecutor.java:92)
        at org.gradle.internal.operations.DelegatingBuildOperationExecutor.run(DelegatingBuildOperationExecutor.java:31)
        at org.gradle.api.internal.tasks.execution.ExecuteActionsTaskExecuter.executeAction(ExecuteActionsTaskExecuter.java:390)
        at org.gradle.api.internal.tasks.execution.ExecuteActionsTaskExecuter.executeActions(ExecuteActionsTaskExecuter.java:373)
        at org.gradle.api.internal.tasks.execution.ExecuteActionsTaskExecuter.access$200(ExecuteActionsTaskExecuter.java:79)
        at org.gradle.api.internal.tasks.execution.ExecuteActionsTaskExecuter$TaskExecution.execute(ExecuteActionsTaskExecuter.java:210)
        at org.gradle.internal.execution.steps.ExecuteStep.lambda$execute$1(ExecuteStep.java:33)
        at org.gradle.internal.execution.steps.ExecuteStep.execute(ExecuteStep.java:33)
        at org.gradle.internal.execution.steps.ExecuteStep.execute(ExecuteStep.java:26)
        at org.gradle.internal.execution.steps.CleanupOutputsStep.execute(CleanupOutputsStep.java:58)
        at org.gradle.internal.execution.steps.CleanupOutputsStep.execute(CleanupOutputsStep.java:35)
        at org.gradle.internal.execution.steps.ResolveInputChangesStep.execute(ResolveInputChangesStep.java:48)
        at org.gradle.internal.execution.steps.ResolveInputChangesStep.execute(ResolveInputChangesStep.java:33)
        at org.gradle.internal.execution.steps.CancelExecutionStep.execute(CancelExecutionStep.java:39)
        at org.gradle.internal.execution.steps.TimeoutStep.executeWithoutTimeout(TimeoutStep.java:73)
        at org.gradle.internal.execution.steps.TimeoutStep.execute(TimeoutStep.java:54)
        at org.gradle.internal.execution.steps.CatchExceptionStep.execute(CatchExceptionStep.java:35)
        at org.gradle.internal.execution.steps.CreateOutputsStep.execute(CreateOutputsStep.java:51)
        at org.gradle.internal.execution.steps.SnapshotOutputsStep.execute(SnapshotOutputsStep.java:45)
        at org.gradle.internal.execution.steps.SnapshotOutputsStep.execute(SnapshotOutputsStep.java:31)
        at org.gradle.internal.execution.steps.CacheStep.executeWithoutCache(CacheStep.java:201)
        at org.gradle.internal.execution.steps.CacheStep.execute(CacheStep.java:70)
        at org.gradle.internal.execution.steps.CacheStep.execute(CacheStep.java:45)
        at org.gradle.internal.execution.steps.BroadcastChangingOutputsStep.execute(BroadcastChangingOutputsStep.java:49)
        at org.gradle.internal.execution.steps.StoreSnapshotsStep.execute(StoreSnapshotsStep.java:43)
        at org.gradle.internal.execution.steps.StoreSnapshotsStep.execute(StoreSnapshotsStep.java:32)
        at org.gradle.internal.execution.steps.RecordOutputsStep.execute(RecordOutputsStep.java:38)
        at org.gradle.internal.execution.steps.RecordOutputsStep.execute(RecordOutputsStep.java:24)
        at org.gradle.internal.execution.steps.SkipUpToDateStep.executeBecause(SkipUpToDateStep.java:96)
        at org.gradle.internal.execution.steps.SkipUpToDateStep.lambda$execute$0(SkipUpToDateStep.java:89)
        at org.gradle.internal.execution.steps.SkipUpToDateStep.execute(SkipUpToDateStep.java:54)
        at org.gradle.internal.execution.steps.SkipUpToDateStep.execute(SkipUpToDateStep.java:38)
        at org.gradle.internal.execution.steps.ResolveChangesStep.execute(ResolveChangesStep.java:77)
        at org.gradle.internal.execution.steps.ResolveChangesStep.execute(ResolveChangesStep.java:37)
        at org.gradle.internal.execution.steps.legacy.MarkSnapshottingInputsFinishedStep.execute(MarkSnapshottingInputsFinishedStep.java:36)
        at org.gradle.internal.execution.steps.legacy.MarkSnapshottingInputsFinishedStep.execute(MarkSnapshottingInputsFinishedStep.java:26)
        at org.gradle.internal.execution.steps.ResolveCachingStateStep.execute(ResolveCachingStateStep.java:90)
        at org.gradle.internal.execution.steps.ResolveCachingStateStep.execute(ResolveCachingStateStep.java:48)
        at org.gradle.internal.execution.impl.DefaultWorkExecutor.execute(DefaultWorkExecutor.java:33)
        at org.gradle.api.internal.tasks.execution.ExecuteActionsTaskExecuter.execute(ExecuteActionsTaskExecuter.java:117)
        ... 35 more
Caused by: org.gradle.api.GradleException: Could not deploy to remote repository | Failed to deploy artifacts: Could not transfer artifact org.igniterealtime.smack:smack-integration-test:zip:4.4.0-alpha3-20190823.010940-10 from/to remote (file:/mnt/maven/): PUT request to: org/igniterealtime/smack/smack-integration-test/4.4.0-alpha3-SNAPSHOT/smack-integration-test-4.4.0-alpha3-20190823.010940-10.zip in remote failed
        at org.gradle.api.publication.maven.internal.action.AbstractMavenPublishAction.publish(AbstractMavenPublishAction.java:106)
        at org.gradle.api.publication.maven.internal.action.MavenDeployAction.publish(MavenDeployAction.java:36)
        at org.gradle.api.publication.maven.internal.deployer.AbstractMavenResolver.execute(AbstractMavenResolver.java:134)
        at org.gradle.api.publication.maven.internal.deployer.AbstractMavenResolver.publish(AbstractMavenResolver.java:127)
        at org.gradle.api.publication.maven.internal.deployer.AbstractMavenResolver.publish(AbstractMavenResolver.java:106)
        at org.gradle.api.publication.maven.internal.deployer.BaseMavenDeployer.publish(BaseMavenDeployer.java:36)
        at org.gradle.internal.component.external.ivypublish.DefaultArtifactPublisher.publish(DefaultArtifactPublisher.java:76)
        at org.gradle.api.internal.artifacts.ivyservice.IvyContextualArtifactPublisher$1.execute(IvyContextualArtifactPublisher.java:43)
        at org.gradle.api.internal.artifacts.ivyservice.IvyContextualArtifactPublisher$1.execute(IvyContextualArtifactPublisher.java:40)
        at org.gradle.internal.Transformers$4.transform(Transformers.java:133)
        at org.gradle.api.internal.artifacts.ivyservice.DefaultIvyContextManager.withIvy(DefaultIvyContextManager.java:63)
        at org.gradle.api.internal.artifacts.ivyservice.DefaultIvyContextManager.withIvy(DefaultIvyContextManager.java:41)
        at org.gradle.api.internal.artifacts.ivyservice.IvyContextualArtifactPublisher.publish(IvyContextualArtifactPublisher.java:40)
        at org.gradle.api.tasks.Upload.upload(Upload.java:66)
        ... 87 more
Caused by: org.sonatype.aether.deployment.DeploymentException: Could not deploy to remote repository | Failed to deploy artifacts: Could not transfer artifact org.igniterealtime.smack:smack-integration-test:zip:4.4.0-alpha3-20190823.010940-10 from/to remote (file:/mnt/maven/): PUT request to: org/igniterealtime/smack/smack-integration-test/4.4.0-alpha3-SNAPSHOT/smack-integration-test-4.4.0-alpha3-20190823.010940-10.zip in remote failed
        at org.gradle.api.publication.maven.internal.action.DefaultMavenDeployRetrier.deployWithRetry(DefaultMavenDeployRetrier.java:61)
        at org.gradle.api.publication.maven.internal.action.MavenDeployAction.publishArtifacts(MavenDeployAction.java:87)
        at org.gradle.api.publication.maven.internal.action.AbstractMavenPublishAction.publish(AbstractMavenPublishAction.java:104)
        ... 100 more
Caused by: org.sonatype.aether.deployment.DeploymentException: Failed to deploy artifacts: Could not transfer artifact org.igniterealtime.smack:smack-integration-test:zip:4.4.0-alpha3-20190823.010940-10 from/to remote (file:/mnt/maven/): PUT request to: org/igniterealtime/smack/smack-integration-test/4.4.0-alpha3-SNAPSHOT/smack-integration-test-4.4.0-alpha3-20190823.010940-10.zip in remote failed
        at org.sonatype.aether.impl.internal.DefaultDeployer.deploy(DefaultDeployer.java:280)
        at org.sonatype.aether.impl.internal.DefaultDeployer.deploy(DefaultDeployer.java:211)
        at org.sonatype.aether.impl.internal.DefaultRepositorySystem.deploy(DefaultRepositorySystem.java:443)
        at org.gradle.api.publication.maven.internal.action.MavenDeployAction.lambda$publishArtifacts$0(MavenDeployAction.java:79)
        at org.gradle.api.publication.maven.internal.action.DefaultMavenDeployRetrier.deployWithRetry(DefaultMavenDeployRetrier.java:52)
        ... 102 more
Caused by: org.sonatype.aether.transfer.ArtifactTransferException: Could not transfer artifact org.igniterealtime.smack:smack-integration-test:zip:4.4.0-alpha3-20190823.010940-10 from/to remote (file:/mnt/maven/): PUT request to: org/igniterealtime/smack/smack-integration-test/4.4.0-alpha3-SNAPSHOT/smack-integration-test-4.4.0-alpha3-20190823.010940-10.zip in remote failed
        at org.sonatype.aether.connector.wagon.WagonRepositoryConnector$4.wrap(WagonRepositoryConnector.java:951)
        at org.sonatype.aether.connector.wagon.WagonRepositoryConnector$4.wrap(WagonRepositoryConnector.java:941)
        at org.sonatype.aether.connector.wagon.WagonRepositoryConnector$PutTask.run(WagonRepositoryConnector.java:837)
        at org.sonatype.aether.connector.wagon.WagonRepositoryConnector.put(WagonRepositoryConnector.java:467)
        at org.sonatype.aether.impl.internal.DefaultDeployer.deploy(DefaultDeployer.java:274)
        ... 106 more
Caused by: org.apache.maven.wagon.TransferFailedException: PUT request to: org/igniterealtime/smack/smack-integration-test/4.4.0-alpha3-SNAPSHOT/smack-integration-test-4.4.0-alpha3-20190823.010940-10.zip in remote failed
        at org.apache.maven.wagon.AbstractWagon.putTransfer(AbstractWagon.java:489)
        at org.apache.maven.wagon.AbstractWagon.transfer(AbstractWagon.java:442)
        at org.apache.maven.wagon.AbstractWagon.putTransfer(AbstractWagon.java:416)
        at org.apache.maven.wagon.StreamWagon.put(StreamWagon.java:173)
        at org.sonatype.aether.connector.wagon.WagonRepositoryConnector$PutTask.run(WagonRepositoryConnector.java:811)
        ... 108 more
Caused by: java.io.IOException: No space left on device
        at org.apache.maven.wagon.LazyFileOutputStream.write(LazyFileOutputStream.java:129)
        at org.apache.maven.wagon.AbstractWagon.transfer(AbstractWagon.java:581)
        at org.apache.maven.wagon.AbstractWagon.putTransfer(AbstractWagon.java:470)
        ... 112 more


* Get more help at https://help.gradle.org

BUILD FAILED in 7s