Nightly Distribution of the master branch

Build: #1680 failed Changes by Florian Schmaus

Stages & jobs

  1. Default Stage

  2. Deploy

Build result summary

Details

Completed
Duration
5 minutes
Labels
None
Revision
944dd71976005ddd91c6d972caa5b3a15ee2f410 944dd71976005ddd91c6d972caa5b3a15ee2f410
Total tests
735
Failing since
#1679 (Changes by Florian Schmaus)
Fixed in
#1682 (Manual run by Florian Schmaus)
No failed tests found, a possible compilation error occurred.

Tests

Responsible

Code commits

Author Commit Message Commit date
Florian Schmaus Florian Schmaus 944dd71976005ddd91c6d972caa5b3a15ee2f410 944dd71976005ddd91c6d972caa5b3a15ee2f410 Merge pull request #341 from vanitasvitae/prekeyid
OMEMO: Allow prekey ID 0
vanitasvitae vanitasvitae a160358d5d32e9049cf59683f3063b7c1b35135c m a160358d5d32e9049cf59683f3063b7c1b35135c OMEMO: Allow prekey ID 0

Error summary for Default Job

The job generated some errors, drill down into the full build log for more details.

/var/atlassian/bamboo-home/xml-data/build-dir/SMACK-NIGHTLY-JOB1/smack-omemo/src/main/java/org/jivesoftware/smackx/omemo/OmemoManager.java:351: warning: no description for @throws
     * @throws CryptoFailedException
       ^
/var/atlassian/bamboo-home/xml-data/build-dir/SMACK-NIGHTLY-JOB1/smack-omemo/src/main/java/org/jivesoftware/smackx/omemo/OmemoManager.java:352: warning: no description for @throws
     * @throws XMPPException.XMPPErrorException
       ^
/var/atlassian/bamboo-home/xml-data/build-dir/SMACK-NIGHTLY-JOB1/smack-omemo/src/main/java/org/jivesoftware/smackx/omemo/OmemoManager.java:353: warning: no description for @throws
     * @throws SmackException.NotConnectedException
       ^
/var/atlassian/bamboo-home/xml-data/build-dir/SMACK-NIGHTLY-JOB1/smack-omemo/src/main/java/org/jivesoftware/smackx/omemo/OmemoManager.java:354: warning: no description for @throws
     * @throws InterruptedException
       ^
/var/atlassian/bamboo-home/xml-data/build-dir/SMACK-NIGHTLY-JOB1/smack-omemo/src/main/java/org/jivesoftware/smackx/omemo/OmemoManager.java:355: warning: no description for @throws
     * @throws SmackException.NoResponseException
       ^
/var/atlassian/bamboo-home/xml-data/build-dir/SMACK-NIGHTLY-JOB1/smack-omemo/src/main/java/org/jivesoftware/smackx/omemo/OmemoManager.java:357: warning: no description for @throws
     * @throws SmackException.NotLoggedInException
       ^
/var/atlassian/bamboo-home/xml-data/build-dir/SMACK-NIGHTLY-JOB1/smack-omemo/src/main/java/org/jivesoftware/smackx/omemo/OmemoManager.java:358: warning: no description for @throws
     * @throws IOException
       ^
/var/atlassian/bamboo-home/xml-data/build-dir/SMACK-NIGHTLY-JOB1/smack-omemo/src/main/java/org/jivesoftware/smackx/omemo/OmemoManager.java:390: warning: no description for @throws
     * @throws IOException
       ^
/var/atlassian/bamboo-home/xml-data/build-dir/SMACK-NIGHTLY-JOB1/smack-omemo/src/main/java/org/jivesoftware/smackx/omemo/OmemoManager.java:405: warning: no description for @throws
     * @throws IOException
       ^
/var/atlassian/bamboo-home/xml-data/build-dir/SMACK-NIGHTLY-JOB1/smack-omemo/src/main/java/org/jivesoftware/smackx/omemo/OmemoManager.java:449: warning: no description for @return
     * @return
       ^
/var/atlassian/bamboo-home/xml-data/build-dir/SMACK-NIGHTLY-JOB1/smack-omemo/src/main/java/org/jivesoftware/smackx/omemo/OmemoManager.java:465: warning: no description for @return
     * @return
       ^
/var/atlassian/bamboo-home/xml-data/build-dir/SMACK-NIGHTLY-JOB1/smack-omemo/src/main/java/org/jivesoftware/smackx/omemo/OmemoManager.java:483: warning: no description for @throws
     * @throws SmackException.NotLoggedInException
       ^
/var/atlassian/bamboo-home/xml-data/build-dir/SMACK-NIGHTLY-JOB1/smack-omemo/src/main/java/org/jivesoftware/smackx/omemo/OmemoManager.java:484: warning: no description for @throws
     * @throws InterruptedException
       ^
/var/atlassian/bamboo-home/xml-data/build-dir/SMACK-NIGHTLY-JOB1/smack-omemo/src/main/java/org/jivesoftware/smackx/omemo/OmemoManager.java:485: warning: no description for @throws
     * @throws SmackException.NoResponseException
       ^
/var/atlassian/bamboo-home/xml-data/build-dir/SMACK-NIGHTLY-JOB1/smack-omemo/src/main/java/org/jivesoftware/smackx/omemo/OmemoManager.java:486: warning: no description for @throws
     * @throws NoSuchAlgorithmException
       ^
/var/atlassian/bamboo-home/xml-data/build-dir/SMACK-NIGHTLY-JOB1/smack-omemo/src/main/java/org/jivesoftware/smackx/omemo/OmemoManager.java:487: warning: no description for @throws
     * @throws SmackException.NotConnectedException
       ^
Found 0 errors
/var/atlassian/bamboo-home/xml-data/build-dir/SMACK-NIGHTLY-JOB1/smack-tcp/src/main/java/org/jivesoftware/smack/tcp/XMPPTCPConnection.java:811: warning: no description for @throws
     * @throws SmackException
       ^
/var/atlassian/bamboo-home/xml-data/build-dir/SMACK-NIGHTLY-JOB1/smack-tcp/src/main/java/org/jivesoftware/smack/tcp/XMPPTCPConnection.java:812: warning: no description for @throws
     * @throws IOException
       ^
/var/atlassian/bamboo-home/xml-data/build-dir/SMACK-NIGHTLY-JOB1/smack-tcp/src/main/java/org/jivesoftware/smack/tcp/XMPPTCPConnection.java:813: warning: no description for @throws
     * @throws InterruptedException
       ^
/var/atlassian/bamboo-home/xml-data/build-dir/SMACK-NIGHTLY-JOB1/smack-tcp/src/main/java/org/jivesoftware/smack/tcp/XMPPTCPConnection.java:835: warning: no description for @param
     * @param writer
       ^
/var/atlassian/bamboo-home/xml-data/build-dir/SMACK-NIGHTLY-JOB1/smack-tcp/src/main/java/org/jivesoftware/smack/tcp/XMPPTCPConnection.java:1573: warning: no description for @throws
     * @throws InterruptedException
       ^
/var/atlassian/bamboo-home/xml-data/build-dir/SMACK-NIGHTLY-JOB1/smack-tcp/src/main/java/org/jivesoftware/smack/tcp/XMPPTCPConnection.java:1596: warning: no description for @throws
     * @throws InterruptedException
       ^
/var/atlassian/bamboo-home/xml-data/build-dir/SMACK-NIGHTLY-JOB1/smack-tcp/src/main/java/org/jivesoftware/smack/tcp/XMPPTCPConnection.java:1873: warning: no description for @param
     * @param defaultBundleAndDeferCallback
       ^
/var/atlassian/bamboo-home/xml-data/build-dir/SMACK-NIGHTLY-JOB1/smack-tcp/src/main/java/org/jivesoftware/smack/tcp/XMPPTCPConnection.java:317: warning: no description for @throws
     * @throws XmppStringprepException
       ^
/var/atlassian/bamboo-home/xml-data/build-dir/SMACK-NIGHTLY-JOB1/smack-tcp/src/main/java/org/jivesoftware/smack/tcp/XMPPTCPConnection.java:330: warning: no description for @param
     * @param username
       ^
/var/atlassian/bamboo-home/xml-data/build-dir/SMACK-NIGHTLY-JOB1/smack-tcp/src/main/java/org/jivesoftware/smack/tcp/XMPPTCPConnection.java:331: warning: no description for @param
     * @param password
       ^
/var/atlassian/bamboo-home/xml-data/build-dir/SMACK-NIGHTLY-JOB1/smack-tcp/src/main/java/org/jivesoftware/smack/tcp/XMPPTCPConnection.java:332: warning: no description for @param
     * @param serviceName
       ^
/var/atlassian/bamboo-home/xml-data/build-dir/SMACK-NIGHTLY-JOB1/smack-tcp/src/main/java/org/jivesoftware/smack/tcp/XMPPTCPConnection.java:333: warning: no description for @throws
     * @throws XmppStringprepException
       ^
/var/atlassian/bamboo-home/xml-data/build-dir/SMACK-NIGHTLY-JOB1/smack-tcp/src/main/java/org/jivesoftware/smack/tcp/XMPPTCPConnection.java:1240: warning: no description for @throws
         * @throws NotConnectedException
           ^
/var/atlassian/bamboo-home/xml-data/build-dir/SMACK-NIGHTLY-JOB1/smack-tcp/src/main/java/org/jivesoftware/smack/tcp/XMPPTCPConnection.java:1241: warning: no description for @throws
         * @throws InterruptedException
           ^
/var/atlassian/bamboo-home/xml-data/build-dir/SMACK-NIGHTLY-JOB1/smack-tcp/src/main/java/org/jivesoftware/smack/sm/SMUtils.java:33: warning: no description for @param
     * @param height
       ^
/var/atlassian/bamboo-home/xml-data/build-dir/SMACK-NIGHTLY-JOB1/smack-tcp/src/main/java/org/jivesoftware/smack/sm/SMUtils.java:45: warning: no description for @param
     * @param reportedHandledCount
       ^
/var/atlassian/bamboo-home/xml-data/build-dir/SMACK-NIGHTLY-JOB1/smack-tcp/src/main/java/org/jivesoftware/smack/sm/SMUtils.java:46: warning: no description for @param
     * @param lastKnownHandledCount
       ^
        at org.gradle.api.internal.AbstractTask$TaskActionWrapper.execute(AbstractTask.java:669)
        at org.gradle.api.internal.tasks.execution.ExecuteActionsTaskExecuter$5.run(ExecuteActionsTaskExecuter.java:401)
        at org.gradle.internal.operations.DefaultBuildOperationExecutor$RunnableBuildOperationWorker.execute(DefaultBuildOperationExecutor.java:402)
        at org.gradle.internal.operations.DefaultBuildOperationExecutor$RunnableBuildOperationWorker.execute(DefaultBuildOperationExecutor.java:394)
        at org.gradle.internal.operations.DefaultBuildOperationExecutor$1.execute(DefaultBuildOperationExecutor.java:165)
        at org.gradle.internal.operations.DefaultBuildOperationExecutor.execute(DefaultBuildOperationExecutor.java:250)
        at org.gradle.internal.operations.DefaultBuildOperationExecutor.execute(DefaultBuildOperationExecutor.java:158)
        at org.gradle.internal.operations.DefaultBuildOperationExecutor.run(DefaultBuildOperationExecutor.java:92)
        at org.gradle.internal.operations.DelegatingBuildOperationExecutor.run(DelegatingBuildOperationExecutor.java:31)
        at org.gradle.api.internal.tasks.execution.ExecuteActionsTaskExecuter.executeAction(ExecuteActionsTaskExecuter.java:390)
        at org.gradle.api.internal.tasks.execution.ExecuteActionsTaskExecuter.executeActions(ExecuteActionsTaskExecuter.java:373)
        at org.gradle.api.internal.tasks.execution.ExecuteActionsTaskExecuter.access$200(ExecuteActionsTaskExecuter.java:79)
        at org.gradle.api.internal.tasks.execution.ExecuteActionsTaskExecuter$TaskExecution.execute(ExecuteActionsTaskExecuter.java:210)
        at org.gradle.internal.execution.steps.ExecuteStep.lambda$execute$1(ExecuteStep.java:33)
        at org.gradle.internal.execution.steps.ExecuteStep.execute(ExecuteStep.java:33)
        at org.gradle.internal.execution.steps.ExecuteStep.execute(ExecuteStep.java:26)
        at org.gradle.internal.execution.steps.CleanupOutputsStep.execute(CleanupOutputsStep.java:58)
        at org.gradle.internal.execution.steps.CleanupOutputsStep.execute(CleanupOutputsStep.java:35)
        at org.gradle.internal.execution.steps.ResolveInputChangesStep.execute(ResolveInputChangesStep.java:48)
        at org.gradle.internal.execution.steps.ResolveInputChangesStep.execute(ResolveInputChangesStep.java:33)
        at org.gradle.internal.execution.steps.CancelExecutionStep.execute(CancelExecutionStep.java:39)
        at org.gradle.internal.execution.steps.TimeoutStep.executeWithoutTimeout(TimeoutStep.java:73)
        at org.gradle.internal.execution.steps.TimeoutStep.execute(TimeoutStep.java:54)
        at org.gradle.internal.execution.steps.CatchExceptionStep.execute(CatchExceptionStep.java:35)
        at org.gradle.internal.execution.steps.CreateOutputsStep.execute(CreateOutputsStep.java:51)
        at org.gradle.internal.execution.steps.SnapshotOutputsStep.execute(SnapshotOutputsStep.java:45)
        at org.gradle.internal.execution.steps.SnapshotOutputsStep.execute(SnapshotOutputsStep.java:31)
        at org.gradle.internal.execution.steps.CacheStep.executeWithoutCache(CacheStep.java:201)
        at org.gradle.internal.execution.steps.CacheStep.execute(CacheStep.java:70)
        at org.gradle.internal.execution.steps.CacheStep.execute(CacheStep.java:45)
        at org.gradle.internal.execution.steps.BroadcastChangingOutputsStep.execute(BroadcastChangingOutputsStep.java:49)
        at org.gradle.internal.execution.steps.StoreSnapshotsStep.execute(StoreSnapshotsStep.java:43)
        at org.gradle.internal.execution.steps.StoreSnapshotsStep.execute(StoreSnapshotsStep.java:32)
        at org.gradle.internal.execution.steps.RecordOutputsStep.execute(RecordOutputsStep.java:38)
        at org.gradle.internal.execution.steps.RecordOutputsStep.execute(RecordOutputsStep.java:24)
        at org.gradle.internal.execution.steps.SkipUpToDateStep.executeBecause(SkipUpToDateStep.java:96)
        at org.gradle.internal.execution.steps.SkipUpToDateStep.lambda$execute$0(SkipUpToDateStep.java:89)
        at org.gradle.internal.execution.steps.SkipUpToDateStep.execute(SkipUpToDateStep.java:54)
        at org.gradle.internal.execution.steps.SkipUpToDateStep.execute(SkipUpToDateStep.java:38)
        at org.gradle.internal.execution.steps.ResolveChangesStep.execute(ResolveChangesStep.java:77)
        at org.gradle.internal.execution.steps.ResolveChangesStep.execute(ResolveChangesStep.java:37)
        at org.gradle.internal.execution.steps.legacy.MarkSnapshottingInputsFinishedStep.execute(MarkSnapshottingInputsFinishedStep.java:36)
        at org.gradle.internal.execution.steps.legacy.MarkSnapshottingInputsFinishedStep.execute(MarkSnapshottingInputsFinishedStep.java:26)
        at org.gradle.internal.execution.steps.ResolveCachingStateStep.execute(ResolveCachingStateStep.java:90)
        at org.gradle.internal.execution.steps.ResolveCachingStateStep.execute(ResolveCachingStateStep.java:48)
        at org.gradle.internal.execution.impl.DefaultWorkExecutor.execute(DefaultWorkExecutor.java:33)
        at org.gradle.api.internal.tasks.execution.ExecuteActionsTaskExecuter.execute(ExecuteActionsTaskExecuter.java:117)
        ... 129 more
Caused by: org.gradle.api.GradleException: Could not deploy to remote repository | Failed to retrieve remote metadata org.igniterealtime.smack:smack-android:4.4.0-alpha3-SNAPSHOT/maven-metadata.xml: Could not transfer metadata org.igniterealtime.smack:smack-android:4.4.0-alpha3-SNAPSHOT/maven-metadata.xml from/to remote (file:/mnt/maven/): GET request of: org/igniterealtime/smack/smack-android/4.4.0-alpha3-SNAPSHOT/maven-metadata.xml from remote failed
        at org.gradle.api.publication.maven.internal.action.AbstractMavenPublishAction.publish(AbstractMavenPublishAction.java:106)
        at org.gradle.api.publication.maven.internal.action.MavenDeployAction.publish(MavenDeployAction.java:36)
        at org.gradle.api.publication.maven.internal.deployer.AbstractMavenResolver.execute(AbstractMavenResolver.java:134)
        at org.gradle.api.publication.maven.internal.deployer.AbstractMavenResolver.publish(AbstractMavenResolver.java:127)
        at org.gradle.api.publication.maven.internal.deployer.AbstractMavenResolver.publish(AbstractMavenResolver.java:106)
        at org.gradle.api.publication.maven.internal.deployer.BaseMavenDeployer.publish(BaseMavenDeployer.java:36)
        at org.gradle.internal.component.external.ivypublish.DefaultArtifactPublisher.publish(DefaultArtifactPublisher.java:76)
        at org.gradle.api.internal.artifacts.ivyservice.IvyContextualArtifactPublisher$1.execute(IvyContextualArtifactPublisher.java:43)
        at org.gradle.api.internal.artifacts.ivyservice.IvyContextualArtifactPublisher$1.execute(IvyContextualArtifactPublisher.java:40)
        at org.gradle.internal.Transformers$4.transform(Transformers.java:133)
        at org.gradle.api.internal.artifacts.ivyservice.DefaultIvyContextManager.withIvy(DefaultIvyContextManager.java:63)
        at org.gradle.api.internal.artifacts.ivyservice.DefaultIvyContextManager.withIvy(DefaultIvyContextManager.java:41)
        at org.gradle.api.internal.artifacts.ivyservice.IvyContextualArtifactPublisher.publish(IvyContextualArtifactPublisher.java:40)
        at org.gradle.api.tasks.Upload.upload(Upload.java:66)
        ... 181 more
Caused by: org.sonatype.aether.deployment.DeploymentException: Could not deploy to remote repository | Failed to retrieve remote metadata org.igniterealtime.smack:smack-android:4.4.0-alpha3-SNAPSHOT/maven-metadata.xml: Could not transfer metadata org.igniterealtime.smack:smack-android:4.4.0-alpha3-SNAPSHOT/maven-metadata.xml from/to remote (file:/mnt/maven/): GET request of: org/igniterealtime/smack/smack-android/4.4.0-alpha3-SNAPSHOT/maven-metadata.xml from remote failed
        at org.gradle.api.publication.maven.internal.action.DefaultMavenDeployRetrier.deployWithRetry(DefaultMavenDeployRetrier.java:61)
        at org.gradle.api.publication.maven.internal.action.MavenDeployAction.publishArtifacts(MavenDeployAction.java:87)
        at org.gradle.api.publication.maven.internal.action.AbstractMavenPublishAction.publish(AbstractMavenPublishAction.java:104)
        ... 194 more
Caused by: org.sonatype.aether.deployment.DeploymentException: Failed to retrieve remote metadata org.igniterealtime.smack:smack-android:4.4.0-alpha3-SNAPSHOT/maven-metadata.xml: Could not transfer metadata org.igniterealtime.smack:smack-android:4.4.0-alpha3-SNAPSHOT/maven-metadata.xml from/to remote (file:/mnt/maven/): GET request of: org/igniterealtime/smack/smack-android/4.4.0-alpha3-SNAPSHOT/maven-metadata.xml from remote failed
        at org.sonatype.aether.impl.internal.DefaultDeployer.upload(DefaultDeployer.java:403)
        at org.sonatype.aether.impl.internal.DefaultDeployer.deploy(DefaultDeployer.java:256)
        at org.sonatype.aether.impl.internal.DefaultDeployer.deploy(DefaultDeployer.java:211)
        at org.sonatype.aether.impl.internal.DefaultRepositorySystem.deploy(DefaultRepositorySystem.java:443)
        at org.gradle.api.publication.maven.internal.action.MavenDeployAction.lambda$publishArtifacts$0(MavenDeployAction.java:79)
        at org.gradle.api.publication.maven.internal.action.DefaultMavenDeployRetrier.deployWithRetry(DefaultMavenDeployRetrier.java:52)
        ... 196 more
Caused by: org.sonatype.aether.transfer.MetadataTransferException: Could not transfer metadata org.igniterealtime.smack:smack-android:4.4.0-alpha3-SNAPSHOT/maven-metadata.xml from/to remote (file:/mnt/maven/): GET request of: org/igniterealtime/smack/smack-android/4.4.0-alpha3-SNAPSHOT/maven-metadata.xml from remote failed
        at org.sonatype.aether.connector.wagon.WagonRepositoryConnector$3.wrap(WagonRepositoryConnector.java:930)
        at org.sonatype.aether.connector.wagon.WagonRepositoryConnector$3.wrap(WagonRepositoryConnector.java:920)
        at org.sonatype.aether.connector.wagon.WagonRepositoryConnector$GetTask.run(WagonRepositoryConnector.java:669)
        at org.sonatype.aether.util.concurrency.RunnableErrorForwarder$1.run(RunnableErrorForwarder.java:60)
Caused by: org.apache.maven.wagon.TransferFailedException: GET request of: org/igniterealtime/smack/smack-android/4.4.0-alpha3-SNAPSHOT/maven-metadata.xml from remote failed
        at org.apache.maven.wagon.AbstractWagon.getTransfer(AbstractWagon.java:389)
        at org.apache.maven.wagon.AbstractWagon.getTransfer(AbstractWagon.java:315)
        at org.apache.maven.wagon.AbstractWagon.getTransfer(AbstractWagon.java:284)
        at org.apache.maven.wagon.StreamWagon.getIfNewer(StreamWagon.java:97)
        at org.apache.maven.wagon.StreamWagon.get(StreamWagon.java:61)
        at org.sonatype.aether.connector.wagon.WagonRepositoryConnector$GetTask.run(WagonRepositoryConnector.java:601)
        ... 1 more
Caused by: java.io.IOException: No space left on device
        at org.apache.maven.wagon.LazyFileOutputStream.write(LazyFileOutputStream.java:129)
        at org.apache.maven.wagon.AbstractWagon.transfer(AbstractWagon.java:581)
        at org.apache.maven.wagon.AbstractWagon.getTransfer(AbstractWagon.java:372)
        ... 6 more


* Get more help at https://help.gradle.org

BUILD FAILED in 4s