Nightly Distribution of the master branch

Build: #1828 failed Manual run by Florian Schmaus

Stages & jobs

  1. Default Stage

  2. Deploy

Logs

The following logs have been generated by the jobs in this plan.
  • Expand all
  • Collapse all
Job Logs
Collapse Default Job Default Stage Download or View
22-Aug-2021 15:40:45 > Task :smack-streammanagement:compileJava
22-Aug-2021 15:40:48 > Task :smack-tcp:compileJava
22-Aug-2021 15:40:49 > Task :smack-websocket:compileJava
22-Aug-2021 15:40:50 > Task :smack-websocket-okhttp:compileJava
22-Aug-2021 15:40:51 > Task :smack-java8-full:compileJava
22-Aug-2021 15:40:52 > Task :smack-resolver-dnsjava:compileJava
22-Aug-2021 15:40:52 > Task :smack-websocket-java11:compileJava FAILED
22-Aug-2021 15:40:52
22-Aug-2021 15:40:52 Deprecated Gradle features were used in this build, making it incompatible with Gradle 7.0.
22-Aug-2021 15:40:52 Use '--warning-mode all' to show the individual deprecation warnings.
22-Aug-2021 15:40:52 See https://docs.gradle.org/6.4.1/userguide/command_line_interface.html#sec:command_line_warnings
22-Aug-2021 15:40:52 123 actionable tasks: 106 executed, 17 up-to-date
22-Aug-2021 15:40:52
22-Aug-2021 15:40:52 FAILURE: Build failed with an exception.
22-Aug-2021 15:40:52
22-Aug-2021 15:40:52 * What went wrong:
22-Aug-2021 15:40:52 Execution failed for task ':smack-websocket-java11:compileJava'.
22-Aug-2021 15:40:52 > Could not target platform: 'Java SE 11' using tool chain: 'JDK 8 (1.8)'.
22-Aug-2021 15:40:52
22-Aug-2021 15:40:52 * Try:
22-Aug-2021 15:40:52 Run with --stacktrace option to get the stack trace. Run with --info or --debug option to get more log output. Run with --scan to get full insights.
22-Aug-2021 15:40:52
22-Aug-2021 15:40:52 * Get more help at https://help.gradle.org
22-Aug-2021 15:40:52
22-Aug-2021 15:40:52 BUILD FAILED in 2m 24s