Nightly Distribution of the master branch

Build: #1649 failed

Job: Default Job failed

Stages & jobs

  1. Default Stage

  2. Deploy

Build log

The build generated 3,022 lines of output.The output is too long and has been truncated to the last 1,000 lines. Download or view full build log

25-Mar-2019 01:03:00     public Jingle sendFormattedJingle(IQ iq, Jingle jout) throws NotConnectedException, InterruptedException {
25-Mar-2019 01:03:00                   ^
25-Mar-2019 01:03:00 /var/atlassian/bamboo-home/xml-data/build-dir/SMACK-NIGHTLY-JOB1/smack-jingle-old/src/main/java/org/jivesoftware/smackx/jingleold/JingleSession.java:514: warning: no @return
25-Mar-2019 01:03:00     public IQ createAck(IQ iq) {
25-Mar-2019 01:03:00               ^
25-Mar-2019 01:03:00 /var/atlassian/bamboo-home/xml-data/build-dir/SMACK-NIGHTLY-JOB1/smack-jingle-old/src/main/java/org/jivesoftware/smackx/jingleold/JingleSession.java:887: warning: no @param for reason
25-Mar-2019 01:03:00     protected void triggerSessionClosed(String reason) {
25-Mar-2019 01:03:00                    ^
25-Mar-2019 01:03:00 /var/atlassian/bamboo-home/xml-data/build-dir/SMACK-NIGHTLY-JOB1/smack-jingle-old/src/main/java/org/jivesoftware/smackx/jingleold/JingleSession.java:909: warning: no @param for exc
25-Mar-2019 01:03:00     protected void triggerSessionClosedOnError(XMPPException exc) {
25-Mar-2019 01:03:00                    ^
25-Mar-2019 01:03:00 /var/atlassian/bamboo-home/xml-data/build-dir/SMACK-NIGHTLY-JOB1/smack-jingle-old/src/main/java/org/jivesoftware/smackx/jingleold/JingleSession.java:942: warning: no @param for participant
25-Mar-2019 01:03:00     protected void triggerMediaReceived(String participant) {
25-Mar-2019 01:03:00                    ^
25-Mar-2019 01:03:00 /var/atlassian/bamboo-home/xml-data/build-dir/SMACK-NIGHTLY-JOB1/smack-jingle-old/src/main/java/org/jivesoftware/smackx/jingleold/JingleSession.java:983: warning: no description for @throws
25-Mar-2019 01:03:00      * @throws XMPPException
25-Mar-2019 01:03:00        ^
25-Mar-2019 01:03:00 /var/atlassian/bamboo-home/xml-data/build-dir/SMACK-NIGHTLY-JOB1/smack-jingle-old/src/main/java/org/jivesoftware/smackx/jingleold/JingleSession.java:984: warning: no description for @throws
25-Mar-2019 01:03:00      * @throws NotConnectedException
25-Mar-2019 01:03:00        ^
25-Mar-2019 01:03:00 /var/atlassian/bamboo-home/xml-data/build-dir/SMACK-NIGHTLY-JOB1/smack-jingle-old/src/main/java/org/jivesoftware/smackx/jingleold/JingleSession.java:985: warning: no description for @throws
25-Mar-2019 01:03:00      * @throws InterruptedException
25-Mar-2019 01:03:00        ^
25-Mar-2019 01:03:00 /var/atlassian/bamboo-home/xml-data/build-dir/SMACK-NIGHTLY-JOB1/smack-jingle-old/src/main/java/org/jivesoftware/smackx/jingleold/JingleSession.java:994: warning: no description for @throws
25-Mar-2019 01:03:00      * @throws XMPPException
25-Mar-2019 01:03:00        ^
25-Mar-2019 01:03:00 /var/atlassian/bamboo-home/xml-data/build-dir/SMACK-NIGHTLY-JOB1/smack-jingle-old/src/main/java/org/jivesoftware/smackx/jingleold/JingleSession.java:995: warning: no description for @throws
25-Mar-2019 01:03:00      * @throws NotConnectedException
25-Mar-2019 01:03:00        ^
25-Mar-2019 01:03:00 /var/atlassian/bamboo-home/xml-data/build-dir/SMACK-NIGHTLY-JOB1/smack-jingle-old/src/main/java/org/jivesoftware/smackx/jingleold/JingleSession.java:996: warning: no description for @throws
25-Mar-2019 01:03:00      * @throws InterruptedException
25-Mar-2019 01:03:00        ^
25-Mar-2019 01:03:00 /var/atlassian/bamboo-home/xml-data/build-dir/SMACK-NIGHTLY-JOB1/smack-jingle-old/src/main/java/org/jivesoftware/smackx/jingleold/JingleSession.java:998: warning: no @param for reason
25-Mar-2019 01:03:00     public void terminate(String reason) throws XMPPException, NotConnectedException, InterruptedException {
25-Mar-2019 01:03:00                 ^
25-Mar-2019 01:03:00 /var/atlassian/bamboo-home/xml-data/build-dir/SMACK-NIGHTLY-JOB1/smack-jingle-old/src/main/java/org/jivesoftware/smackx/jingleold/JingleSession.java:1052: warning: no @return
25-Mar-2019 01:03:00     public IQ createJingleError(IQ iq, JingleError jingleError) {
25-Mar-2019 01:03:00               ^
25-Mar-2019 01:03:00 /var/atlassian/bamboo-home/xml-data/build-dir/SMACK-NIGHTLY-JOB1/smack-jingle-old/src/main/java/org/jivesoftware/smackx/jingleold/JingleSession.java:1081: warning: no description for @throws
25-Mar-2019 01:03:00      * @throws IllegalStateException
25-Mar-2019 01:03:00        ^
25-Mar-2019 01:03:00 /var/atlassian/bamboo-home/xml-data/build-dir/SMACK-NIGHTLY-JOB1/smack-jingle-old/src/main/java/org/jivesoftware/smackx/jingleold/JingleSession.java:1082: warning: no description for @throws
25-Mar-2019 01:03:00      * @throws SmackException
25-Mar-2019 01:03:00        ^
25-Mar-2019 01:03:00 /var/atlassian/bamboo-home/xml-data/build-dir/SMACK-NIGHTLY-JOB1/smack-jingle-old/src/main/java/org/jivesoftware/smackx/jingleold/JingleSession.java:1083: warning: no description for @throws
25-Mar-2019 01:03:00      * @throws InterruptedException
25-Mar-2019 01:03:00        ^
25-Mar-2019 01:03:00 /var/atlassian/bamboo-home/xml-data/build-dir/SMACK-NIGHTLY-JOB1/smack-jingle-old/src/main/java/org/jivesoftware/smackx/jingleold/JingleSession.java:1172: warning: no @param for mediaManagerName
25-Mar-2019 01:03:00     public void addJingleMediaSession(String mediaManagerName, JingleMediaSession mediaSession) {
25-Mar-2019 01:03:00                 ^
25-Mar-2019 01:03:00 /var/atlassian/bamboo-home/xml-data/build-dir/SMACK-NIGHTLY-JOB1/smack-jingle-old/src/main/java/org/jivesoftware/smackx/jingleold/JingleSession.java:1172: warning: no @param for mediaSession
25-Mar-2019 01:03:00     public void addJingleMediaSession(String mediaManagerName, JingleMediaSession mediaSession) {
25-Mar-2019 01:03:00                 ^
25-Mar-2019 01:03:00 /var/atlassian/bamboo-home/xml-data/build-dir/SMACK-NIGHTLY-JOB1/smack-jingle-old/src/main/java/org/jivesoftware/smackx/jingleold/JingleSession.java:1182: warning: no @param for mediaManagerName
25-Mar-2019 01:03:00     public JingleMediaSession getMediaSession(String mediaManagerName) {
25-Mar-2019 01:03:00                               ^
25-Mar-2019 01:03:01 100 warnings
25-Mar-2019 01:03:01
25-Mar-2019 01:03:01 > Task :smack-jingle-old:javadocJar
25-Mar-2019 01:03:01 > Task :smack-jingle-old:sourcesJar
25-Mar-2019 01:03:01 > Task :smack-jingle-old:compileTestJava NO-SOURCE
25-Mar-2019 01:03:01 > Task :smack-jingle-old:processTestResources NO-SOURCE
25-Mar-2019 01:03:01 > Task :smack-jingle-old:testClasses UP-TO-DATE
25-Mar-2019 01:03:01 > Task :smack-jingle-old:testJar
25-Mar-2019 01:03:01 > Task :smack-jingle-old:signArchives SKIPPED
25-Mar-2019 01:03:01 > Task :smack-jingle-old:assemble
25-Mar-2019 01:03:02 > Task :smack-jingle-old:checkstyleMain
25-Mar-2019 01:03:02 > Task :smack-jingle-old:checkstyleTest NO-SOURCE
25-Mar-2019 01:03:02 > Task :smack-jingle-old:clirr
25-Mar-2019 01:03:02 > Task :smack-jingle-old:test NO-SOURCE
25-Mar-2019 01:03:02 > Task :smack-jingle-old:check
25-Mar-2019 01:03:02 > Task :smack-jingle-old:build
25-Mar-2019 01:03:02 > Task :smack-legacy:copyJavadocDocFiles NO-SOURCE
25-Mar-2019 01:03:04 /var/atlassian/bamboo-home/xml-data/build-dir/SMACK-NIGHTLY-JOB1/smack-legacy/src/main/java/org/jivesoftware/smackx/workgroup/agent/Agent.java:71: warning: no description for @throws
25-Mar-2019 01:03:04      * @throws XMPPErrorException
25-Mar-2019 01:03:04        ^
25-Mar-2019 01:03:04 /var/atlassian/bamboo-home/xml-data/build-dir/SMACK-NIGHTLY-JOB1/smack-legacy/src/main/java/org/jivesoftware/smackx/workgroup/agent/Agent.java:72: warning: no description for @throws
25-Mar-2019 01:03:04      * @throws NoResponseException
25-Mar-2019 01:03:04        ^
25-Mar-2019 01:03:04 /var/atlassian/bamboo-home/xml-data/build-dir/SMACK-NIGHTLY-JOB1/smack-legacy/src/main/java/org/jivesoftware/smackx/workgroup/agent/Agent.java:73: warning: no description for @throws
25-Mar-2019 01:03:04      * @throws NotConnectedException
25-Mar-2019 01:03:04        ^
25-Mar-2019 01:03:04 /var/atlassian/bamboo-home/xml-data/build-dir/SMACK-NIGHTLY-JOB1/smack-legacy/src/main/java/org/jivesoftware/smackx/workgroup/agent/Agent.java:74: warning: no description for @throws
25-Mar-2019 01:03:04      * @throws InterruptedException
25-Mar-2019 01:03:04        ^
25-Mar-2019 01:03:04 /var/atlassian/bamboo-home/xml-data/build-dir/SMACK-NIGHTLY-JOB1/smack-legacy/src/main/java/org/jivesoftware/smackx/workgroup/agent/Agent.java:92: warning: no description for @throws
25-Mar-2019 01:03:04      * @throws XMPPErrorException
25-Mar-2019 01:03:04        ^
25-Mar-2019 01:03:04 /var/atlassian/bamboo-home/xml-data/build-dir/SMACK-NIGHTLY-JOB1/smack-legacy/src/main/java/org/jivesoftware/smackx/workgroup/agent/Agent.java:93: warning: no description for @throws
25-Mar-2019 01:03:04      * @throws NoResponseException
25-Mar-2019 01:03:04        ^
25-Mar-2019 01:03:04 /var/atlassian/bamboo-home/xml-data/build-dir/SMACK-NIGHTLY-JOB1/smack-legacy/src/main/java/org/jivesoftware/smackx/workgroup/agent/Agent.java:94: warning: no description for @throws
25-Mar-2019 01:03:04      * @throws NotConnectedException
25-Mar-2019 01:03:04        ^
25-Mar-2019 01:03:04 /var/atlassian/bamboo-home/xml-data/build-dir/SMACK-NIGHTLY-JOB1/smack-legacy/src/main/java/org/jivesoftware/smackx/workgroup/agent/Agent.java:95: warning: no description for @throws
25-Mar-2019 01:03:04      * @throws InterruptedException
25-Mar-2019 01:03:04        ^
25-Mar-2019 01:03:04 /var/atlassian/bamboo-home/xml-data/build-dir/SMACK-NIGHTLY-JOB1/smack-legacy/src/main/java/org/jivesoftware/smackx/workgroup/agent/AgentRoster.java:96: warning: no description for @throws
25-Mar-2019 01:03:04      * @throws NotConnectedException
25-Mar-2019 01:03:04        ^
25-Mar-2019 01:03:04 /var/atlassian/bamboo-home/xml-data/build-dir/SMACK-NIGHTLY-JOB1/smack-legacy/src/main/java/org/jivesoftware/smackx/workgroup/agent/AgentRoster.java:97: warning: no description for @throws
25-Mar-2019 01:03:04      * @throws InterruptedException
25-Mar-2019 01:03:04        ^
25-Mar-2019 01:03:04 /var/atlassian/bamboo-home/xml-data/build-dir/SMACK-NIGHTLY-JOB1/smack-legacy/src/main/java/org/jivesoftware/smackx/workgroup/agent/AgentSession.java:212: warning: no description for @throws
25-Mar-2019 01:03:04      * @throws NotConnectedException
25-Mar-2019 01:03:04        ^
25-Mar-2019 01:03:04 /var/atlassian/bamboo-home/xml-data/build-dir/SMACK-NIGHTLY-JOB1/smack-legacy/src/main/java/org/jivesoftware/smackx/workgroup/agent/AgentSession.java:213: warning: no description for @throws
25-Mar-2019 01:03:04      * @throws InterruptedException
25-Mar-2019 01:03:04        ^
25-Mar-2019 01:03:04 /var/atlassian/bamboo-home/xml-data/build-dir/SMACK-NIGHTLY-JOB1/smack-legacy/src/main/java/org/jivesoftware/smackx/workgroup/agent/AgentSession.java:272: warning: no description for @throws
25-Mar-2019 01:03:04      * @throws SmackException
25-Mar-2019 01:03:04        ^
25-Mar-2019 01:03:04 /var/atlassian/bamboo-home/xml-data/build-dir/SMACK-NIGHTLY-JOB1/smack-legacy/src/main/java/org/jivesoftware/smackx/workgroup/agent/AgentSession.java:273: warning: no description for @throws
25-Mar-2019 01:03:04      * @throws InterruptedException
25-Mar-2019 01:03:04        ^
25-Mar-2019 01:03:04 /var/atlassian/bamboo-home/xml-data/build-dir/SMACK-NIGHTLY-JOB1/smack-legacy/src/main/java/org/jivesoftware/smackx/workgroup/agent/AgentSession.java:293: warning: no description for @throws
25-Mar-2019 01:03:04      * @throws SmackException
25-Mar-2019 01:03:04        ^
25-Mar-2019 01:03:04 /var/atlassian/bamboo-home/xml-data/build-dir/SMACK-NIGHTLY-JOB1/smack-legacy/src/main/java/org/jivesoftware/smackx/workgroup/agent/AgentSession.java:294: warning: no description for @throws
25-Mar-2019 01:03:04      * @throws InterruptedException
25-Mar-2019 01:03:04        ^
25-Mar-2019 01:03:04 /var/atlassian/bamboo-home/xml-data/build-dir/SMACK-NIGHTLY-JOB1/smack-legacy/src/main/java/org/jivesoftware/smackx/workgroup/agent/AgentSession.java:326: warning: no description for @throws
25-Mar-2019 01:03:04      * @throws InterruptedException
25-Mar-2019 01:03:04        ^
25-Mar-2019 01:03:04 /var/atlassian/bamboo-home/xml-data/build-dir/SMACK-NIGHTLY-JOB1/smack-legacy/src/main/java/org/jivesoftware/smackx/workgroup/agent/AgentSession.java:385: warning: no description for @throws
25-Mar-2019 01:03:04      * @throws SmackException
25-Mar-2019 01:03:04        ^
25-Mar-2019 01:03:04 /var/atlassian/bamboo-home/xml-data/build-dir/SMACK-NIGHTLY-JOB1/smack-legacy/src/main/java/org/jivesoftware/smackx/workgroup/agent/AgentSession.java:386: warning: no description for @throws
25-Mar-2019 01:03:04      * @throws InterruptedException
25-Mar-2019 01:03:04        ^
25-Mar-2019 01:03:04 /var/atlassian/bamboo-home/xml-data/build-dir/SMACK-NIGHTLY-JOB1/smack-legacy/src/main/java/org/jivesoftware/smackx/workgroup/agent/AgentSession.java:412: warning: no description for @throws
25-Mar-2019 01:03:04      * @throws XMPPErrorException
25-Mar-2019 01:03:04        ^
25-Mar-2019 01:03:04 /var/atlassian/bamboo-home/xml-data/build-dir/SMACK-NIGHTLY-JOB1/smack-legacy/src/main/java/org/jivesoftware/smackx/workgroup/agent/AgentSession.java:413: warning: no description for @throws
25-Mar-2019 01:03:04      * @throws NoResponseException
25-Mar-2019 01:03:04        ^
25-Mar-2019 01:03:04 /var/atlassian/bamboo-home/xml-data/build-dir/SMACK-NIGHTLY-JOB1/smack-legacy/src/main/java/org/jivesoftware/smackx/workgroup/agent/AgentSession.java:414: warning: no description for @throws
25-Mar-2019 01:03:04      * @throws NotConnectedException
25-Mar-2019 01:03:04        ^
25-Mar-2019 01:03:04 /var/atlassian/bamboo-home/xml-data/build-dir/SMACK-NIGHTLY-JOB1/smack-legacy/src/main/java/org/jivesoftware/smackx/workgroup/agent/AgentSession.java:415: warning: no description for @throws
25-Mar-2019 01:03:04      * @throws InterruptedException
25-Mar-2019 01:03:04        ^
25-Mar-2019 01:03:04 /var/atlassian/bamboo-home/xml-data/build-dir/SMACK-NIGHTLY-JOB1/smack-legacy/src/main/java/org/jivesoftware/smackx/workgroup/agent/AgentSession.java:465: warning: no description for @throws
25-Mar-2019 01:03:04      * @throws XMPPErrorException
25-Mar-2019 01:03:04        ^
25-Mar-2019 01:03:04 /var/atlassian/bamboo-home/xml-data/build-dir/SMACK-NIGHTLY-JOB1/smack-legacy/src/main/java/org/jivesoftware/smackx/workgroup/agent/AgentSession.java:466: warning: no description for @throws
25-Mar-2019 01:03:04      * @throws NoResponseException
25-Mar-2019 01:03:04        ^
25-Mar-2019 01:03:04 /var/atlassian/bamboo-home/xml-data/build-dir/SMACK-NIGHTLY-JOB1/smack-legacy/src/main/java/org/jivesoftware/smackx/workgroup/agent/AgentSession.java:467: warning: no description for @throws
25-Mar-2019 01:03:04      * @throws NotConnectedException
25-Mar-2019 01:03:04        ^
25-Mar-2019 01:03:04 /var/atlassian/bamboo-home/xml-data/build-dir/SMACK-NIGHTLY-JOB1/smack-legacy/src/main/java/org/jivesoftware/smackx/workgroup/agent/AgentSession.java:468: warning: no description for @throws
25-Mar-2019 01:03:04      * @throws InterruptedException
25-Mar-2019 01:03:04        ^
25-Mar-2019 01:03:04 /var/atlassian/bamboo-home/xml-data/build-dir/SMACK-NIGHTLY-JOB1/smack-legacy/src/main/java/org/jivesoftware/smackx/workgroup/agent/AgentSession.java:504: warning: no description for @throws
25-Mar-2019 01:03:04      * @throws NotConnectedException
25-Mar-2019 01:03:04        ^
25-Mar-2019 01:03:04 /var/atlassian/bamboo-home/xml-data/build-dir/SMACK-NIGHTLY-JOB1/smack-legacy/src/main/java/org/jivesoftware/smackx/workgroup/agent/AgentSession.java:505: warning: no description for @throws
25-Mar-2019 01:03:04      * @throws InterruptedException
25-Mar-2019 01:03:04        ^
25-Mar-2019 01:03:04 /var/atlassian/bamboo-home/xml-data/build-dir/SMACK-NIGHTLY-JOB1/smack-legacy/src/main/java/org/jivesoftware/smackx/workgroup/agent/AgentSession.java:522: warning: no description for @throws
25-Mar-2019 01:03:04      * @throws SmackException
25-Mar-2019 01:03:04        ^
25-Mar-2019 01:03:04 /var/atlassian/bamboo-home/xml-data/build-dir/SMACK-NIGHTLY-JOB1/smack-legacy/src/main/java/org/jivesoftware/smackx/workgroup/agent/AgentSession.java:523: warning: no description for @throws
25-Mar-2019 01:03:04      * @throws InterruptedException
25-Mar-2019 01:03:04        ^
25-Mar-2019 01:03:04 /var/atlassian/bamboo-home/xml-data/build-dir/SMACK-NIGHTLY-JOB1/smack-legacy/src/main/java/org/jivesoftware/smackx/workgroup/agent/AgentSession.java:535: warning: no description for @throws
25-Mar-2019 01:03:04      * @throws SmackException
25-Mar-2019 01:03:04        ^
25-Mar-2019 01:03:04 /var/atlassian/bamboo-home/xml-data/build-dir/SMACK-NIGHTLY-JOB1/smack-legacy/src/main/java/org/jivesoftware/smackx/workgroup/agent/AgentSession.java:536: warning: no description for @throws
25-Mar-2019 01:03:04      * @throws InterruptedException
25-Mar-2019 01:03:04        ^
25-Mar-2019 01:03:04 /var/atlassian/bamboo-home/xml-data/build-dir/SMACK-NIGHTLY-JOB1/smack-legacy/src/main/java/org/jivesoftware/smackx/workgroup/agent/AgentSession.java:549: warning: no description for @throws
25-Mar-2019 01:03:04      * @throws SmackException
25-Mar-2019 01:03:04        ^
25-Mar-2019 01:03:04 /var/atlassian/bamboo-home/xml-data/build-dir/SMACK-NIGHTLY-JOB1/smack-legacy/src/main/java/org/jivesoftware/smackx/workgroup/agent/AgentSession.java:550: warning: no description for @throws
25-Mar-2019 01:03:04      * @throws InterruptedException
25-Mar-2019 01:03:04        ^
25-Mar-2019 01:03:04 /var/atlassian/bamboo-home/xml-data/build-dir/SMACK-NIGHTLY-JOB1/smack-legacy/src/main/java/org/jivesoftware/smackx/workgroup/agent/AgentSession.java:563: warning: no description for @throws
25-Mar-2019 01:03:04      * @throws SmackException
25-Mar-2019 01:03:04        ^
25-Mar-2019 01:03:04 /var/atlassian/bamboo-home/xml-data/build-dir/SMACK-NIGHTLY-JOB1/smack-legacy/src/main/java/org/jivesoftware/smackx/workgroup/agent/AgentSession.java:564: warning: no description for @throws
25-Mar-2019 01:03:04      * @throws XMPPException
25-Mar-2019 01:03:04        ^
25-Mar-2019 01:03:04 /var/atlassian/bamboo-home/xml-data/build-dir/SMACK-NIGHTLY-JOB1/smack-legacy/src/main/java/org/jivesoftware/smackx/workgroup/agent/AgentSession.java:565: warning: no description for @throws
25-Mar-2019 01:03:04      * @throws InterruptedException
25-Mar-2019 01:03:04        ^
25-Mar-2019 01:03:04 /var/atlassian/bamboo-home/xml-data/build-dir/SMACK-NIGHTLY-JOB1/smack-legacy/src/main/java/org/jivesoftware/smackx/workgroup/agent/AgentSession.java:579: warning: no description for @throws
25-Mar-2019 01:03:04      * @throws XMPPErrorException
25-Mar-2019 01:03:04        ^
25-Mar-2019 01:03:04 /var/atlassian/bamboo-home/xml-data/build-dir/SMACK-NIGHTLY-JOB1/smack-legacy/src/main/java/org/jivesoftware/smackx/workgroup/agent/AgentSession.java:580: warning: no description for @throws
25-Mar-2019 01:03:04      * @throws NoResponseException
25-Mar-2019 01:03:04        ^
25-Mar-2019 01:03:04 /var/atlassian/bamboo-home/xml-data/build-dir/SMACK-NIGHTLY-JOB1/smack-legacy/src/main/java/org/jivesoftware/smackx/workgroup/agent/AgentSession.java:581: warning: no description for @throws
25-Mar-2019 01:03:04      * @throws NotConnectedException
25-Mar-2019 01:03:04        ^
25-Mar-2019 01:03:04 /var/atlassian/bamboo-home/xml-data/build-dir/SMACK-NIGHTLY-JOB1/smack-legacy/src/main/java/org/jivesoftware/smackx/workgroup/agent/AgentSession.java:582: warning: no description for @throws
25-Mar-2019 01:03:04      * @throws InterruptedException
25-Mar-2019 01:03:04        ^
25-Mar-2019 01:03:04 /var/atlassian/bamboo-home/xml-data/build-dir/SMACK-NIGHTLY-JOB1/smack-legacy/src/main/java/org/jivesoftware/smackx/workgroup/agent/AgentSession.java:851: warning: no description for @throws
25-Mar-2019 01:03:04      * @throws XMPPErrorException
25-Mar-2019 01:03:04        ^
25-Mar-2019 01:03:04 /var/atlassian/bamboo-home/xml-data/build-dir/SMACK-NIGHTLY-JOB1/smack-legacy/src/main/java/org/jivesoftware/smackx/workgroup/agent/AgentSession.java:852: warning: no description for @throws
25-Mar-2019 01:03:04      * @throws NoResponseException
25-Mar-2019 01:03:04        ^
25-Mar-2019 01:03:04 /var/atlassian/bamboo-home/xml-data/build-dir/SMACK-NIGHTLY-JOB1/smack-legacy/src/main/java/org/jivesoftware/smackx/workgroup/agent/AgentSession.java:853: warning: no description for @throws
25-Mar-2019 01:03:04      * @throws NotConnectedException
25-Mar-2019 01:03:04        ^
25-Mar-2019 01:03:04 /var/atlassian/bamboo-home/xml-data/build-dir/SMACK-NIGHTLY-JOB1/smack-legacy/src/main/java/org/jivesoftware/smackx/workgroup/agent/AgentSession.java:854: warning: no description for @throws
25-Mar-2019 01:03:04      * @throws InterruptedException
25-Mar-2019 01:03:04        ^
25-Mar-2019 01:03:04 /var/atlassian/bamboo-home/xml-data/build-dir/SMACK-NIGHTLY-JOB1/smack-legacy/src/main/java/org/jivesoftware/smackx/workgroup/agent/AgentSession.java:871: warning: no description for @throws
25-Mar-2019 01:03:04      * @throws NoResponseException
25-Mar-2019 01:03:04        ^
25-Mar-2019 01:03:04 /var/atlassian/bamboo-home/xml-data/build-dir/SMACK-NIGHTLY-JOB1/smack-legacy/src/main/java/org/jivesoftware/smackx/workgroup/agent/AgentSession.java:872: warning: no description for @throws
25-Mar-2019 01:03:04      * @throws NotConnectedException
25-Mar-2019 01:03:04        ^
25-Mar-2019 01:03:04 /var/atlassian/bamboo-home/xml-data/build-dir/SMACK-NIGHTLY-JOB1/smack-legacy/src/main/java/org/jivesoftware/smackx/workgroup/agent/AgentSession.java:873: warning: no description for @throws
25-Mar-2019 01:03:04      * @throws InterruptedException
25-Mar-2019 01:03:04        ^
25-Mar-2019 01:03:04 /var/atlassian/bamboo-home/xml-data/build-dir/SMACK-NIGHTLY-JOB1/smack-legacy/src/main/java/org/jivesoftware/smackx/workgroup/agent/AgentSession.java:893: warning: no description for @throws
25-Mar-2019 01:03:04      * @throws NotConnectedException
25-Mar-2019 01:03:04        ^
25-Mar-2019 01:03:04 /var/atlassian/bamboo-home/xml-data/build-dir/SMACK-NIGHTLY-JOB1/smack-legacy/src/main/java/org/jivesoftware/smackx/workgroup/agent/AgentSession.java:894: warning: no description for @throws
25-Mar-2019 01:03:04      * @throws InterruptedException
25-Mar-2019 01:03:04        ^
25-Mar-2019 01:03:04 /var/atlassian/bamboo-home/xml-data/build-dir/SMACK-NIGHTLY-JOB1/smack-legacy/src/main/java/org/jivesoftware/smackx/workgroup/agent/AgentSession.java:918: warning: no description for @throws
25-Mar-2019 01:03:04      * @throws XMPPErrorException
25-Mar-2019 01:03:04        ^
25-Mar-2019 01:03:04 /var/atlassian/bamboo-home/xml-data/build-dir/SMACK-NIGHTLY-JOB1/smack-legacy/src/main/java/org/jivesoftware/smackx/workgroup/agent/AgentSession.java:919: warning: no description for @throws
25-Mar-2019 01:03:04      * @throws NoResponseException
25-Mar-2019 01:03:04        ^
25-Mar-2019 01:03:04 /var/atlassian/bamboo-home/xml-data/build-dir/SMACK-NIGHTLY-JOB1/smack-legacy/src/main/java/org/jivesoftware/smackx/workgroup/agent/AgentSession.java:920: warning: no description for @throws
25-Mar-2019 01:03:04      * @throws NotConnectedException
25-Mar-2019 01:03:04        ^
25-Mar-2019 01:03:04 /var/atlassian/bamboo-home/xml-data/build-dir/SMACK-NIGHTLY-JOB1/smack-legacy/src/main/java/org/jivesoftware/smackx/workgroup/agent/AgentSession.java:921: warning: no description for @throws
25-Mar-2019 01:03:04      * @throws InterruptedException
25-Mar-2019 01:03:04        ^
25-Mar-2019 01:03:04 /var/atlassian/bamboo-home/xml-data/build-dir/SMACK-NIGHTLY-JOB1/smack-legacy/src/main/java/org/jivesoftware/smackx/workgroup/agent/AgentSession.java:938: warning: no description for @throws
25-Mar-2019 01:03:04      * @throws NoResponseException
25-Mar-2019 01:03:04        ^
25-Mar-2019 01:03:04 /var/atlassian/bamboo-home/xml-data/build-dir/SMACK-NIGHTLY-JOB1/smack-legacy/src/main/java/org/jivesoftware/smackx/workgroup/agent/AgentSession.java:939: warning: no description for @throws
25-Mar-2019 01:03:04      * @throws NotConnectedException
25-Mar-2019 01:03:04        ^
25-Mar-2019 01:03:04 /var/atlassian/bamboo-home/xml-data/build-dir/SMACK-NIGHTLY-JOB1/smack-legacy/src/main/java/org/jivesoftware/smackx/workgroup/agent/AgentSession.java:940: warning: no description for @throws
25-Mar-2019 01:03:04      * @throws InterruptedException
25-Mar-2019 01:03:04        ^
25-Mar-2019 01:03:04 /var/atlassian/bamboo-home/xml-data/build-dir/SMACK-NIGHTLY-JOB1/smack-legacy/src/main/java/org/jivesoftware/smackx/workgroup/agent/AgentSession.java:956: warning: no description for @throws
25-Mar-2019 01:03:04      * @throws XMPPErrorException
25-Mar-2019 01:03:04        ^
25-Mar-2019 01:03:04 /var/atlassian/bamboo-home/xml-data/build-dir/SMACK-NIGHTLY-JOB1/smack-legacy/src/main/java/org/jivesoftware/smackx/workgroup/agent/AgentSession.java:957: warning: no description for @throws
25-Mar-2019 01:03:04      * @throws NoResponseException
25-Mar-2019 01:03:04        ^
25-Mar-2019 01:03:04 /var/atlassian/bamboo-home/xml-data/build-dir/SMACK-NIGHTLY-JOB1/smack-legacy/src/main/java/org/jivesoftware/smackx/workgroup/agent/AgentSession.java:958: warning: no description for @throws
25-Mar-2019 01:03:04      * @throws NotConnectedException
25-Mar-2019 01:03:04        ^
25-Mar-2019 01:03:04 /var/atlassian/bamboo-home/xml-data/build-dir/SMACK-NIGHTLY-JOB1/smack-legacy/src/main/java/org/jivesoftware/smackx/workgroup/agent/AgentSession.java:959: warning: no description for @throws
25-Mar-2019 01:03:04      * @throws InterruptedException
25-Mar-2019 01:03:04        ^
25-Mar-2019 01:03:04 /var/atlassian/bamboo-home/xml-data/build-dir/SMACK-NIGHTLY-JOB1/smack-legacy/src/main/java/org/jivesoftware/smackx/workgroup/agent/AgentSession.java:977: warning: no description for @throws
25-Mar-2019 01:03:04      * @throws NotConnectedException
25-Mar-2019 01:03:04        ^
25-Mar-2019 01:03:04 /var/atlassian/bamboo-home/xml-data/build-dir/SMACK-NIGHTLY-JOB1/smack-legacy/src/main/java/org/jivesoftware/smackx/workgroup/agent/AgentSession.java:978: warning: no description for @throws
25-Mar-2019 01:03:04      * @throws InterruptedException
25-Mar-2019 01:03:04        ^
25-Mar-2019 01:03:04 /var/atlassian/bamboo-home/xml-data/build-dir/SMACK-NIGHTLY-JOB1/smack-legacy/src/main/java/org/jivesoftware/smackx/workgroup/agent/AgentSession.java:1016: warning: no description for @throws
25-Mar-2019 01:03:04      * @throws NoResponseException
25-Mar-2019 01:03:04        ^
25-Mar-2019 01:03:04
25-Mar-2019 01:03:04 /var/atlassian/bamboo-home/xml-data/build-dir/SMACK-NIGHTLY-JOB1/smack-legacy/src/main/java/org/jivesoftware/smackx/workgroup/agent/AgentSession.java:1017: warning: no description for @throws
25-Mar-2019 01:03:04      * @throws NotConnectedException
25-Mar-2019 01:03:04        ^
25-Mar-2019 01:03:04 /var/atlassian/bamboo-home/xml-data/build-dir/SMACK-NIGHTLY-JOB1/smack-legacy/src/main/java/org/jivesoftware/smackx/workgroup/agent/AgentSession.java:1018: warning: no description for @throws
25-Mar-2019 01:03:04      * @throws InterruptedException
25-Mar-2019 01:03:04        ^
25-Mar-2019 01:03:04 /var/atlassian/bamboo-home/xml-data/build-dir/SMACK-NIGHTLY-JOB1/smack-legacy/src/main/java/org/jivesoftware/smackx/workgroup/agent/AgentSession.java:1053: warning: no description for @throws
25-Mar-2019 01:03:04      * @throws NoResponseException
25-Mar-2019 01:03:04        ^
25-Mar-2019 01:03:04 /var/atlassian/bamboo-home/xml-data/build-dir/SMACK-NIGHTLY-JOB1/smack-legacy/src/main/java/org/jivesoftware/smackx/workgroup/agent/AgentSession.java:1054: warning: no description for @throws
25-Mar-2019 01:03:04      * @throws NotConnectedException
25-Mar-2019 01:03:04        ^
25-Mar-2019 01:03:04 /var/atlassian/bamboo-home/xml-data/build-dir/SMACK-NIGHTLY-JOB1/smack-legacy/src/main/java/org/jivesoftware/smackx/workgroup/agent/AgentSession.java:1055: warning: no description for @throws
25-Mar-2019 01:03:04      * @throws InterruptedException
25-Mar-2019 01:03:04        ^
25-Mar-2019 01:03:04 /var/atlassian/bamboo-home/xml-data/build-dir/SMACK-NIGHTLY-JOB1/smack-legacy/src/main/java/org/jivesoftware/smackx/workgroup/agent/AgentSession.java:1074: warning: no description for @throws
25-Mar-2019 01:03:04      * @throws NoResponseException
25-Mar-2019 01:03:04        ^
25-Mar-2019 01:03:04 /var/atlassian/bamboo-home/xml-data/build-dir/SMACK-NIGHTLY-JOB1/smack-legacy/src/main/java/org/jivesoftware/smackx/workgroup/agent/AgentSession.java:1075: warning: no description for @throws
25-Mar-2019 01:03:04      * @throws NotConnectedException
25-Mar-2019 01:03:04        ^
25-Mar-2019 01:03:04 /var/atlassian/bamboo-home/xml-data/build-dir/SMACK-NIGHTLY-JOB1/smack-legacy/src/main/java/org/jivesoftware/smackx/workgroup/agent/AgentSession.java:1076: warning: no description for @throws
25-Mar-2019 01:03:04      * @throws InterruptedException
25-Mar-2019 01:03:04        ^
25-Mar-2019 01:03:04 /var/atlassian/bamboo-home/xml-data/build-dir/SMACK-NIGHTLY-JOB1/smack-legacy/src/main/java/org/jivesoftware/smackx/workgroup/agent/Offer.java:84: warning: no description for @throws
25-Mar-2019 01:03:04      * @throws NotConnectedException
25-Mar-2019 01:03:04        ^
25-Mar-2019 01:03:04 /var/atlassian/bamboo-home/xml-data/build-dir/SMACK-NIGHTLY-JOB1/smack-legacy/src/main/java/org/jivesoftware/smackx/workgroup/agent/Offer.java:85: warning: no description for @throws
25-Mar-2019 01:03:04      * @throws InterruptedException
25-Mar-2019 01:03:04        ^
25-Mar-2019 01:03:04 /var/atlassian/bamboo-home/xml-data/build-dir/SMACK-NIGHTLY-JOB1/smack-legacy/src/main/java/org/jivesoftware/smackx/workgroup/agent/Offer.java:96: warning: no description for @throws
25-Mar-2019 01:03:04      * @throws NotConnectedException
25-Mar-2019 01:03:04        ^
25-Mar-2019 01:03:04 /var/atlassian/bamboo-home/xml-data/build-dir/SMACK-NIGHTLY-JOB1/smack-legacy/src/main/java/org/jivesoftware/smackx/workgroup/agent/Offer.java:97: warning: no description for @throws
25-Mar-2019 01:03:04      * @throws InterruptedException
25-Mar-2019 01:03:04        ^
25-Mar-2019 01:03:04 /var/atlassian/bamboo-home/xml-data/build-dir/SMACK-NIGHTLY-JOB1/smack-legacy/src/main/java/org/jivesoftware/smackx/workgroup/agent/TranscriptManager.java:51: warning: no description for @throws
25-Mar-2019 01:03:04      * @throws XMPPErrorException
25-Mar-2019 01:03:04        ^
25-Mar-2019 01:03:04 /var/atlassian/bamboo-home/xml-data/build-dir/SMACK-NIGHTLY-JOB1/smack-legacy/src/main/java/org/jivesoftware/smackx/workgroup/agent/TranscriptManager.java:52: warning: no description for @throws
25-Mar-2019 01:03:04      * @throws NoResponseException
25-Mar-2019 01:03:04        ^
25-Mar-2019 01:03:04 /var/atlassian/bamboo-home/xml-data/build-dir/SMACK-NIGHTLY-JOB1/smack-legacy/src/main/java/org/jivesoftware/smackx/workgroup/agent/TranscriptManager.java:53: warning: no description for @throws
25-Mar-2019 01:03:04      * @throws NotConnectedException
25-Mar-2019 01:03:04        ^
25-Mar-2019 01:03:04 /var/atlassian/bamboo-home/xml-data/build-dir/SMACK-NIGHTLY-JOB1/smack-legacy/src/main/java/org/jivesoftware/smackx/workgroup/agent/TranscriptManager.java:54: warning: no description for @throws
25-Mar-2019 01:03:04      * @throws InterruptedException
25-Mar-2019 01:03:04        ^
25-Mar-2019 01:03:04 /var/atlassian/bamboo-home/xml-data/build-dir/SMACK-NIGHTLY-JOB1/smack-legacy/src/main/java/org/jivesoftware/smackx/workgroup/agent/TranscriptManager.java:70: warning: no description for @throws
25-Mar-2019 01:03:04      * @throws XMPPErrorException
25-Mar-2019 01:03:04        ^
25-Mar-2019 01:03:04 /var/atlassian/bamboo-home/xml-data/build-dir/SMACK-NIGHTLY-JOB1/smack-legacy/src/main/java/org/jivesoftware/smackx/workgroup/agent/TranscriptManager.java:71: warning: no description for @throws
25-Mar-2019 01:03:04      * @throws NoResponseException
25-Mar-2019 01:03:04        ^
25-Mar-2019 01:03:04 /var/atlassian/bamboo-home/xml-data/build-dir/SMACK-NIGHTLY-JOB1/smack-legacy/src/main/java/org/jivesoftware/smackx/workgroup/agent/TranscriptManager.java:72: warning: no description for @throws
25-Mar-2019 01:03:04      * @throws NotConnectedException
25-Mar-2019 01:03:04        ^
25-Mar-2019 01:03:04 /var/atlassian/bamboo-home/xml-data/build-dir/SMACK-NIGHTLY-JOB1/smack-legacy/src/main/java/org/jivesoftware/smackx/workgroup/agent/TranscriptManager.java:73: warning: no description for @throws
25-Mar-2019 01:03:04      * @throws InterruptedException
25-Mar-2019 01:03:04        ^
25-Mar-2019 01:03:04 /var/atlassian/bamboo-home/xml-data/build-dir/SMACK-NIGHTLY-JOB1/smack-legacy/src/main/java/org/jivesoftware/smackx/workgroup/agent/TranscriptSearchManager.java:53: warning: no description for @throws
25-Mar-2019 01:03:04      * @throws XMPPErrorException
25-Mar-2019 01:03:04        ^
25-Mar-2019 01:03:04 /var/atlassian/bamboo-home/xml-data/build-dir/SMACK-NIGHTLY-JOB1/smack-legacy/src/main/java/org/jivesoftware/smackx/workgroup/agent/TranscriptSearchManager.java:54: warning: no description for @throws
25-Mar-2019 01:03:04      * @throws NoResponseException
25-Mar-2019 01:03:04        ^
25-Mar-2019 01:03:04 /var/atlassian/bamboo-home/xml-data/build-dir/SMACK-NIGHTLY-JOB1/smack-legacy/src/main/java/org/jivesoftware/smackx/workgroup/agent/TranscriptSearchManager.java:55: warning: no description for @throws
25-Mar-2019 01:03:04      * @throws NotConnectedException
25-Mar-2019 01:03:04        ^
25-Mar-2019 01:03:04 /var/atlassian/bamboo-home/xml-data/build-dir/SMACK-NIGHTLY-JOB1/smack-legacy/src/main/java/org/jivesoftware/smackx/workgroup/agent/TranscriptSearchManager.java:56: warning: no description for @throws
25-Mar-2019 01:03:04      * @throws InterruptedException
25-Mar-2019 01:03:04        ^
25-Mar-2019 01:03:04 /var/atlassian/bamboo-home/xml-data/build-dir/SMACK-NIGHTLY-JOB1/smack-legacy/src/main/java/org/jivesoftware/smackx/workgroup/agent/TranscriptSearchManager.java:76: warning: no description for @throws
25-Mar-2019 01:03:04      * @throws XMPPErrorException
25-Mar-2019 01:03:04        ^
25-Mar-2019 01:03:04 /var/atlassian/bamboo-home/xml-data/build-dir/SMACK-NIGHTLY-JOB1/smack-legacy/src/main/java/org/jivesoftware/smackx/workgroup/agent/TranscriptSearchManager.java:77: warning: no description for @throws
25-Mar-2019 01:03:04      * @throws NoResponseException
25-Mar-2019 01:03:04        ^
25-Mar-2019 01:03:04 /var/atlassian/bamboo-home/xml-data/build-dir/SMACK-NIGHTLY-JOB1/smack-legacy/src/main/java/org/jivesoftware/smackx/workgroup/agent/TranscriptSearchManager.java:78: warning: no description for @throws
25-Mar-2019 01:03:04      * @throws NotConnectedException
25-Mar-2019 01:03:04        ^
25-Mar-2019 01:03:04 /var/atlassian/bamboo-home/xml-data/build-dir/SMACK-NIGHTLY-JOB1/smack-legacy/src/main/java/org/jivesoftware/smackx/workgroup/agent/TranscriptSearchManager.java:79: warning: no description for @throws
25-Mar-2019 01:03:04      * @throws InterruptedException
25-Mar-2019 01:03:04        ^
25-Mar-2019 01:03:04 /var/atlassian/bamboo-home/xml-data/build-dir/SMACK-NIGHTLY-JOB1/smack-legacy/src/main/java/org/jivesoftware/smackx/xroster/RosterExchangeManager.java:120: warning: no description for @throws
25-Mar-2019 01:03:04      * @throws NotConnectedException
25-Mar-2019 01:03:04        ^
25-Mar-2019 01:03:04 /var/atlassian/bamboo-home/xml-data/build-dir/SMACK-NIGHTLY-JOB1/smack-legacy/src/main/java/org/jivesoftware/smackx/xroster/RosterExchangeManager.java:121: warning: no description for @throws
25-Mar-2019 01:03:04      * @throws InterruptedException
25-Mar-2019 01:03:04        ^
25-Mar-2019 01:03:04 /var/atlassian/bamboo-home/xml-data/build-dir/SMACK-NIGHTLY-JOB1/smack-legacy/src/main/java/org/jivesoftware/smackx/xroster/RosterExchangeManager.java:140: warning: no description for @throws
25-Mar-2019 01:03:04      * @throws NotConnectedException
25-Mar-2019 01:03:04        ^
25-Mar-2019 01:03:04 /var/atlassian/bamboo-home/xml-data/build-dir/SMACK-NIGHTLY-JOB1/smack-legacy/src/main/java/org/jivesoftware/smackx/xroster/RosterExchangeManager.java:141: warning: no description for @throws
25-Mar-2019 01:03:04      * @throws InterruptedException
25-Mar-2019 01:03:04        ^
25-Mar-2019 01:03:04 /var/atlassian/bamboo-home/xml-data/build-dir/SMACK-NIGHTLY-JOB1/smack-legacy/src/main/java/org/jivesoftware/smackx/xroster/RosterExchangeManager.java:162: warning: no description for @throws
25-Mar-2019 01:03:04      * @throws NotConnectedException
25-Mar-2019 01:03:04        ^
25-Mar-2019 01:03:04 /var/atlassian/bamboo-home/xml-data/build-dir/SMACK-NIGHTLY-JOB1/smack-legacy/src/main/java/org/jivesoftware/smackx/xroster/RosterExchangeManager.java:163: warning: no description for @throws
25-Mar-2019 01:03:04      * @throws InterruptedException
25-Mar-2019 01:03:04        ^
25-Mar-2019 01:03:04 /var/atlassian/bamboo-home/xml-data/build-dir/SMACK-NIGHTLY-JOB1/smack-legacy/src/main/java/org/jivesoftware/smackx/xevent/provider/MessageEventProvider.java:43: warning: no description for @throws
25-Mar-2019 01:03:04      * @throws IOException
25-Mar-2019 01:03:04        ^
25-Mar-2019 01:03:04 > Task :smack-legacy:javadoc
25-Mar-2019 01:03:05 100 warnings
25-Mar-2019 01:03:05
25-Mar-2019 01:03:05 > Task :smack-legacy:javadocJar
25-Mar-2019 01:03:05 > Task :smack-legacy:sourcesJar
25-Mar-2019 01:03:06 > Task :smack-legacy:compileTestJava
25-Mar-2019 01:03:06 > Task :smack-legacy:processTestResources NO-SOURCE
25-Mar-2019 01:03:06 > Task :smack-legacy:testClasses
25-Mar-2019 01:03:06 > Task :smack-legacy:testJar
25-Mar-2019 01:03:06 > Task :smack-legacy:signArchives SKIPPED
25-Mar-2019 01:03:06 > Task :smack-legacy:assemble
25-Mar-2019 01:03:07 > Task :smack-legacy:checkstyleMain
25-Mar-2019 01:03:07 > Task :smack-legacy:checkstyleTest
25-Mar-2019 01:03:07 > Task :smack-legacy:clirr
25-Mar-2019 01:03:08 > Task :smack-legacy:test
25-Mar-2019 01:03:08 > Task :smack-legacy:check
25-Mar-2019 01:03:08 > Task :smack-legacy:build
25-Mar-2019 01:03:08 > Task :smack-omemo:copyJavadocDocFiles NO-SOURCE
25-Mar-2019 01:03:10
25-Mar-2019 01:03:10 > Task :smack-omemo:javadoc
25-Mar-2019 01:03:10 /var/atlassian/bamboo-home/xml-data/build-dir/SMACK-NIGHTLY-JOB1/smack-omemo/src/main/java/org/jivesoftware/smackx/omemo/util/OmemoMessageBuilder.java:269: warning: no description for @throws
25-Mar-2019 01:03:10      * @throws NoSuchAlgorithmException
25-Mar-2019 01:03:10        ^
25-Mar-2019 01:03:10 /var/atlassian/bamboo-home/xml-data/build-dir/SMACK-NIGHTLY-JOB1/smack-omemo/src/main/java/org/jivesoftware/smackx/omemo/util/OmemoMessageBuilder.java:93: warning: no description for @throws
25-Mar-2019 01:03:10      * @throws NoSuchPaddingException
25-Mar-2019 01:03:10        ^
25-Mar-2019 01:03:10 /var/atlassian/bamboo-home/xml-data/build-dir/SMACK-NIGHTLY-JOB1/smack-omemo/src/main/java/org/jivesoftware/smackx/omemo/util/OmemoMessageBuilder.java:94: warning: no description for @throws
25-Mar-2019 01:03:10      * @throws BadPaddingException
25-Mar-2019 01:03:10        ^
25-Mar-2019 01:03:10 /var/atlassian/bamboo-home/xml-data/build-dir/SMACK-NIGHTLY-JOB1/smack-omemo/src/main/java/org/jivesoftware/smackx/omemo/util/OmemoMessageBuilder.java:95: warning: no description for @throws
25-Mar-2019 01:03:10      * @throws InvalidKeyException
25-Mar-2019 01:03:10        ^
25-Mar-2019 01:03:10 /var/atlassian/bamboo-home/xml-data/build-dir/SMACK-NIGHTLY-JOB1/smack-omemo/src/main/java/org/jivesoftware/smackx/omemo/util/OmemoMessageBuilder.java:96: warning: no description for @throws
25-Mar-2019 01:03:10      * @throws NoSuchAlgorithmException
25-Mar-2019 01:03:10        ^
25-Mar-2019 01:03:10 /var/atlassian/bamboo-home/xml-data/build-dir/SMACK-NIGHTLY-JOB1/smack-omemo/src/main/java/org/jivesoftware/smackx/omemo/util/OmemoMessageBuilder.java:97: warning: no description for @throws
25-Mar-2019 01:03:10      * @throws IllegalBlockSizeException
25-Mar-2019 01:03:10        ^
25-Mar-2019 01:03:10 /var/atlassian/bamboo-home/xml-data/build-dir/SMACK-NIGHTLY-JOB1/smack-omemo/src/main/java/org/jivesoftware/smackx/omemo/util/OmemoMessageBuilder.java:98: warning: no description for @throws
25-Mar-2019 01:03:10      * @throws UnsupportedEncodingException
25-Mar-2019 01:03:10        ^
25-Mar-2019 01:03:10 /var/atlassian/bamboo-home/xml-data/build-dir/SMACK-NIGHTLY-JOB1/smack-omemo/src/main/java/org/jivesoftware/smackx/omemo/util/OmemoMessageBuilder.java:99: warning: no description for @throws
25-Mar-2019 01:03:10      * @throws NoSuchProviderException
25-Mar-2019 01:03:10        ^
25-Mar-2019 01:03:10 /var/atlassian/bamboo-home/xml-data/build-dir/SMACK-NIGHTLY-JOB1/smack-omemo/src/main/java/org/jivesoftware/smackx/omemo/util/OmemoMessageBuilder.java:100: warning: no description for @throws
25-Mar-2019 01:03:10      * @throws InvalidAlgorithmParameterException
25-Mar-2019 01:03:10        ^
25-Mar-2019 01:03:10 /var/atlassian/bamboo-home/xml-data/build-dir/SMACK-NIGHTLY-JOB1/smack-omemo/src/main/java/org/jivesoftware/smackx/omemo/util/OmemoMessageBuilder.java:127: warning: no description for @throws
25-Mar-2019 01:03:10      * @throws NoSuchPaddingException
25-Mar-2019 01:03:10        ^
25-Mar-2019 01:03:10 /var/atlassian/bamboo-home/xml-data/build-dir/SMACK-NIGHTLY-JOB1/smack-omemo/src/main/java/org/jivesoftware/smackx/omemo/util/OmemoMessageBuilder.java:128: warning: no description for @throws
25-Mar-2019 01:03:10      * @throws BadPaddingException
25-Mar-2019 01:03:10        ^
25-Mar-2019 01:03:10 /var/atlassian/bamboo-home/xml-data/build-dir/SMACK-NIGHTLY-JOB1/smack-omemo/src/main/java/org/jivesoftware/smackx/omemo/util/OmemoMessageBuilder.java:129: warning: no description for @throws
25-Mar-2019 01:03:10      * @throws InvalidKeyException
25-Mar-2019 01:03:10        ^
25-Mar-2019 01:03:10 /var/atlassian/bamboo-home/xml-data/build-dir/SMACK-NIGHTLY-JOB1/smack-omemo/src/main/java/org/jivesoftware/smackx/omemo/util/OmemoMessageBuilder.java:130: warning: no description for @throws
25-Mar-2019 01:03:10      * @throws NoSuchAlgorithmException
25-Mar-2019 01:03:10        ^
25-Mar-2019 01:03:10 /var/atlassian/bamboo-home/xml-data/build-dir/SMACK-NIGHTLY-JOB1/smack-omemo/src/main/java/org/jivesoftware/smackx/omemo/util/OmemoMessageBuilder.java:131: warning: no description for @throws
25-Mar-2019 01:03:10      * @throws IllegalBlockSizeException
25-Mar-2019 01:03:10        ^
25-Mar-2019 01:03:10 /var/atlassian/bamboo-home/xml-data/build-dir/SMACK-NIGHTLY-JOB1/smack-omemo/src/main/java/org/jivesoftware/smackx/omemo/util/OmemoMessageBuilder.java:132: warning: no description for @throws
25-Mar-2019 01:03:10      * @throws UnsupportedEncodingException
25-Mar-2019 01:03:10        ^
25-Mar-2019 01:03:10 /var/atlassian/bamboo-home/xml-data/build-dir/SMACK-NIGHTLY-JOB1/smack-omemo/src/main/java/org/jivesoftware/smackx/omemo/util/OmemoMessageBuilder.java:133: warning: no description for @throws
25-Mar-2019 01:03:10      * @throws NoSuchProviderException
25-Mar-2019 01:03:10        ^
25-Mar-2019 01:03:10 /var/atlassian/bamboo-home/xml-data/build-dir/SMACK-NIGHTLY-JOB1/smack-omemo/src/main/java/org/jivesoftware/smackx/omemo/util/OmemoMessageBuilder.java:134: warning: no description for @throws
25-Mar-2019 01:03:10      * @throws InvalidAlgorithmParameterException
25-Mar-2019 01:03:10        ^
25-Mar-2019 01:03:10 /var/atlassian/bamboo-home/xml-data/build-dir/SMACK-NIGHTLY-JOB1/smack-omemo/src/main/java/org/jivesoftware/smackx/omemo/exceptions/StaleDeviceException.java:34: warning: no description for @param
25-Mar-2019 01:03:10      * @param lastMessageDate
25-Mar-2019 01:03:10        ^
25-Mar-2019 01:03:10 /var/atlassian/bamboo-home/xml-data/build-dir/SMACK-NIGHTLY-JOB1/smack-omemo/src/main/java/org/jivesoftware/smackx/omemo/exceptions/StaleDeviceException.java:35: warning: no description for @param
25-Mar-2019 01:03:10      * @param lastDeviceIdPublicationDate
25-Mar-2019 01:03:10        ^
25-Mar-2019 01:03:10 /var/atlassian/bamboo-home/xml-data/build-dir/SMACK-NIGHTLY-JOB1/smack-omemo/src/main/java/org/jivesoftware/smackx/omemo/exceptions/UntrustedOmemoIdentityException.java:68: warning: no description for @return
25-Mar-2019 01:03:10      * @return
25-Mar-2019 01:03:10        ^
25-Mar-2019 01:03:10 /var/atlassian/bamboo-home/xml-data/build-dir/SMACK-NIGHTLY-JOB1/smack-omemo/src/main/java/org/jivesoftware/smackx/omemo/exceptions/UntrustedOmemoIdentityException.java:76: warning: no description for @return
25-Mar-2019 01:03:10      * @return
25-Mar-2019 01:03:10        ^
25-Mar-2019 01:03:10 /var/atlassian/bamboo-home/xml-data/build-dir/SMACK-NIGHTLY-JOB1/smack-omemo/src/main/java/org/jivesoftware/smackx/omemo/OmemoStore.java:201: warning: no description for @param
25-Mar-2019 01:03:10      * @param userDevice
25-Mar-2019 01:03:10        ^
25-Mar-2019 01:03:10 /var/atlassian/bamboo-home/xml-data/build-dir/SMACK-NIGHTLY-JOB1/smack-omemo/src/main/java/org/jivesoftware/smackx/omemo/OmemoStore.java:202: warning: no description for @throws
25-Mar-2019 01:03:10      * @throws CorruptedOmemoKeyException
25-Mar-2019 01:03:10        ^
25-Mar-2019 01:03:10 /var/atlassian/bamboo-home/xml-data/build-dir/SMACK-NIGHTLY-JOB1/smack-omemo/src/main/java/org/jivesoftware/smackx/omemo/OmemoStore.java:542: warning: no description for @param
25-Mar-2019 01:03:10      * @param userDevice
25-Mar-2019 01:03:10        ^
25-Mar-2019 01:03:10 /var/atlassian/bamboo-home/xml-data/build-dir/SMACK-NIGHTLY-JOB1/smack-omemo/src/main/java/org/jivesoftware/smackx/omemo/OmemoStore.java:543: warning: no description for @return
25-Mar-2019 01:03:10      * @return
25-Mar-2019 01:03:10        ^
25-Mar-2019 01:03:10 /var/atlassian/bamboo-home/xml-data/build-dir/SMACK-NIGHTLY-JOB1/smack-omemo/src/main/java/org/jivesoftware/smackx/omemo/OmemoStore.java:624: warning: no description for @throws
25-Mar-2019 01:03:10      * @throws SmackException.NotConnectedException
25-Mar-2019 01:03:10        ^
25-Mar-2019 01:03:10 /var/atlassian/bamboo-home/xml-data/build-dir/SMACK-NIGHTLY-JOB1/smack-omemo/src/main/java/org/jivesoftware/smackx/omemo/OmemoStore.java:625: warning: no description for @throws
25-Mar-2019 01:03:10      * @throws InterruptedException
25-Mar-2019 01:03:10        ^
25-Mar-2019 01:03:10 /var/atlassian/bamboo-home/xml-data/build-dir/SMACK-NIGHTLY-JOB1/smack-omemo/src/main/java/org/jivesoftware/smackx/omemo/OmemoStore.java:626: warning: no description for @throws
25-Mar-2019 01:03:10      * @throws SmackException.NoResponseException
25-Mar-2019 01:03:10        ^
25-Mar-2019 01:03:10 /var/atlassian/bamboo-home/xml-data/build-dir/SMACK-NIGHTLY-JOB1/smack-omemo/src/main/java/org/jivesoftware/smackx/omemo/CachingOmemoStore.java:39: warning: no description for @param
25-Mar-2019 01:03:10 * @param <T_IdKeyPair>
25-Mar-2019 01:03:10    ^
25-Mar-2019 01:03:10 /var/atlassian/bamboo-home/xml-data/build-dir/SMACK-NIGHTLY-JOB1/smack-omemo/src/main/java/org/jivesoftware/smackx/omemo/CachingOmemoStore.java:40: warning: no description for @param
25-Mar-2019 01:03:10 * @param <T_IdKey>
25-Mar-2019 01:03:10    ^
25-Mar-2019 01:03:10 /var/atlassian/bamboo-home/xml-data/build-dir/SMACK-NIGHTLY-JOB1/smack-omemo/src/main/java/org/jivesoftware/smackx/omemo/CachingOmemoStore.java:41: warning: no description for @param
25-Mar-2019 01:03:10 * @param <T_PreKey>
25-Mar-2019 01:03:10    ^
25-Mar-2019 01:03:10 /var/atlassian/bamboo-home/xml-data/build-dir/SMACK-NIGHTLY-JOB1/smack-omemo/src/main/java/org/jivesoftware/smackx/omemo/CachingOmemoStore.java:42: warning: no description for @param
25-Mar-2019 01:03:10 * @param <T_SigPreKey>
25-Mar-2019 01:03:10    ^
25-Mar-2019 01:03:10 /var/atlassian/bamboo-home/xml-data/build-dir/SMACK-NIGHTLY-JOB1/smack-omemo/src/main/java/org/jivesoftware/smackx/omemo/CachingOmemoStore.java:43: warning: no description for @param
25-Mar-2019 01:03:10 * @param <T_Sess>
25-Mar-2019 01:03:10    ^
25-Mar-2019 01:03:10 /var/atlassian/bamboo-home/xml-data/build-dir/SMACK-NIGHTLY-JOB1/smack-omemo/src/main/java/org/jivesoftware/smackx/omemo/CachingOmemoStore.java:44: warning: no description for @param
25-Mar-2019 01:03:10 * @param <T_Addr>
25-Mar-2019 01:03:10    ^
25-Mar-2019 01:03:10 /var/atlassian/bamboo-home/xml-data/build-dir/SMACK-NIGHTLY-JOB1/smack-omemo/src/main/java/org/jivesoftware/smackx/omemo/CachingOmemoStore.java:45: warning: no description for @param
25-Mar-2019 01:03:10 * @param <T_ECPub>
25-Mar-2019 01:03:10    ^
25-Mar-2019 01:03:10 /var/atlassian/bamboo-home/xml-data/build-dir/SMACK-NIGHTLY-JOB1/smack-omemo/src/main/java/org/jivesoftware/smackx/omemo/CachingOmemoStore.java:46: warning: no description for @param
25-Mar-2019 01:03:10 * @param <T_Bundle>
25-Mar-2019 01:03:10    ^
25-Mar-2019 01:03:10 /var/atlassian/bamboo-home/xml-data/build-dir/SMACK-NIGHTLY-JOB1/smack-omemo/src/main/java/org/jivesoftware/smackx/omemo/CachingOmemoStore.java:47: warning: no description for @param
25-Mar-2019 01:03:10 * @param <T_Ciph>
25-Mar-2019 01:03:10    ^
25-Mar-2019 01:03:10 /var/atlassian/bamboo-home/xml-data/build-dir/SMACK-NIGHTLY-JOB1/smack-omemo/src/main/java/org/jivesoftware/smackx/omemo/FileBasedOmemoStore.java:688: warning: no description for @param
25-Mar-2019 01:03:10      * @param root
25-Mar-2019 01:03:10        ^
25-Mar-2019 01:03:10 /var/atlassian/bamboo-home/xml-data/build-dir/SMACK-NIGHTLY-JOB1/smack-omemo/src/main/java/org/jivesoftware/smackx/omemo/OmemoManager.java:229: warning: no description for @throws
25-Mar-2019 01:03:10      * @throws CorruptedOmemoKeyException
25-Mar-2019 01:03:10        ^
25-Mar-2019 01:03:10 /var/atlassian/bamboo-home/xml-data/build-dir/SMACK-NIGHTLY-JOB1/smack-omemo/src/main/java/org/jivesoftware/smackx/omemo/OmemoManager.java:230: warning: no description for @throws
25-Mar-2019 01:03:10      * @throws InterruptedException
25-Mar-2019 01:03:10        ^
25-Mar-2019 01:03:10 /var/atlassian/bamboo-home/xml-data/build-dir/SMACK-NIGHTLY-JOB1/smack-omemo/src/main/java/org/jivesoftware/smackx/omemo/OmemoManager.java:231: warning: no description for @throws
25-Mar-2019 01:03:10      * @throws SmackException.NoResponseException
25-Mar-2019 01:03:10        ^
25-Mar-2019 01:03:10 /var/atlassian/bamboo-home/xml-data/build-dir/SMACK-NIGHTLY-JOB1/smack-omemo/src/main/java/org/jivesoftware/smackx/omemo/OmemoManager.java:232: warning: no description for @throws
25-Mar-2019 01:03:10      * @throws SmackException.NotConnectedException
25-Mar-2019 01:03:10        ^
25-Mar-2019 01:03:10 /var/atlassian/bamboo-home/xml-data/build-dir/SMACK-NIGHTLY-JOB1/smack-omemo/src/main/java/org/jivesoftware/smackx/omemo/OmemoManager.java:233: warning: no description for @throws
25-Mar-2019 01:03:10      * @throws XMPPException.XMPPErrorException
25-Mar-2019 01:03:10        ^
25-Mar-2019 01:03:10 /var/atlassian/bamboo-home/xml-data/build-dir/SMACK-NIGHTLY-JOB1/smack-omemo/src/main/java/org/jivesoftware/smackx/omemo/OmemoManager.java:234: warning: no description for @throws
25-Mar-2019 01:03:10      * @throws SmackException.NotLoggedInException
25-Mar-2019 01:03:10        ^
25-Mar-2019 01:03:10 /var/atlassian/bamboo-home/xml-data/build-dir/SMACK-NIGHTLY-JOB1/smack-omemo/src/main/java/org/jivesoftware/smackx/omemo/OmemoManager.java:235: warning: no description for @throws
25-Mar-2019 01:03:10      * @throws PubSubException.NotALeafNodeException
25-Mar-2019 01:03:10        ^
25-Mar-2019 01:03:10 /var/atlassian/bamboo-home/xml-data/build-dir/SMACK-NIGHTLY-JOB1/smack-omemo/src/main/java/org/jivesoftware/smackx/omemo/OmemoManager.java:302: warning: no description for @throws
25-Mar-2019 01:03:10      * @throws InterruptedException
25-Mar-2019 01:03:10        ^
25-Mar-2019 01:03:10 /var/atlassian/bamboo-home/xml-data/build-dir/SMACK-NIGHTLY-JOB1/smack-omemo/src/main/java/org/jivesoftware/smackx/omemo/OmemoManager.java:303: warning: no description for @throws
25-Mar-2019 01:03:10      * @throws SmackException.NotConnectedException
25-Mar-2019 01:03:10        ^
25-Mar-2019 01:03:10 /var/atlassian/bamboo-home/xml-data/build-dir/SMACK-NIGHTLY-JOB1/smack-omemo/src/main/java/org/jivesoftware/smackx/omemo/OmemoManager.java:304: warning: no description for @throws
25-Mar-2019 01:03:10      * @throws SmackException.NoResponseException
25-Mar-2019 01:03:10        ^
25-Mar-2019 01:03:10 /var/atlassian/bamboo-home/xml-data/build-dir/SMACK-NIGHTLY-JOB1/smack-omemo/src/main/java/org/jivesoftware/smackx/omemo/OmemoManager.java:305: warning: no description for @throws
25-Mar-2019 01:03:10      * @throws SmackException.NotLoggedInException
25-Mar-2019 01:03:10        ^
25-Mar-2019 01:03:10 /var/atlassian/bamboo-home/xml-data/build-dir/SMACK-NIGHTLY-JOB1/smack-omemo/src/main/java/org/jivesoftware/smackx/omemo/OmemoManager.java:326: warning: no description for @throws
25-Mar-2019 01:03:10      * @throws InterruptedException
25-Mar-2019 01:03:10        ^
25-Mar-2019 01:03:10 /var/atlassian/bamboo-home/xml-data/build-dir/SMACK-NIGHTLY-JOB1/smack-omemo/src/main/java/org/jivesoftware/smackx/omemo/OmemoManager.java:327: warning: no description for @throws
25-Mar-2019 01:03:10      * @throws SmackException.NotConnectedException
25-Mar-2019 01:03:10        ^
25-Mar-2019 01:03:10 /var/atlassian/bamboo-home/xml-data/build-dir/SMACK-NIGHTLY-JOB1/smack-omemo/src/main/java/org/jivesoftware/smackx/omemo/OmemoManager.java:328: warning: no description for @throws
25-Mar-2019 01:03:10      * @throws SmackException.NoResponseException
25-Mar-2019 01:03:10        ^
25-Mar-2019 01:03:10 /var/atlassian/bamboo-home/xml-data/build-dir/SMACK-NIGHTLY-JOB1/smack-omemo/src/main/java/org/jivesoftware/smackx/omemo/OmemoManager.java:329: warning: no description for @throws
25-Mar-2019 01:03:10      * @throws SmackException.NotLoggedInException
25-Mar-2019 01:03:10        ^
25-Mar-2019 01:03:10 /var/atlassian/bamboo-home/xml-data/build-dir/SMACK-NIGHTLY-JOB1/smack-omemo/src/main/java/org/jivesoftware/smackx/omemo/OmemoManager.java:352: warning: no description for @throws
25-Mar-2019 01:03:10      * @throws CryptoFailedException
25-Mar-2019 01:03:10        ^
25-Mar-2019 01:03:10 /var/atlassian/bamboo-home/xml-data/build-dir/SMACK-NIGHTLY-JOB1/smack-omemo/src/main/java/org/jivesoftware/smackx/omemo/OmemoManager.java:353: warning: no description for @throws
25-Mar-2019 01:03:10      * @throws XMPPException.XMPPErrorException
25-Mar-2019 01:03:10        ^
25-Mar-2019 01:03:10 /var/atlassian/bamboo-home/xml-data/build-dir/SMACK-NIGHTLY-JOB1/smack-omemo/src/main/java/org/jivesoftware/smackx/omemo/OmemoManager.java:354: warning: no description for @throws
25-Mar-2019 01:03:10      * @throws SmackException.NotConnectedException
25-Mar-2019 01:03:10        ^
25-Mar-2019 01:03:10 /var/atlassian/bamboo-home/xml-data/build-dir/SMACK-NIGHTLY-JOB1/smack-omemo/src/main/java/org/jivesoftware/smackx/omemo/OmemoManager.java:355: warning: no description for @throws
25-Mar-2019 01:03:10      * @throws InterruptedException
25-Mar-2019 01:03:10        ^
25-Mar-2019 01:03:10 /var/atlassian/bamboo-home/xml-data/build-dir/SMACK-NIGHTLY-JOB1/smack-omemo/src/main/java/org/jivesoftware/smackx/omemo/OmemoManager.java:356: warning: no description for @throws
25-Mar-2019 01:03:10      * @throws SmackException.NoResponseException
25-Mar-2019 01:03:10        ^
25-Mar-2019 01:03:10 /var/atlassian/bamboo-home/xml-data/build-dir/SMACK-NIGHTLY-JOB1/smack-omemo/src/main/java/org/jivesoftware/smackx/omemo/OmemoManager.java:358: warning: no description for @throws
25-Mar-2019 01:03:10      * @throws SmackException.NotLoggedInException
25-Mar-2019 01:03:10        ^
25-Mar-2019 01:03:10 /var/atlassian/bamboo-home/xml-data/build-dir/SMACK-NIGHTLY-JOB1/smack-omemo/src/main/java/org/jivesoftware/smackx/omemo/OmemoManager.java:449: warning: no description for @return
25-Mar-2019 01:03:10      * @return
25-Mar-2019 01:03:10        ^
25-Mar-2019 01:03:10 /var/atlassian/bamboo-home/xml-data/build-dir/SMACK-NIGHTLY-JOB1/smack-omemo/src/main/java/org/jivesoftware/smackx/omemo/OmemoManager.java:465: warning: no description for @return
25-Mar-2019 01:03:10      * @return
25-Mar-2019 01:03:10        ^
25-Mar-2019 01:03:10 /var/atlassian/bamboo-home/xml-data/build-dir/SMACK-NIGHTLY-JOB1/smack-omemo/src/main/java/org/jivesoftware/smackx/omemo/OmemoManager.java:483: warning: no description for @throws
25-Mar-2019 01:03:10      * @throws SmackException.NotLoggedInException
25-Mar-2019 01:03:10        ^
25-Mar-2019 01:03:10 /var/atlassian/bamboo-home/xml-data/build-dir/SMACK-NIGHTLY-JOB1/smack-omemo/src/main/java/org/jivesoftware/smackx/omemo/OmemoManager.java:484: warning: no description for @throws
25-Mar-2019 01:03:10      * @throws InterruptedException
25-Mar-2019 01:03:10        ^
25-Mar-2019 01:03:10 /var/atlassian/bamboo-home/xml-data/build-dir/SMACK-NIGHTLY-JOB1/smack-omemo/src/main/java/org/jivesoftware/smackx/omemo/OmemoManager.java:485: warning: no description for @throws
25-Mar-2019 01:03:10      * @throws SmackException.NoResponseException
25-Mar-2019 01:03:10        ^
25-Mar-2019 01:03:10 /var/atlassian/bamboo-home/xml-data/build-dir/SMACK-NIGHTLY-JOB1/smack-omemo/src/main/java/org/jivesoftware/smackx/omemo/OmemoManager.java:486: warning: no description for @throws
25-Mar-2019 01:03:10      * @throws NoSuchAlgorithmException
25-Mar-2019 01:03:10        ^
25-Mar-2019 01:03:10 /var/atlassian/bamboo-home/xml-data/build-dir/SMACK-NIGHTLY-JOB1/smack-omemo/src/main/java/org/jivesoftware/smackx/omemo/OmemoManager.java:487: warning: no description for @throws
25-Mar-2019 01:03:10      * @throws SmackException.NotConnectedException
25-Mar-2019 01:03:10        ^
25-Mar-2019 01:03:10 /var/atlassian/bamboo-home/xml-data/build-dir/SMACK-NIGHTLY-JOB1/smack-omemo/src/main/java/org/jivesoftware/smackx/omemo/OmemoManager.java:513: warning: no description for @throws
25-Mar-2019 01:03:10      * @throws SmackException.NotConnectedException
25-Mar-2019 01:03:10        ^
25-Mar-2019 01:03:10 /var/atlassian/bamboo-home/xml-data/build-dir/SMACK-NIGHTLY-JOB1/smack-omemo/src/main/java/org/jivesoftware/smackx/omemo/OmemoManager.java:514: warning: no description for @throws
25-Mar-2019 01:03:10      * @throws InterruptedException
25-Mar-2019 01:03:10        ^
25-Mar-2019 01:03:10 /var/atlassian/bamboo-home/xml-data/build-dir/SMACK-NIGHTLY-JOB1/smack-omemo/src/main/java/org/jivesoftware/smackx/omemo/OmemoManager.java:515: warning: no description for @throws
25-Mar-2019 01:03:10      * @throws SmackException.NoResponseException
25-Mar-2019 01:03:10        ^
25-Mar-2019 01:03:10 /var/atlassian/bamboo-home/xml-data/build-dir/SMACK-NIGHTLY-JOB1/smack-omemo/src/main/java/org/jivesoftware/smackx/omemo/OmemoManager.java:516: warning: no description for @throws
25-Mar-2019 01:03:10      * @throws PubSubException.NotALeafNodeException
25-Mar-2019 01:03:10        ^
25-Mar-2019 01:03:10 /var/atlassian/bamboo-home/xml-data/build-dir/SMACK-NIGHTLY-JOB1/smack-omemo/src/main/java/org/jivesoftware/smackx/omemo/OmemoManager.java:517: warning: no description for @throws
25-Mar-2019 01:03:10      * @throws XMPPException.XMPPErrorException
25-Mar-2019 01:03:10        ^
25-Mar-2019 01:03:10 /var/atlassian/bamboo-home/xml-data/build-dir/SMACK-NIGHTLY-JOB1/smack-omemo/src/main/java/org/jivesoftware/smackx/omemo/OmemoManager.java:553: warning: no description for @throws
25-Mar-2019 01:03:10      * @throws XMPPException.XMPPErrorException
25-Mar-2019 01:03:10        ^
25-Mar-2019 01:03:10 /var/atlassian/bamboo-home/xml-data/build-dir/SMACK-NIGHTLY-JOB1/smack-omemo/src/main/java/org/jivesoftware/smackx/omemo/OmemoManager.java:554: warning: no description for @throws
25-Mar-2019 01:03:10      * @throws SmackException.NotConnectedException
25-Mar-2019 01:03:10        ^
25-Mar-2019 01:03:10 /var/atlassian/bamboo-home/xml-data/build-dir/SMACK-NIGHTLY-JOB1/smack-omemo/src/main/java/org/jivesoftware/smackx/omemo/OmemoManager.java:555: warning: no description for @throws
25-Mar-2019 01:03:10      * @throws InterruptedException
25-Mar-2019 01:03:10        ^
25-Mar-2019 01:03:10 /var/atlassian/bamboo-home/xml-data/build-dir/SMACK-NIGHTLY-JOB1/smack-omemo/src/main/java/org/jivesoftware/smackx/omemo/OmemoManager.java:556: warning: no description for @throws
25-Mar-2019 01:03:10      * @throws SmackException.NoResponseException
25-Mar-2019 01:03:10        ^
25-Mar-2019 01:03:10 /var/atlassian/bamboo-home/xml-data/build-dir/SMACK-NIGHTLY-JOB1/smack-omemo/src/main/java/org/jivesoftware/smackx/omemo/OmemoManager.java:588: warning: no description for @throws
25-Mar-2019 01:03:10      * @throws SmackException.NotLoggedInException
25-Mar-2019 01:03:10        ^
25-Mar-2019 01:03:10 /var/atlassian/bamboo-home/xml-data/build-dir/SMACK-NIGHTLY-JOB1/smack-omemo/src/main/java/org/jivesoftware/smackx/omemo/OmemoManager.java:590: warning: no description for @throws
25-Mar-2019 01:03:10      * @throws SmackException.NotConnectedException
25-Mar-2019 01:03:10        ^
25-Mar-2019 01:03:10 /var/atlassian/bamboo-home/xml-data/build-dir/SMACK-NIGHTLY-JOB1/smack-omemo/src/main/java/org/jivesoftware/smackx/omemo/OmemoManager.java:591: warning: no description for @throws
25-Mar-2019 01:03:10      * @throws InterruptedException
25-Mar-2019 01:03:10        ^
25-Mar-2019 01:03:10 /var/atlassian/bamboo-home/xml-data/build-dir/SMACK-NIGHTLY-JOB1/smack-omemo/src/main/java/org/jivesoftware/smackx/omemo/OmemoManager.java:592: warning: no description for @throws
25-Mar-2019 01:03:10      * @throws SmackException.NoResponseException
25-Mar-2019 01:03:10        ^
25-Mar-2019 01:03:10 /var/atlassian/bamboo-home/xml-data/build-dir/SMACK-NIGHTLY-JOB1/smack-omemo/src/main/java/org/jivesoftware/smackx/omemo/OmemoManager.java:617: warning: no description for @throws
25-Mar-2019 01:03:10      * @throws SmackException.NotLoggedInException
25-Mar-2019 01:03:10        ^
25-Mar-2019 01:03:10 /var/atlassian/bamboo-home/xml-data/build-dir/SMACK-NIGHTLY-JOB1/smack-omemo/src/main/java/org/jivesoftware/smackx/omemo/OmemoManager.java:618: warning: no description for @throws
25-Mar-2019 01:03:10      * @throws CorruptedOmemoKeyException
25-Mar-2019 01:03:10        ^
25-Mar-2019 01:03:10 /var/atlassian/bamboo-home/xml-data/build-dir/SMACK-NIGHTLY-JOB1/smack-omemo/src/main/java/org/jivesoftware/smackx/omemo/OmemoManager.java:619: warning: no description for @throws
25-Mar-2019 01:03:10      * @throws CannotEstablishOmemoSessionException
25-Mar-2019 01:03:10        ^
25-Mar-2019 01:03:10 /var/atlassian/bamboo-home/xml-data/build-dir/SMACK-NIGHTLY-JOB1/smack-omemo/src/main/java/org/jivesoftware/smackx/omemo/OmemoManager.java:620: warning: no description for @throws
25-Mar-2019 01:03:10      * @throws SmackException.NotConnectedException
25-Mar-2019 01:03:10        ^
25-Mar-2019 01:03:10 /var/atlassian/bamboo-home/xml-data/build-dir/SMACK-NIGHTLY-JOB1/smack-omemo/src/main/java/org/jivesoftware/smackx/omemo/OmemoManager.java:621: warning: no description for @throws
25-Mar-2019 01:03:10      * @throws InterruptedException
25-Mar-2019 01:03:10        ^
25-Mar-2019 01:03:10 /var/atlassian/bamboo-home/xml-data/build-dir/SMACK-NIGHTLY-JOB1/smack-omemo/src/main/java/org/jivesoftware/smackx/omemo/OmemoManager.java:622: warning: no description for @throws
25-Mar-2019 01:03:10      * @throws SmackException.NoResponseException
25-Mar-2019 01:03:10        ^
25-Mar-2019 01:03:10 /var/atlassian/bamboo-home/xml-data/build-dir/SMACK-NIGHTLY-JOB1/smack-omemo/src/main/java/org/jivesoftware/smackx/omemo/OmemoManager.java:689: warning: no description for @throws
25-Mar-2019 01:03:10      * @throws InterruptedException
25-Mar-2019 01:03:10        ^
25-Mar-2019 01:03:10 /var/atlassian/bamboo-home/xml-data/build-dir/SMACK-NIGHTLY-JOB1/smack-omemo/src/main/java/org/jivesoftware/smackx/omemo/OmemoManager.java:690: warning: no description for @throws
25-Mar-2019 01:03:10      * @throws PubSubException.NotALeafNodeException
25-Mar-2019 01:03:10        ^
25-Mar-2019 01:03:10 /var/atlassian/bamboo-home/xml-data/build-dir/SMACK-NIGHTLY-JOB1/smack-omemo/src/main/java/org/jivesoftware/smackx/omemo/OmemoManager.java:691: warning: no description for @throws
25-Mar-2019 01:03:10      * @throws XMPPException.XMPPErrorException
25-Mar-2019 01:03:10        ^
25-Mar-2019 01:03:10 /var/atlassian/bamboo-home/xml-data/build-dir/SMACK-NIGHTLY-JOB1/smack-omemo/src/main/java/org/jivesoftware/smackx/omemo/OmemoManager.java:692: warning: no description for @throws
25-Mar-2019 01:03:10      * @throws SmackException.NotConnectedException
25-Mar-2019 01:03:10        ^
25-Mar-2019 01:03:10 /var/atlassian/bamboo-home/xml-data/build-dir/SMACK-NIGHTLY-JOB1/smack-omemo/src/main/java/org/jivesoftware/smackx/omemo/OmemoManager.java:693: warning: no description for @throws
25-Mar-2019 01:03:10      * @throws SmackException.NoResponseException
25-Mar-2019 01:03:10        ^
25-Mar-2019 01:03:10 /var/atlassian/bamboo-home/xml-data/build-dir/SMACK-NIGHTLY-JOB1/smack-omemo/src/main/java/org/jivesoftware/smackx/omemo/OmemoManager.java:706: warning: no description for @throws
25-Mar-2019 01:03:10      * @throws SmackException.NotLoggedInException
25-Mar-2019 01:03:10        ^
25-Mar-2019 01:03:10 /var/atlassian/bamboo-home/xml-data/build-dir/SMACK-NIGHTLY-JOB1/smack-omemo/src/main/java/org/jivesoftware/smackx/omemo/OmemoManager.java:707: warning: no description for @throws
25-Mar-2019 01:03:10      * @throws InterruptedException
25-Mar-2019 01:03:10        ^
25-Mar-2019 01:03:10 /var/atlassian/bamboo-home/xml-data/build-dir/SMACK-NIGHTLY-JOB1/smack-omemo/src/main/java/org/jivesoftware/smackx/omemo/OmemoManager.java:708: warning: no description for @throws
25-Mar-2019 01:03:10      * @throws XMPPException.XMPPErrorException
25-Mar-2019 01:03:10        ^
25-Mar-2019 01:03:10 /var/atlassian/bamboo-home/xml-data/build-dir/SMACK-NIGHTLY-JOB1/smack-omemo/src/main/java/org/jivesoftware/smackx/omemo/OmemoManager.java:709: warning: no description for @throws
25-Mar-2019 01:03:10      * @throws SmackException.NotConnectedException
25-Mar-2019 01:03:10        ^
25-Mar-2019 01:03:10 /var/atlassian/bamboo-home/xml-data/build-dir/SMACK-NIGHTLY-JOB1/smack-omemo/src/main/java/org/jivesoftware/smackx/omemo/OmemoManager.java:710: warning: no description for @throws
25-Mar-2019 01:03:10      * @throws SmackException.NoResponseException
25-Mar-2019 01:03:10        ^
25-Mar-2019 01:03:10 /var/atlassian/bamboo-home/xml-data/build-dir/SMACK-NIGHTLY-JOB1/smack-omemo/src/main/java/org/jivesoftware/smackx/omemo/OmemoManager.java:730: warning: no description for @throws
25-Mar-2019 01:03:10      * @throws SmackException.NotLoggedInException
25-Mar-2019 01:03:10        ^
25-Mar-2019 01:03:10 /var/atlassian/bamboo-home/xml-data/build-dir/SMACK-NIGHTLY-JOB1/smack-omemo/src/main/java/org/jivesoftware/smackx/omemo/OmemoManager.java:909: warning: no description for @throws
25-Mar-2019 01:03:10      * @throws InterruptedException
25-Mar-2019 01:03:10        ^
25-Mar-2019 01:03:10 /var/atlassian/bamboo-home/xml-data/build-dir/SMACK-NIGHTLY-JOB1/smack-omemo/src/main/java/org/jivesoftware/smackx/omemo/OmemoManager.java:910: warning: no description for @throws
25-Mar-2019 01:03:10      * @throws SmackException.NoResponseException
25-Mar-2019 01:03:10        ^
25-Mar-2019 01:03:10 /var/atlassian/bamboo-home/xml-data/build-dir/SMACK-NIGHTLY-JOB1/smack-omemo/src/main/java/org/jivesoftware/smackx/omemo/OmemoManager.java:912: warning: no description for @throws
25-Mar-2019 01:03:10      * @throws SmackException.NotConnectedException
25-Mar-2019 01:03:10        ^
25-Mar-2019 01:03:10 /var/atlassian/bamboo-home/xml-data/build-dir/SMACK-NIGHTLY-JOB1/smack-omemo/src/main/java/org/jivesoftware/smackx/omemo/OmemoRatchet.java:64: warning: no description for @throws
25-Mar-2019 01:03:10      * @throws CorruptedOmemoKeyException
25-Mar-2019 01:03:10        ^
25-Mar-2019 01:03:10 100 warnings
25-Mar-2019 01:03:11
25-Mar-2019 01:03:11 > Task :smack-omemo:javadocJar
25-Mar-2019 01:03:11 > Task :smack-omemo:sourcesJar
25-Mar-2019 01:03:11 > Task :smack-omemo:signArchives SKIPPED
25-Mar-2019 01:03:11 > Task :smack-omemo:assemble
25-Mar-2019 01:03:11 > Task :smack-omemo:animalsnifferMain UP-TO-DATE
25-Mar-2019 01:03:11 > Task :smack-omemo:checkstyleMain
25-Mar-2019 01:03:11 > Task :smack-omemo:checkstyleTest
25-Mar-2019 01:03:11 > Task :smack-omemo:clirr
25-Mar-2019 01:03:14 > Task :smack-omemo:test
25-Mar-2019 01:03:14 > Task :smack-omemo:check
25-Mar-2019 01:03:14 > Task :smack-omemo:build
25-Mar-2019 01:03:14 > Task :smack-omemo-signal:copyJavadocDocFiles NO-SOURCE
25-Mar-2019 01:03:15 > Task :smack-omemo-signal:javadoc
25-Mar-2019 01:03:15 > Task :smack-omemo-signal:javadocJar
25-Mar-2019 01:03:15 > Task :smack-omemo-signal:sourcesJar
25-Mar-2019 01:03:16 > Task :smack-omemo-signal:compileTestJava
25-Mar-2019 01:03:16 > Task :smack-omemo-signal:processTestResources NO-SOURCE
25-Mar-2019 01:03:16 > Task :smack-omemo-signal:testClasses
25-Mar-2019 01:03:16 > Task :smack-omemo-signal:testJar
25-Mar-2019 01:03:16 > Task :smack-omemo-signal:signArchives SKIPPED
25-Mar-2019 01:03:16 > Task :smack-omemo-signal:assemble
25-Mar-2019 01:03:16 > Task :smack-omemo-signal:animalsnifferMain UP-TO-DATE
25-Mar-2019 01:03:16 > Task :smack-omemo-signal:checkstyleMain
25-Mar-2019 01:03:16 > Task :smack-omemo-signal:checkstyleTest
25-Mar-2019 01:03:16 > Task :smack-omemo-signal:clirr
25-Mar-2019 01:03:19 > Task :smack-omemo-signal:test
25-Mar-2019 01:03:19 > Task :smack-omemo-signal:check
25-Mar-2019 01:03:19 > Task :smack-omemo-signal:build
25-Mar-2019 01:03:19 > Task :smack-omemo-signal-integration-test:compileJava
25-Mar-2019 01:03:19 > Task :smack-omemo-signal-integration-test:processResources NO-SOURCE
25-Mar-2019 01:03:19 > Task :smack-omemo-signal-integration-test:classes
25-Mar-2019 01:03:19 > Task :smack-omemo-signal-integration-test:jar
25-Mar-2019 01:03:19 > Task :smack-omemo-signal-integration-test:startScripts
25-Mar-2019 01:03:20 > Task :smack-omemo-signal-integration-test:distTar
25-Mar-2019 01:03:20 > Task :smack-omemo-signal-integration-test:distZip
25-Mar-2019 01:03:20 > Task :smack-omemo-signal-integration-test:copyJavadocDocFiles NO-SOURCE
25-Mar-2019 01:03:21 > Task :smack-omemo-signal-integration-test:javadoc
25-Mar-2019 01:03:21 > Task :smack-omemo-signal-integration-test:javadocJar
25-Mar-2019 01:03:21 > Task :smack-omemo-signal-integration-test:sourcesJar
25-Mar-2019 01:03:21 > Task :smack-omemo-signal-integration-test:compileTestJava NO-SOURCE
25-Mar-2019 01:03:21 > Task :smack-omemo-signal-integration-test:processTestResources NO-SOURCE
25-Mar-2019 01:03:21 > Task :smack-omemo-signal-integration-test:testClasses UP-TO-DATE
25-Mar-2019 01:03:21 > Task :smack-omemo-signal-integration-test:testJar
25-Mar-2019 01:03:21 > Task :smack-omemo-signal-integration-test:signArchives SKIPPED
25-Mar-2019 01:03:21 > Task :smack-omemo-signal-integration-test:assemble
25-Mar-2019 01:03:21 > Task :smack-omemo-signal-integration-test:checkstyleMain
25-Mar-2019 01:03:21 > Task :smack-omemo-signal-integration-test:checkstyleTest NO-SOURCE
25-Mar-2019 01:03:21 > Task :smack-omemo-signal-integration-test:clirr
25-Mar-2019 01:03:21 > Task :smack-omemo-signal-integration-test:test NO-SOURCE
25-Mar-2019 01:03:21 > Task :smack-omemo-signal-integration-test:check
25-Mar-2019 01:03:21 > Task :smack-omemo-signal-integration-test:build
25-Mar-2019 01:03:21 > Task :smack-openpgp:copyJavadocDocFiles NO-SOURCE
25-Mar-2019 01:03:24 > Task :smack-openpgp:javadoc
25-Mar-2019 01:03:24 > Task :smack-openpgp:javadocJar
25-Mar-2019 01:03:24 > Task :smack-openpgp:sourcesJar
25-Mar-2019 01:03:25 > Task :smack-openpgp:compileTestJava
25-Mar-2019 01:03:25 > Task :smack-openpgp:processTestResources NO-SOURCE
25-Mar-2019 01:03:25 > Task :smack-openpgp:testClasses
25-Mar-2019 01:03:25 > Task :smack-openpgp:testJar
25-Mar-2019 01:03:25 > Task :smack-openpgp:signArchives SKIPPED
25-Mar-2019 01:03:25 > Task :smack-openpgp:assemble
25-Mar-2019 01:03:25 > Task :smack-openpgp:animalsnifferMain UP-TO-DATE
25-Mar-2019 01:03:25 > Task :smack-openpgp:checkstyleMain
25-Mar-2019 01:03:25 > Task :smack-openpgp:checkstyleTest
25-Mar-2019 01:03:25 > Task :smack-openpgp:clirr
25-Mar-2019 01:03:29
25-Mar-2019 01:03:29 > Task :smack-openpgp:test
25-Mar-2019 01:03:29
25-Mar-2019 01:03:29 org.jivesoftware.smackx.ox.PainlessOpenPgpProviderTest > encryptDecryptTest FAILED
25-Mar-2019 01:03:29     java.lang.AssertionError
25-Mar-2019 01:03:29         at org.jivesoftware.smack.util.XmlStringBuilder.escape(XmlStringBuilder.java:425)
25-Mar-2019 01:03:29         at org.jivesoftware.smackx.ox.element.EncryptedOpenPgpContentElement.addCommonXml(EncryptedOpenPgpContentElement.java:65)
25-Mar-2019 01:03:29         at org.jivesoftware.smackx.ox.element.CryptElement.toXML(CryptElement.java:51)
25-Mar-2019 01:03:29         at org.jivesoftware.smackx.ox.element.CryptElement.toXML(CryptElement.java:31)
25-Mar-2019 01:03:29         at org.jivesoftware.smack.packet.Element.toXML(Element.java:41)
25-Mar-2019 01:03:29         at org.jivesoftware.smackx.ox.element.OpenPgpContentElement.toInputStream(OpenPgpContentElement.java:186)
25-Mar-2019 01:03:29         at org.jivesoftware.smackx.ox.crypto.PainlessOpenPgpProvider.encrypt(PainlessOpenPgpProvider.java:136)
25-Mar-2019 01:03:29         at org.jivesoftware.smackx.ox.PainlessOpenPgpProviderTest.encryptDecryptTest(PainlessOpenPgpProviderTest.java:155)
25-Mar-2019 01:03:29
25-Mar-2019 01:03:29 27 tests completed, 1 failed
25-Mar-2019 01:03:29
25-Mar-2019 01:03:29 FAILURE: Build failed with an exception.
25-Mar-2019 01:03:29
25-Mar-2019 01:03:29 * What went wrong:
25-Mar-2019 01:03:29 Execution failed for task ':smack-openpgp:test'.
25-Mar-2019 01:03:29 > There were failing tests. See the report at: file:///var/atlassian/bamboo-home/xml-data/build-dir/SMACK-NIGHTLY-JOB1/smack-openpgp/build/reports/tests/test/index.html
25-Mar-2019 01:03:29
25-Mar-2019 01:03:29 * Try:
25-Mar-2019 01:03:29 Run with --info or --debug option to get more log output. Run with --scan to get full insights.
25-Mar-2019 01:03:29
25-Mar-2019 01:03:29 * Exception is:
25-Mar-2019 01:03:29 org.gradle.api.tasks.TaskExecutionException: Execution failed for task ':smack-openpgp:test'.
25-Mar-2019 01:03:29         at org.gradle.api.internal.tasks.execution.ExecuteActionsTaskExecuter$2.accept(ExecuteActionsTaskExecuter.java:121)
25-Mar-2019 01:03:29         at org.gradle.api.internal.tasks.execution.ExecuteActionsTaskExecuter$2.accept(ExecuteActionsTaskExecuter.java:117)
25-Mar-2019 01:03:29         at org.gradle.internal.Try$Failure.ifSuccessfulOrElse(Try.java:184)
25-Mar-2019 01:03:29         at org.gradle.api.internal.tasks.execution.ExecuteActionsTaskExecuter.execute(ExecuteActionsTaskExecuter.java:110)
25-Mar-2019 01:03:29         at org.gradle.api.internal.tasks.execution.ResolveIncrementalChangesTaskExecuter.execute(ResolveIncrementalChangesTaskExecuter.java:84)
25-Mar-2019 01:03:29         at org.gradle.api.internal.tasks.execution.ResolveTaskOutputCachingStateExecuter.execute(ResolveTaskOutputCachingStateExecuter.java:91)
25-Mar-2019 01:03:29         at org.gradle.api.internal.tasks.execution.ResolveBeforeExecutionStateTaskExecuter.execute(ResolveBeforeExecutionStateTaskExecuter.java:74)
25-Mar-2019 01:03:29         at org.gradle.api.internal.tasks.execution.ValidatingTaskExecuter.execute(ValidatingTaskExecuter.java:58)
25-Mar-2019 01:03:29         at org.gradle.api.internal.tasks.execution.SkipEmptySourceFilesTaskExecuter.execute(SkipEmptySourceFilesTaskExecuter.java:109)
25-Mar-2019 01:03:29         at org.gradle.api.internal.tasks.execution.ResolveBeforeExecutionOutputsTaskExecuter.execute(ResolveBeforeExecutionOutputsTaskExecuter.java:67)
25-Mar-2019 01:03:29         at org.gradle.api.internal.tasks.execution.ResolveAfterPreviousExecutionStateTaskExecuter.execute(ResolveAfterPreviousExecutionStateTaskExecuter.java:46)
25-Mar-2019 01:03:29         at org.gradle.api.internal.tasks.execution.CleanupStaleOutputsExecuter.execute(CleanupStaleOutputsExecuter.java:93)
25-Mar-2019 01:03:29         at org.gradle.api.internal.tasks.execution.FinalizePropertiesTaskExecuter.execute(FinalizePropertiesTaskExecuter.java:45)
25-Mar-2019 01:03:29         at org.gradle.api.internal.tasks.execution.ResolveTaskExecutionModeExecuter.execute(ResolveTaskExecutionModeExecuter.java:94)
25-Mar-2019 01:03:29         at org.gradle.api.internal.tasks.execution.SkipTaskWithNoActionsExecuter.execute(SkipTaskWithNoActionsExecuter.java:57)
25-Mar-2019 01:03:29         at org.gradle.api.internal.tasks.execution.SkipOnlyIfTaskExecuter.execute(SkipOnlyIfTaskExecuter.java:56)
25-Mar-2019 01:03:29         at org.gradle.api.internal.tasks.execution.CatchExceptionTaskExecuter.execute(CatchExceptionTaskExecuter.java:36)
25-Mar-2019 01:03:29         at org.gradle.api.internal.tasks.execution.EventFiringTaskExecuter$1.executeTask(EventFiringTaskExecuter.java:63)
25-Mar-2019 01:03:29         at org.gradle.api.internal.tasks.execution.EventFiringTaskExecuter$1.call(EventFiringTaskExecuter.java:49)
25-Mar-2019 01:03:29         at org.gradle.api.internal.tasks.execution.EventFiringTaskExecuter$1.call(EventFiringTaskExecuter.java:46)
25-Mar-2019 01:03:29         at org.gradle.internal.operations.DefaultBuildOperationExecutor$CallableBuildOperationWorker.execute(DefaultBuildOperationExecutor.java:416)
25-Mar-2019 01:03:29         at org.gradle.internal.operations.DefaultBuildOperationExecutor$CallableBuildOperationWorker.execute(DefaultBuildOperationExecutor.java:406)
25-Mar-2019 01:03:29         at org.gradle.internal.operations.DefaultBuildOperationExecutor$1.execute(DefaultBuildOperationExecutor.java:165)
25-Mar-2019 01:03:29         at org.gradle.internal.operations.DefaultBuildOperationExecutor.execute(DefaultBuildOperationExecutor.java:250)
25-Mar-2019 01:03:29         at org.gradle.internal.operations.DefaultBuildOperationExecutor.execute(DefaultBuildOperationExecutor.java:158)
25-Mar-2019 01:03:29         at org.gradle.internal.operations.DefaultBuildOperationExecutor.call(DefaultBuildOperationExecutor.java:102)
25-Mar-2019 01:03:29         at org.gradle.internal.operations.DelegatingBuildOperationExecutor.call(DelegatingBuildOperationExecutor.java:36)
25-Mar-2019 01:03:29         at org.gradle.api.internal.tasks.execution.EventFiringTaskExecuter.execute(EventFiringTaskExecuter.java:46)
25-Mar-2019 01:03:29         at org.gradle.execution.plan.LocalTaskNodeExecutor.execute(LocalTaskNodeExecutor.java:43)
25-Mar-2019 01:03:29         at org.gradle.execution.taskgraph.DefaultTaskExecutionGraph$InvokeNodeExecutorsAction.execute(DefaultTaskExecutionGraph.java:355)
25-Mar-2019 01:03:29         at org.gradle.execution.taskgraph.DefaultTaskExecutionGraph$InvokeNodeExecutorsAction.execute(DefaultTaskExecutionGraph.java:343)
25-Mar-2019 01:03:29         at org.gradle.execution.taskgraph.DefaultTaskExecutionGraph$BuildOperationAwareExecutionAction.execute(DefaultTaskExecutionGraph.java:336)
25-Mar-2019 01:03:29         at org.gradle.execution.taskgraph.DefaultTaskExecutionGraph$BuildOperationAwareExecutionAction.execute(DefaultTaskExecutionGraph.java:322)
25-Mar-2019 01:03:29         at org.gradle.execution.plan.DefaultPlanExecutor$ExecutorWorker$1.execute(DefaultPlanExecutor.java:134)
25-Mar-2019 01:03:29         at org.gradle.execution.plan.DefaultPlanExecutor$ExecutorWorker$1.execute(DefaultPlanExecutor.java:129)
25-Mar-2019 01:03:29         at org.gradle.execution.plan.DefaultPlanExecutor$ExecutorWorker.execute(DefaultPlanExecutor.java:202)
25-Mar-2019 01:03:29         at org.gradle.execution.plan.DefaultPlanExecutor$ExecutorWorker.executeNextNode(DefaultPlanExecutor.java:193)
25-Mar-2019 01:03:29         at org.gradle.execution.plan.DefaultPlanExecutor$ExecutorWorker.run(DefaultPlanExecutor.java:129)
25-Mar-2019 01:03:29         at org.gradle.execution.plan.DefaultPlanExecutor.process(DefaultPlanExecutor.java:74)
25-Mar-2019 01:03:29         at org.gradle.execution.taskgraph.DefaultTaskExecutionGraph.executeWithServices(DefaultTaskExecutionGraph.java:178)
25-Mar-2019 01:03:29         at org.gradle.execution.taskgraph.DefaultTaskExecutionGraph.execute(DefaultTaskExecutionGraph.java:154)
25-Mar-2019 01:03:29         at org.gradle.execution.SelectedTaskExecutionAction.execute(SelectedTaskExecutionAction.java:41)
25-Mar-2019 01:03:29         at org.gradle.execution.DefaultBuildExecuter.execute(DefaultBuildExecuter.java:40)
25-Mar-2019 01:03:29         at org.gradle.execution.DefaultBuildExecuter.access$000(DefaultBuildExecuter.java:24)
25-Mar-2019 01:03:29         at org.gradle.execution.DefaultBuildExecuter$1.proceed(DefaultBuildExecuter.java:46)
25-Mar-2019 01:03:29         at org.gradle.execution.DryRunBuildExecutionAction.execute(DryRunBuildExecutionAction.java:49)
25-Mar-2019 01:03:29         at org.gradle.execution.DefaultBuildExecuter.execute(DefaultBuildExecuter.java:40)
25-Mar-2019 01:03:29         at org.gradle.execution.DefaultBuildExecuter.execute(DefaultBuildExecuter.java:33)
25-Mar-2019 01:03:29         at org.gradle.initialization.DefaultGradleLauncher$ExecuteTasks.run(DefaultGradleLauncher.java:383)
25-Mar-2019 01:03:29         at org.gradle.internal.operations.DefaultBuildOperationExecutor$RunnableBuildOperationWorker.execute(DefaultBuildOperationExecutor.java:402)
25-Mar-2019 01:03:29         at org.gradle.internal.operations.DefaultBuildOperationExecutor$RunnableBuildOperationWorker.execute(DefaultBuildOperationExecutor.java:394)
25-Mar-2019 01:03:29         at org.gradle.internal.operations.DefaultBuildOperationExecutor$1.execute(DefaultBuildOperationExecutor.java:165)
25-Mar-2019 01:03:29         at org.gradle.internal.operations.DefaultBuildOperationExecutor.execute(DefaultBuildOperationExecutor.java:250)
25-Mar-2019 01:03:29         at org.gradle.internal.operations.DefaultBuildOperationExecutor.execute(DefaultBuildOperationExecutor.java:158)
25-Mar-2019 01:03:29         at org.gradle.internal.operations.DefaultBuildOperationExecutor.run(DefaultBuildOperationExecutor.java:92)
25-Mar-2019 01:03:29         at org.gradle.internal.operations.DelegatingBuildOperationExecutor.run(DelegatingBuildOperationExecutor.java:31)
25-Mar-2019 01:03:29         at org.gradle.initialization.DefaultGradleLauncher.runTasks(DefaultGradleLauncher.java:247)
25-Mar-2019 01:03:29         at org.gradle.initialization.DefaultGradleLauncher.doBuildStages(DefaultGradleLauncher.java:159)
25-Mar-2019 01:03:29         at org.gradle.initialization.DefaultGradleLauncher.executeTasks(DefaultGradleLauncher.java:134)
25-Mar-2019 01:03:29         at org.gradle.internal.invocation.GradleBuildController$1.execute(GradleBuildController.java:58)
25-Mar-2019 01:03:29         at org.gradle.internal.invocation.GradleBuildController$1.execute(GradleBuildController.java:55)
25-Mar-2019 01:03:29         at org.gradle.internal.invocation.GradleBuildController$3.create(GradleBuildController.java:82)
25-Mar-2019 01:03:29         at org.gradle.internal.invocation.GradleBuildController$3.create(GradleBuildController.java:75)
25-Mar-2019 01:03:29         at org.gradle.internal.work.DefaultWorkerLeaseService.withLocks(DefaultWorkerLeaseService.java:183)
25-Mar-2019 01:03:29         at org.gradle.internal.work.StopShieldingWorkerLeaseService.withLocks(StopShieldingWorkerLeaseService.java:40)
25-Mar-2019 01:03:29         at org.gradle.internal.invocation.GradleBuildController.doBuild(GradleBuildController.java:75)
25-Mar-2019 01:03:29         at org.gradle.internal.invocation.GradleBuildController.run(GradleBuildController.java:55)
25-Mar-2019 01:03:29         at org.gradle.tooling.internal.provider.ExecuteBuildActionRunner.run(ExecuteBuildActionRunner.java:31)
25-Mar-2019 01:03:29         at org.gradle.launcher.exec.ChainingBuildActionRunner.run(ChainingBuildActionRunner.java:35)
25-Mar-2019 01:03:29         at org.gradle.launcher.exec.BuildOutcomeReportingBuildActionRunner.run(BuildOutcomeReportingBuildActionRunner.java:58)
25-Mar-2019 01:03:29         at org.gradle.tooling.internal.provider.ValidatingBuildActionRunner.run(ValidatingBuildActionRunner.java:32)
25-Mar-2019 01:03:29         at org.gradle.launcher.exec.BuildCompletionNotifyingBuildActionRunner.run(BuildCompletionNotifyingBuildActionRunner.java:39)
25-Mar-2019 01:03:29         at org.gradle.launcher.exec.RunAsBuildOperationBuildActionRunner$3.call(RunAsBuildOperationBuildActionRunner.java:49)
25-Mar-2019 01:03:29         at org.gradle.launcher.exec.RunAsBuildOperationBuildActionRunner$3.call(RunAsBuildOperationBuildActionRunner.java:44)
25-Mar-2019 01:03:29         at org.gradle.internal.operations.DefaultBuildOperationExecutor$CallableBuildOperationWorker.execute(DefaultBuildOperationExecutor.java:416)
25-Mar-2019 01:03:29         at org.gradle.internal.operations.DefaultBuildOperationExecutor$CallableBuildOperationWorker.execute(DefaultBuildOperationExecutor.java:406)
25-Mar-2019 01:03:29         at org.gradle.internal.operations.DefaultBuildOperationExecutor$1.execute(DefaultBuildOperationExecutor.java:165)
25-Mar-2019 01:03:29         at org.gradle.internal.operations.DefaultBuildOperationExecutor.execute(DefaultBuildOperationExecutor.java:250)
25-Mar-2019 01:03:29         at org.gradle.internal.operations.DefaultBuildOperationExecutor.execute(DefaultBuildOperationExecutor.java:158)
25-Mar-2019 01:03:29         at org.gradle.internal.operations.DefaultBuildOperationExecutor.call(DefaultBuildOperationExecutor.java:102)
25-Mar-2019 01:03:29         at org.gradle.internal.operations.DelegatingBuildOperationExecutor.call(DelegatingBuildOperationExecutor.java:36)
25-Mar-2019 01:03:29         at org.gradle.launcher.exec.RunAsBuildOperationBuildActionRunner.run(RunAsBuildOperationBuildActionRunner.java:44)
25-Mar-2019 01:03:29         at org.gradle.launcher.exec.InProcessBuildActionExecuter$1.transform(InProcessBuildActionExecuter.java:49)
25-Mar-2019 01:03:29         at org.gradle.launcher.exec.InProcessBuildActionExecuter$1.transform(InProcessBuildActionExecuter.java:46)
25-Mar-2019 01:03:29         at org.gradle.composite.internal.DefaultRootBuildState.run(DefaultRootBuildState.java:78)
25-Mar-2019 01:03:29         at org.gradle.launcher.exec.InProcessBuildActionExecuter.execute(InProcessBuildActionExecuter.java:46)
25-Mar-2019 01:03:29         at org.gradle.launcher.exec.InProcessBuildActionExecuter.execute(InProcessBuildActionExecuter.java:31)
25-Mar-2019 01:03:29         at org.gradle.launcher.exec.BuildTreeScopeBuildActionExecuter.execute(BuildTreeScopeBuildActionExecuter.java:42)
25-Mar-2019 01:03:29         at org.gradle.launcher.exec.BuildTreeScopeBuildActionExecuter.execute(BuildTreeScopeBuildActionExecuter.java:28)
25-Mar-2019 01:03:29         at org.gradle.tooling.internal.provider.ContinuousBuildActionExecuter.execute(ContinuousBuildActionExecuter.java:78)
25-Mar-2019 01:03:29         at org.gradle.tooling.internal.provider.ContinuousBuildActionExecuter.execute(ContinuousBuildActionExecuter.java:52)
25-Mar-2019 01:03:29         at org.gradle.tooling.internal.provider.SubscribableBuildActionExecuter.execute(SubscribableBuildActionExecuter.java:59)
25-Mar-2019 01:03:29         at org.gradle.tooling.internal.provider.SubscribableBuildActionExecuter.execute(SubscribableBuildActionExecuter.java:36)
25-Mar-2019 01:03:29         at org.gradle.tooling.internal.provider.SessionScopeBuildActionExecuter.execute(SessionScopeBuildActionExecuter.java:68)
25-Mar-2019 01:03:29         at org.gradle.tooling.internal.provider.SessionScopeBuildActionExecuter.execute(SessionScopeBuildActionExecuter.java:38)
25-Mar-2019 01:03:29         at org.gradle.tooling.internal.provider.GradleThreadBuildActionExecuter.execute(GradleThreadBuildActionExecuter.java:37)
25-Mar-2019 01:03:29         at org.gradle.tooling.internal.provider.GradleThreadBuildActionExecuter.execute(GradleThreadBuildActionExecuter.java:26)
25-Mar-2019 01:03:29         at org.gradle.tooling.internal.provider.ParallelismConfigurationBuildActionExecuter.execute(ParallelismConfigurationBuildActionExecuter.java:43)
25-Mar-2019 01:03:29         at org.gradle.tooling.internal.provider.ParallelismConfigurationBuildActionExecuter.execute(ParallelismConfigurationBuildActionExecuter.java:29)
25-Mar-2019 01:03:29         at org.gradle.tooling.internal.provider.StartParamsValidatingActionExecuter.execute(StartParamsValidatingActionExecuter.java:60)
25-Mar-2019 01:03:29         at org.gradle.tooling.internal.provider.StartParamsValidatingActionExecuter.execute(StartParamsValidatingActionExecuter.java:32)
25-Mar-2019 01:03:29         at org.gradle.tooling.internal.provider.SessionFailureReportingActionExecuter.execute(SessionFailureReportingActionExecuter.java:55)
25-Mar-2019 01:03:29         at org.gradle.tooling.internal.provider.SessionFailureReportingActionExecuter.execute(SessionFailureReportingActionExecuter.java:41)
25-Mar-2019 01:03:29         at org.gradle.tooling.internal.provider.SetupLoggingActionExecuter.execute(SetupLoggingActionExecuter.java:48)
25-Mar-2019 01:03:29         at org.gradle.tooling.internal.provider.SetupLoggingActionExecuter.execute(SetupLoggingActionExecuter.java:32)
25-Mar-2019 01:03:29         at org.gradle.launcher.daemon.server.exec.ExecuteBuild.doBuild(ExecuteBuild.java:67)
25-Mar-2019 01:03:29         at org.gradle.launcher.daemon.server.exec.BuildCommandOnly.execute(BuildCommandOnly.java:36)
25-Mar-2019 01:03:29         at org.gradle.launcher.daemon.server.api.DaemonCommandExecution.proceed(DaemonCommandExecution.java:104)
25-Mar-2019 01:03:29         at org.gradle.launcher.daemon.server.exec.WatchForDisconnection.execute(WatchForDisconnection.java:37)
25-Mar-2019 01:03:29         at org.gradle.launcher.daemon.server.api.DaemonCommandExecution.proceed(DaemonCommandExecution.java:104)
25-Mar-2019 01:03:29         at org.gradle.launcher.daemon.server.exec.ResetDeprecationLogger.execute(ResetDeprecationLogger.java:26)
25-Mar-2019 01:03:29         at org.gradle.launcher.daemon.server.api.DaemonCommandExecution.proceed(DaemonCommandExecution.java:104)
25-Mar-2019 01:03:29         at org.gradle.launcher.daemon.server.exec.RequestStopIfSingleUsedDaemon.execute(RequestStopIfSingleUsedDaemon.java:34)
25-Mar-2019 01:03:29         at org.gradle.launcher.daemon.server.api.DaemonCommandExecution.proceed(DaemonCommandExecution.java:104)
25-Mar-2019 01:03:29         at org.gradle.launcher.daemon.server.exec.ForwardClientInput$2.call(ForwardClientInput.java:74)
25-Mar-2019 01:03:29         at org.gradle.launcher.daemon.server.exec.ForwardClientInput$2.call(ForwardClientInput.java:72)
25-Mar-2019 01:03:29         at org.gradle.util.Swapper.swap(Swapper.java:38)
25-Mar-2019 01:03:29         at org.gradle.launcher.daemon.server.exec.ForwardClientInput.execute(ForwardClientInput.java:72)
25-Mar-2019 01:03:29         at org.gradle.launcher.daemon.server.api.DaemonCommandExecution.proceed(DaemonCommandExecution.java:104)
25-Mar-2019 01:03:29         at org.gradle.launcher.daemon.server.exec.LogAndCheckHealth.execute(LogAndCheckHealth.java:50)
25-Mar-2019 01:03:29         at org.gradle.launcher.daemon.server.api.DaemonCommandExecution.proceed(DaemonCommandExecution.java:104)
25-Mar-2019 01:03:29         at org.gradle.launcher.daemon.server.exec.LogToClient.doBuild(LogToClient.java:62)
25-Mar-2019 01:03:29         at org.gradle.launcher.daemon.server.exec.BuildCommandOnly.execute(BuildCommandOnly.java:36)
25-Mar-2019 01:03:29         at org.gradle.launcher.daemon.server.api.DaemonCommandExecution.proceed(DaemonCommandExecution.java:104)
25-Mar-2019 01:03:29         at org.gradle.launcher.daemon.server.exec.EstablishBuildEnvironment.doBuild(EstablishBuildEnvironment.java:81)
25-Mar-2019 01:03:29         at org.gradle.launcher.daemon.server.exec.BuildCommandOnly.execute(BuildCommandOnly.java:36)
25-Mar-2019 01:03:29         at org.gradle.launcher.daemon.server.api.DaemonCommandExecution.proceed(DaemonCommandExecution.java:104)
25-Mar-2019 01:03:29         at org.gradle.launcher.daemon.server.exec.StartBuildOrRespondWithBusy$1.run(StartBuildOrRespondWithBusy.java:50)
25-Mar-2019 01:03:29         at org.gradle.launcher.daemon.server.DaemonStateCoordinator$1.run(DaemonStateCoordinator.java:295)
25-Mar-2019 01:03:29         at org.gradle.internal.concurrent.ExecutorPolicy$CatchAndRecordFailures.onExecute(ExecutorPolicy.java:63)
25-Mar-2019 01:03:29         at org.gradle.internal.concurrent.ManagedExecutorImpl$1.run(ManagedExecutorImpl.java:46)
25-Mar-2019 01:03:29         at org.gradle.internal.concurrent.ThreadFactoryImpl$ManagedThreadRunnable.run(ThreadFactoryImpl.java:55)
25-Mar-2019 01:03:29 Caused by: org.gradle.api.GradleException: There were failing tests. See the report at: file:///var/atlassian/bamboo-home/xml-data/build-dir/SMACK-NIGHTLY-JOB1/smack-openpgp/build/reports/tests/test/index.html
25-Mar-2019 01:03:29         at org.gradle.api.tasks.testing.AbstractTestTask.handleTestFailures(AbstractTestTask.java:626)
25-Mar-2019 01:03:29         at org.gradle.api.tasks.testing.AbstractTestTask.executeTests(AbstractTestTask.java:498)
25-Mar-2019 01:03:29         at org.gradle.api.tasks.testing.Test.executeTests(Test.java:587)
25-Mar-2019 01:03:29         at org.gradle.internal.reflect.JavaMethod.invoke(JavaMethod.java:103)
25-Mar-2019 01:03:29         at org.gradle.api.internal.project.taskfactory.StandardTaskAction.doExecute(StandardTaskAction.java:48)
25-Mar-2019 01:03:29         at org.gradle.api.internal.project.taskfactory.StandardTaskAction.execute(StandardTaskAction.java:41)
25-Mar-2019 01:03:29         at org.gradle.api.internal.project.taskfactory.StandardTaskAction.execute(StandardTaskAction.java:28)
25-Mar-2019 01:03:29         at org.gradle.api.internal.AbstractTask$TaskActionWrapper.execute(AbstractTask.java:705)
25-Mar-2019 01:03:29         at org.gradle.api.internal.AbstractTask$TaskActionWrapper.execute(AbstractTask.java:672)
25-Mar-2019 01:03:29         at org.gradle.api.internal.tasks.execution.ExecuteActionsTaskExecuter$4.run(ExecuteActionsTaskExecuter.java:338)
25-Mar-2019 01:03:29         at org.gradle.internal.operations.DefaultBuildOperationExecutor$RunnableBuildOperationWorker.execute(DefaultBuildOperationExecutor.java:402)
25-Mar-2019 01:03:29         at org.gradle.internal.operations.DefaultBuildOperationExecutor$RunnableBuildOperationWorker.execute(DefaultBuildOperationExecutor.java:394)
25-Mar-2019 01:03:29         at org.gradle.internal.operations.DefaultBuildOperationExecutor$1.execute(DefaultBuildOperationExecutor.java:165)
25-Mar-2019 01:03:29         at org.gradle.internal.operations.DefaultBuildOperationExecutor.execute(DefaultBuildOperationExecutor.java:250)
25-Mar-2019 01:03:29         at org.gradle.internal.operations.DefaultBuildOperationExecutor.execute(DefaultBuildOperationExecutor.java:158)
25-Mar-2019 01:03:29         at org.gradle.internal.operations.DefaultBuildOperationExecutor.run(DefaultBuildOperationExecutor.java:92)
25-Mar-2019 01:03:29
25-Mar-2019 01:03:29 > Task :smack-openpgp:test FAILED
25-Mar-2019 01:03:29         at org.gradle.internal.operations.DelegatingBuildOperationExecutor.run(DelegatingBuildOperationExecutor.java:31)
25-Mar-2019 01:03:29         at org.gradle.api.internal.tasks.execution.ExecuteActionsTaskExecuter.executeAction(ExecuteActionsTaskExecuter.java:327)
25-Mar-2019 01:03:29         at org.gradle.api.internal.tasks.execution.ExecuteActionsTaskExecuter.executeActions(ExecuteActionsTaskExecuter.java:312)
25-Mar-2019 01:03:29         at org.gradle.api.internal.tasks.execution.ExecuteActionsTaskExecuter.access$200(ExecuteActionsTaskExecuter.java:75)
25-Mar-2019 01:03:29         at org.gradle.api.internal.tasks.execution.ExecuteActionsTaskExecuter$TaskExecution.execute(ExecuteActionsTaskExecuter.java:158)
25-Mar-2019 01:03:29         at org.gradle.internal.execution.impl.steps.ExecuteStep.execute(ExecuteStep.java:46)
25-Mar-2019 01:03:29         at org.gradle.internal.execution.impl.steps.CancelExecutionStep.execute(CancelExecutionStep.java:34)
25-Mar-2019 01:03:29         at org.gradle.internal.execution.impl.steps.TimeoutStep.executeWithoutTimeout(TimeoutStep.java:69)
25-Mar-2019 01:03:29         at org.gradle.internal.execution.impl.steps.TimeoutStep.execute(TimeoutStep.java:49)
25-Mar-2019 01:03:29         at org.gradle.internal.execution.impl.steps.CatchExceptionStep.execute(CatchExceptionStep.java:34)
25-Mar-2019 01:03:29         at org.gradle.internal.execution.impl.steps.CreateOutputsStep.execute(CreateOutputsStep.java:49)
25-Mar-2019 01:03:29         at org.gradle.internal.execution.impl.steps.SnapshotOutputStep.execute(SnapshotOutputStep.java:42)
25-Mar-2019 01:03:29         at org.gradle.internal.execution.impl.steps.SnapshotOutputStep.execute(SnapshotOutputStep.java:28)
25-Mar-2019 01:03:29         at org.gradle.internal.execution.impl.steps.CacheStep.executeWithoutCache(CacheStep.java:133)
25-Mar-2019 01:03:29         at org.gradle.internal.execution.impl.steps.CacheStep.lambda$execute$5(CacheStep.java:83)
25-Mar-2019 01:03:29         at org.gradle.internal.execution.impl.steps.CacheStep.execute(CacheStep.java:82)
25-Mar-2019 01:03:29         at org.gradle.internal.execution.impl.steps.CacheStep.execute(CacheStep.java:37)
25-Mar-2019 01:03:29         at org.gradle.internal.execution.impl.steps.PrepareCachingStep.execute(PrepareCachingStep.java:33)
25-Mar-2019 01:03:29         at org.gradle.internal.execution.impl.steps.StoreSnapshotsStep.execute(StoreSnapshotsStep.java:38)
25-Mar-2019 01:03:29         at org.gradle.internal.execution.impl.steps.StoreSnapshotsStep.execute(StoreSnapshotsStep.java:23)
25-Mar-2019 01:03:29         at org.gradle.internal.execution.impl.steps.SkipUpToDateStep.executeBecause(SkipUpToDateStep.java:95)
25-Mar-2019 01:03:29         at org.gradle.internal.execution.impl.steps.SkipUpToDateStep.lambda$execute$0(SkipUpToDateStep.java:88)
25-Mar-2019 01:03:29         at org.gradle.internal.execution.impl.steps.SkipUpToDateStep.execute(SkipUpToDateStep.java:52)
25-Mar-2019 01:03:29         at org.gradle.internal.execution.impl.steps.SkipUpToDateStep.execute(SkipUpToDateStep.java:36)
25-Mar-2019 01:03:29         at org.gradle.internal.execution.impl.DefaultWorkExecutor.execute(DefaultWorkExecutor.java:34)
25-Mar-2019 01:03:29         at org.gradle.api.internal.tasks.execution.ExecuteActionsTaskExecuter.execute(ExecuteActionsTaskExecuter.java:109)
25-Mar-2019 01:03:29         ... 128 more
25-Mar-2019 01:03:29
25-Mar-2019 01:03:29
25-Mar-2019 01:03:29 * Get more help at https://help.gradle.org
25-Mar-2019 01:03:29
25-Mar-2019 01:03:29 BUILD FAILED in 3m 26s
25-Mar-2019 01:03:29
25-Mar-2019 01:03:29 Deprecated Gradle features were used in this build, making it incompatible with Gradle 6.0.
25-Mar-2019 01:03:29 Use '--warning-mode all' to show the individual deprecation warnings.
25-Mar-2019 01:03:29 See https://docs.gradle.org/5.2.1/userguide/command_line_interface.html#sec:command_line_warnings
25-Mar-2019 01:03:29 240 actionable tasks: 187 executed, 53 up-to-date
25-Mar-2019 01:03:30 Failing task since return code of [/opt/gradle/bin/gradle --stacktrace --no-daemon clean distributionZip javadocAll jacocoRootReport] was 1 while expected 0
25-Mar-2019 01:03:30 Finished task 'Gradle distribution zip' with result: Failed
25-Mar-2019 01:03:30 Running post build plugin 'NCover Results Collector'
25-Mar-2019 01:03:30 Running post build plugin 'Artifact Copier'
25-Mar-2019 01:03:30 Publishing an artifact: Project binary files
25-Mar-2019 01:03:30 Unable to publish artifact [Project binary files]: the source directory /var/atlassian/bamboo-home/xml-data/build-dir/SMACK-NIGHTLY-JOB1/build/distributions does not exist.
25-Mar-2019 01:03:30 The artifact is required for down stream Stages and Jobs, build will now fail.
25-Mar-2019 01:03:30 The artifact hasn't been successfully published after 575.2 μs
25-Mar-2019 01:03:30 Running post build plugin 'npm Cache Cleanup'
25-Mar-2019 01:03:30 Running post build plugin 'Clover Results Collector'
25-Mar-2019 01:03:30 Running post build plugin 'Docker Container Cleanup'
25-Mar-2019 01:03:30 Finalising the build...
25-Mar-2019 01:03:30 Stopping timer.
25-Mar-2019 01:03:30 Build SMACK-NIGHTLY-JOB1-1649 completed.
25-Mar-2019 01:03:30 Running on server: post build plugin 'NCover Results Collector'
25-Mar-2019 01:03:30 Running on server: post build plugin 'Build Hanging Detection Configuration'
25-Mar-2019 01:03:30 Running on server: post build plugin 'Clover Delta Calculator'
25-Mar-2019 01:03:30 Running on server: post build plugin 'Maven Dependencies Postprocessor'
25-Mar-2019 01:03:30 All post build plugins have finished
25-Mar-2019 01:03:30 Generating build results summary...
25-Mar-2019 01:03:30 Saving build results to disk...
25-Mar-2019 01:03:30 Logging substituted variables...
25-Mar-2019 01:03:30 Indexing build results...
25-Mar-2019 01:03:30 Finished building SMACK-NIGHTLY-JOB1-1649.