Nightly Distribution of the master branch

Build: #1662 failed

Job: Default Job failed

Stages & jobs

  1. Default Stage

  2. Deploy

Build log

The build generated 3,382 lines of output.The output is too long and has been truncated to the last 1,000 lines. Download or view full build log

21-May-2019 01:03:37      * @throws NoResponseException
21-May-2019 01:03:37        ^
21-May-2019 01:03:37 /var/atlassian/bamboo-home/xml-data/build-dir/SMACK-NIGHTLY-JOB1/smack-legacy/src/main/java/org/jivesoftware/smackx/workgroup/agent/TranscriptManager.java:72: warning: no description for @throws
21-May-2019 01:03:37      * @throws NotConnectedException
21-May-2019 01:03:37        ^
21-May-2019 01:03:37 /var/atlassian/bamboo-home/xml-data/build-dir/SMACK-NIGHTLY-JOB1/smack-legacy/src/main/java/org/jivesoftware/smackx/workgroup/agent/TranscriptManager.java:73: warning: no description for @throws
21-May-2019 01:03:37      * @throws InterruptedException
21-May-2019 01:03:37        ^
21-May-2019 01:03:37 /var/atlassian/bamboo-home/xml-data/build-dir/SMACK-NIGHTLY-JOB1/smack-legacy/src/main/java/org/jivesoftware/smackx/workgroup/agent/TranscriptSearchManager.java:53: warning: no description for @throws
21-May-2019 01:03:37      * @throws XMPPErrorException
21-May-2019 01:03:37        ^
21-May-2019 01:03:37 /var/atlassian/bamboo-home/xml-data/build-dir/SMACK-NIGHTLY-JOB1/smack-legacy/src/main/java/org/jivesoftware/smackx/workgroup/agent/TranscriptSearchManager.java:54: warning: no description for @throws
21-May-2019 01:03:37      * @throws NoResponseException
21-May-2019 01:03:37        ^
21-May-2019 01:03:37 /var/atlassian/bamboo-home/xml-data/build-dir/SMACK-NIGHTLY-JOB1/smack-legacy/src/main/java/org/jivesoftware/smackx/workgroup/agent/TranscriptSearchManager.java:55: warning: no description for @throws
21-May-2019 01:03:37      * @throws NotConnectedException
21-May-2019 01:03:37        ^
21-May-2019 01:03:37 /var/atlassian/bamboo-home/xml-data/build-dir/SMACK-NIGHTLY-JOB1/smack-legacy/src/main/java/org/jivesoftware/smackx/workgroup/agent/TranscriptSearchManager.java:56: warning: no description for @throws
21-May-2019 01:03:37      * @throws InterruptedException
21-May-2019 01:03:37        ^
21-May-2019 01:03:37 /var/atlassian/bamboo-home/xml-data/build-dir/SMACK-NIGHTLY-JOB1/smack-legacy/src/main/java/org/jivesoftware/smackx/workgroup/agent/TranscriptSearchManager.java:76: warning: no description for @throws
21-May-2019 01:03:37      * @throws XMPPErrorException
21-May-2019 01:03:37        ^
21-May-2019 01:03:37 /var/atlassian/bamboo-home/xml-data/build-dir/SMACK-NIGHTLY-JOB1/smack-legacy/src/main/java/org/jivesoftware/smackx/workgroup/agent/TranscriptSearchManager.java:77: warning: no description for @throws
21-May-2019 01:03:37      * @throws NoResponseException
21-May-2019 01:03:37        ^
21-May-2019 01:03:37 /var/atlassian/bamboo-home/xml-data/build-dir/SMACK-NIGHTLY-JOB1/smack-legacy/src/main/java/org/jivesoftware/smackx/workgroup/agent/TranscriptSearchManager.java:78: warning: no description for @throws
21-May-2019 01:03:37      * @throws NotConnectedException
21-May-2019 01:03:37        ^
21-May-2019 01:03:37 /var/atlassian/bamboo-home/xml-data/build-dir/SMACK-NIGHTLY-JOB1/smack-legacy/src/main/java/org/jivesoftware/smackx/workgroup/agent/TranscriptSearchManager.java:79: warning: no description for @throws
21-May-2019 01:03:37      * @throws InterruptedException
21-May-2019 01:03:37        ^
21-May-2019 01:03:37 /var/atlassian/bamboo-home/xml-data/build-dir/SMACK-NIGHTLY-JOB1/smack-legacy/src/main/java/org/jivesoftware/smackx/xroster/RosterExchangeManager.java:120: warning: no description for @throws
21-May-2019 01:03:37      * @throws NotConnectedException
21-May-2019 01:03:37        ^
21-May-2019 01:03:37 /var/atlassian/bamboo-home/xml-data/build-dir/SMACK-NIGHTLY-JOB1/smack-legacy/src/main/java/org/jivesoftware/smackx/xroster/RosterExchangeManager.java:121: warning: no description for @throws
21-May-2019 01:03:37      * @throws InterruptedException
21-May-2019 01:03:37        ^
21-May-2019 01:03:37 /var/atlassian/bamboo-home/xml-data/build-dir/SMACK-NIGHTLY-JOB1/smack-legacy/src/main/java/org/jivesoftware/smackx/xroster/RosterExchangeManager.java:140: warning: no description for @throws
21-May-2019 01:03:37      * @throws NotConnectedException
21-May-2019 01:03:37        ^
21-May-2019 01:03:37 /var/atlassian/bamboo-home/xml-data/build-dir/SMACK-NIGHTLY-JOB1/smack-legacy/src/main/java/org/jivesoftware/smackx/xroster/RosterExchangeManager.java:141: warning: no description for @throws
21-May-2019 01:03:37      * @throws InterruptedException
21-May-2019 01:03:37        ^
21-May-2019 01:03:37 /var/atlassian/bamboo-home/xml-data/build-dir/SMACK-NIGHTLY-JOB1/smack-legacy/src/main/java/org/jivesoftware/smackx/xroster/RosterExchangeManager.java:162: warning: no description for @throws
21-May-2019 01:03:37      * @throws NotConnectedException
21-May-2019 01:03:37        ^
21-May-2019 01:03:37 /var/atlassian/bamboo-home/xml-data/build-dir/SMACK-NIGHTLY-JOB1/smack-legacy/src/main/java/org/jivesoftware/smackx/xroster/RosterExchangeManager.java:163: warning: no description for @throws
21-May-2019 01:03:37      * @throws InterruptedException
21-May-2019 01:03:37        ^
21-May-2019 01:03:37 /var/atlassian/bamboo-home/xml-data/build-dir/SMACK-NIGHTLY-JOB1/smack-legacy/src/main/java/org/jivesoftware/smackx/xevent/provider/MessageEventProvider.java:42: warning: no description for @throws
21-May-2019 01:03:37      * @throws IOException
21-May-2019 01:03:37        ^
21-May-2019 01:03:37 100 warnings
21-May-2019 01:03:37
21-May-2019 01:03:37 > Task :smack-legacy:javadocJar
21-May-2019 01:03:37 > Task :smack-legacy:sourcesJar
21-May-2019 01:03:38 > Task :smack-legacy:compileTestJava
21-May-2019 01:03:38 > Task :smack-legacy:processTestResources NO-SOURCE
21-May-2019 01:03:38 > Task :smack-legacy:testClasses
21-May-2019 01:03:38 > Task :smack-legacy:testJar
21-May-2019 01:03:38 > Task :smack-legacy:signArchives SKIPPED
21-May-2019 01:03:38 > Task :smack-legacy:assemble
21-May-2019 01:03:39 > Task :smack-legacy:checkstyleMain
21-May-2019 01:03:39 > Task :smack-legacy:checkstyleTest
21-May-2019 01:03:39 > Task :smack-legacy:clirr
21-May-2019 01:03:41 > Task :smack-legacy:test
21-May-2019 01:03:41 > Task :smack-legacy:check
21-May-2019 01:03:41 > Task :smack-legacy:build
21-May-2019 01:03:41 > Task :smack-omemo:copyJavadocDocFiles NO-SOURCE
21-May-2019 01:03:43
21-May-2019 01:03:43 > Task :smack-omemo:javadoc
21-May-2019 01:03:43 /var/atlassian/bamboo-home/xml-data/build-dir/SMACK-NIGHTLY-JOB1/smack-omemo/src/main/java/org/jivesoftware/smackx/omemo/util/OmemoMessageBuilder.java:266: warning: no description for @throws
21-May-2019 01:03:43      * @throws NoSuchAlgorithmException
21-May-2019 01:03:43        ^
21-May-2019 01:03:43 /var/atlassian/bamboo-home/xml-data/build-dir/SMACK-NIGHTLY-JOB1/smack-omemo/src/main/java/org/jivesoftware/smackx/omemo/util/OmemoMessageBuilder.java:93: warning: no description for @throws
21-May-2019 01:03:43      * @throws NoSuchPaddingException
21-May-2019 01:03:43        ^
21-May-2019 01:03:43 /var/atlassian/bamboo-home/xml-data/build-dir/SMACK-NIGHTLY-JOB1/smack-omemo/src/main/java/org/jivesoftware/smackx/omemo/util/OmemoMessageBuilder.java:94: warning: no description for @throws
21-May-2019 01:03:43      * @throws BadPaddingException
21-May-2019 01:03:43        ^
21-May-2019 01:03:43 /var/atlassian/bamboo-home/xml-data/build-dir/SMACK-NIGHTLY-JOB1/smack-omemo/src/main/java/org/jivesoftware/smackx/omemo/util/OmemoMessageBuilder.java:95: warning: no description for @throws
21-May-2019 01:03:43      * @throws InvalidKeyException
21-May-2019 01:03:43        ^
21-May-2019 01:03:43 /var/atlassian/bamboo-home/xml-data/build-dir/SMACK-NIGHTLY-JOB1/smack-omemo/src/main/java/org/jivesoftware/smackx/omemo/util/OmemoMessageBuilder.java:96: warning: no description for @throws
21-May-2019 01:03:43      * @throws NoSuchAlgorithmException
21-May-2019 01:03:43        ^
21-May-2019 01:03:43 /var/atlassian/bamboo-home/xml-data/build-dir/SMACK-NIGHTLY-JOB1/smack-omemo/src/main/java/org/jivesoftware/smackx/omemo/util/OmemoMessageBuilder.java:97: warning: no description for @throws
21-May-2019 01:03:43      * @throws IllegalBlockSizeException
21-May-2019 01:03:43        ^
21-May-2019 01:03:43 /var/atlassian/bamboo-home/xml-data/build-dir/SMACK-NIGHTLY-JOB1/smack-omemo/src/main/java/org/jivesoftware/smackx/omemo/util/OmemoMessageBuilder.java:98: warning: no description for @throws
21-May-2019 01:03:43      * @throws InvalidAlgorithmParameterException
21-May-2019 01:03:43        ^
21-May-2019 01:03:43 /var/atlassian/bamboo-home/xml-data/build-dir/SMACK-NIGHTLY-JOB1/smack-omemo/src/main/java/org/jivesoftware/smackx/omemo/util/OmemoMessageBuilder.java:125: warning: no description for @throws
21-May-2019 01:03:43      * @throws NoSuchPaddingException
21-May-2019 01:03:43        ^
21-May-2019 01:03:43 /var/atlassian/bamboo-home/xml-data/build-dir/SMACK-NIGHTLY-JOB1/smack-omemo/src/main/java/org/jivesoftware/smackx/omemo/util/OmemoMessageBuilder.java:126: warning: no description for @throws
21-May-2019 01:03:43      * @throws BadPaddingException
21-May-2019 01:03:43        ^
21-May-2019 01:03:43 /var/atlassian/bamboo-home/xml-data/build-dir/SMACK-NIGHTLY-JOB1/smack-omemo/src/main/java/org/jivesoftware/smackx/omemo/util/OmemoMessageBuilder.java:127: warning: no description for @throws
21-May-2019 01:03:43      * @throws InvalidKeyException
21-May-2019 01:03:43        ^
21-May-2019 01:03:43 /var/atlassian/bamboo-home/xml-data/build-dir/SMACK-NIGHTLY-JOB1/smack-omemo/src/main/java/org/jivesoftware/smackx/omemo/util/OmemoMessageBuilder.java:128: warning: no description for @throws
21-May-2019 01:03:43      * @throws NoSuchAlgorithmException
21-May-2019 01:03:43        ^
21-May-2019 01:03:43 /var/atlassian/bamboo-home/xml-data/build-dir/SMACK-NIGHTLY-JOB1/smack-omemo/src/main/java/org/jivesoftware/smackx/omemo/util/OmemoMessageBuilder.java:129: warning: no description for @throws
21-May-2019 01:03:43      * @throws IllegalBlockSizeException
21-May-2019 01:03:43        ^
21-May-2019 01:03:43 /var/atlassian/bamboo-home/xml-data/build-dir/SMACK-NIGHTLY-JOB1/smack-omemo/src/main/java/org/jivesoftware/smackx/omemo/util/OmemoMessageBuilder.java:130: warning: no description for @throws
21-May-2019 01:03:43      * @throws UnsupportedEncodingException
21-May-2019 01:03:43        ^
21-May-2019 01:03:43 /var/atlassian/bamboo-home/xml-data/build-dir/SMACK-NIGHTLY-JOB1/smack-omemo/src/main/java/org/jivesoftware/smackx/omemo/util/OmemoMessageBuilder.java:131: warning: no description for @throws
21-May-2019 01:03:43      * @throws InvalidAlgorithmParameterException
21-May-2019 01:03:43        ^
21-May-2019 01:03:43 /var/atlassian/bamboo-home/xml-data/build-dir/SMACK-NIGHTLY-JOB1/smack-omemo/src/main/java/org/jivesoftware/smackx/omemo/exceptions/StaleDeviceException.java:34: warning: no description for @param
21-May-2019 01:03:43      * @param lastMessageDate
21-May-2019 01:03:43        ^
21-May-2019 01:03:43 /var/atlassian/bamboo-home/xml-data/build-dir/SMACK-NIGHTLY-JOB1/smack-omemo/src/main/java/org/jivesoftware/smackx/omemo/exceptions/StaleDeviceException.java:35: warning: no description for @param
21-May-2019 01:03:43      * @param lastDeviceIdPublicationDate
21-May-2019 01:03:43        ^
21-May-2019 01:03:43 /var/atlassian/bamboo-home/xml-data/build-dir/SMACK-NIGHTLY-JOB1/smack-omemo/src/main/java/org/jivesoftware/smackx/omemo/exceptions/UntrustedOmemoIdentityException.java:68: warning: no description for @return
21-May-2019 01:03:43      * @return
21-May-2019 01:03:43        ^
21-May-2019 01:03:43 /var/atlassian/bamboo-home/xml-data/build-dir/SMACK-NIGHTLY-JOB1/smack-omemo/src/main/java/org/jivesoftware/smackx/omemo/exceptions/UntrustedOmemoIdentityException.java:76: warning: no description for @return
21-May-2019 01:03:43      * @return
21-May-2019 01:03:43        ^
21-May-2019 01:03:43 /var/atlassian/bamboo-home/xml-data/build-dir/SMACK-NIGHTLY-JOB1/smack-omemo/src/main/java/org/jivesoftware/smackx/omemo/OmemoStore.java:202: warning: no description for @param
21-May-2019 01:03:43      * @param userDevice
21-May-2019 01:03:43        ^
21-May-2019 01:03:43 /var/atlassian/bamboo-home/xml-data/build-dir/SMACK-NIGHTLY-JOB1/smack-omemo/src/main/java/org/jivesoftware/smackx/omemo/OmemoStore.java:203: warning: no description for @throws
21-May-2019 01:03:43      * @throws CorruptedOmemoKeyException
21-May-2019 01:03:43        ^
21-May-2019 01:03:43 /var/atlassian/bamboo-home/xml-data/build-dir/SMACK-NIGHTLY-JOB1/smack-omemo/src/main/java/org/jivesoftware/smackx/omemo/OmemoStore.java:543: warning: no description for @param
21-May-2019 01:03:43      * @param userDevice
21-May-2019 01:03:43        ^
21-May-2019 01:03:43 /var/atlassian/bamboo-home/xml-data/build-dir/SMACK-NIGHTLY-JOB1/smack-omemo/src/main/java/org/jivesoftware/smackx/omemo/OmemoStore.java:544: warning: no description for @return
21-May-2019 01:03:43      * @return
21-May-2019 01:03:43        ^
21-May-2019 01:03:43 /var/atlassian/bamboo-home/xml-data/build-dir/SMACK-NIGHTLY-JOB1/smack-omemo/src/main/java/org/jivesoftware/smackx/omemo/OmemoStore.java:625: warning: no description for @throws
21-May-2019 01:03:43      * @throws SmackException.NotConnectedException
21-May-2019 01:03:43        ^
21-May-2019 01:03:43 /var/atlassian/bamboo-home/xml-data/build-dir/SMACK-NIGHTLY-JOB1/smack-omemo/src/main/java/org/jivesoftware/smackx/omemo/OmemoStore.java:626: warning: no description for @throws
21-May-2019 01:03:43      * @throws InterruptedException
21-May-2019 01:03:43        ^
21-May-2019 01:03:43 /var/atlassian/bamboo-home/xml-data/build-dir/SMACK-NIGHTLY-JOB1/smack-omemo/src/main/java/org/jivesoftware/smackx/omemo/OmemoStore.java:627: warning: no description for @throws
21-May-2019 01:03:43      * @throws SmackException.NoResponseException
21-May-2019 01:03:43        ^
21-May-2019 01:03:43 /var/atlassian/bamboo-home/xml-data/build-dir/SMACK-NIGHTLY-JOB1/smack-omemo/src/main/java/org/jivesoftware/smackx/omemo/CachingOmemoStore.java:39: warning: no description for @param
21-May-2019 01:03:43 * @param <T_IdKeyPair>
21-May-2019 01:03:43    ^
21-May-2019 01:03:43 /var/atlassian/bamboo-home/xml-data/build-dir/SMACK-NIGHTLY-JOB1/smack-omemo/src/main/java/org/jivesoftware/smackx/omemo/CachingOmemoStore.java:40: warning: no description for @param
21-May-2019 01:03:43 * @param <T_IdKey>
21-May-2019 01:03:43    ^
21-May-2019 01:03:43 /var/atlassian/bamboo-home/xml-data/build-dir/SMACK-NIGHTLY-JOB1/smack-omemo/src/main/java/org/jivesoftware/smackx/omemo/CachingOmemoStore.java:41: warning: no description for @param
21-May-2019 01:03:43 * @param <T_PreKey>
21-May-2019 01:03:43    ^
21-May-2019 01:03:43 /var/atlassian/bamboo-home/xml-data/build-dir/SMACK-NIGHTLY-JOB1/smack-omemo/src/main/java/org/jivesoftware/smackx/omemo/CachingOmemoStore.java:42: warning: no description for @param
21-May-2019 01:03:43 * @param <T_SigPreKey>
21-May-2019 01:03:43    ^
21-May-2019 01:03:43 /var/atlassian/bamboo-home/xml-data/build-dir/SMACK-NIGHTLY-JOB1/smack-omemo/src/main/java/org/jivesoftware/smackx/omemo/CachingOmemoStore.java:43: warning: no description for @param
21-May-2019 01:03:43 * @param <T_Sess>
21-May-2019 01:03:43    ^
21-May-2019 01:03:43 /var/atlassian/bamboo-home/xml-data/build-dir/SMACK-NIGHTLY-JOB1/smack-omemo/src/main/java/org/jivesoftware/smackx/omemo/CachingOmemoStore.java:44: warning: no description for @param
21-May-2019 01:03:43 * @param <T_Addr>
21-May-2019 01:03:43    ^
21-May-2019 01:03:43 /var/atlassian/bamboo-home/xml-data/build-dir/SMACK-NIGHTLY-JOB1/smack-omemo/src/main/java/org/jivesoftware/smackx/omemo/CachingOmemoStore.java:45: warning: no description for @param
21-May-2019 01:03:43 * @param <T_ECPub>
21-May-2019 01:03:43    ^
21-May-2019 01:03:43 /var/atlassian/bamboo-home/xml-data/build-dir/SMACK-NIGHTLY-JOB1/smack-omemo/src/main/java/org/jivesoftware/smackx/omemo/CachingOmemoStore.java:46: warning: no description for @param
21-May-2019 01:03:43 * @param <T_Bundle>
21-May-2019 01:03:43    ^
21-May-2019 01:03:43 /var/atlassian/bamboo-home/xml-data/build-dir/SMACK-NIGHTLY-JOB1/smack-omemo/src/main/java/org/jivesoftware/smackx/omemo/CachingOmemoStore.java:47: warning: no description for @param
21-May-2019 01:03:43 * @param <T_Ciph>
21-May-2019 01:03:43    ^
21-May-2019 01:03:43 /var/atlassian/bamboo-home/xml-data/build-dir/SMACK-NIGHTLY-JOB1/smack-omemo/src/main/java/org/jivesoftware/smackx/omemo/FileBasedOmemoStore.java:689: warning: no description for @param
21-May-2019 01:03:43      * @param root
21-May-2019 01:03:43        ^
21-May-2019 01:03:43 /var/atlassian/bamboo-home/xml-data/build-dir/SMACK-NIGHTLY-JOB1/smack-omemo/src/main/java/org/jivesoftware/smackx/omemo/OmemoManager.java:230: warning: no description for @throws
21-May-2019 01:03:43      * @throws CorruptedOmemoKeyException
21-May-2019 01:03:43        ^
21-May-2019 01:03:43 /var/atlassian/bamboo-home/xml-data/build-dir/SMACK-NIGHTLY-JOB1/smack-omemo/src/main/java/org/jivesoftware/smackx/omemo/OmemoManager.java:231: warning: no description for @throws
21-May-2019 01:03:43      * @throws InterruptedException
21-May-2019 01:03:43        ^
21-May-2019 01:03:43 /var/atlassian/bamboo-home/xml-data/build-dir/SMACK-NIGHTLY-JOB1/smack-omemo/src/main/java/org/jivesoftware/smackx/omemo/OmemoManager.java:232: warning: no description for @throws
21-May-2019 01:03:43      * @throws SmackException.NoResponseException
21-May-2019 01:03:43        ^
21-May-2019 01:03:43 /var/atlassian/bamboo-home/xml-data/build-dir/SMACK-NIGHTLY-JOB1/smack-omemo/src/main/java/org/jivesoftware/smackx/omemo/OmemoManager.java:233: warning: no description for @throws
21-May-2019 01:03:43      * @throws SmackException.NotConnectedException
21-May-2019 01:03:43        ^
21-May-2019 01:03:43 /var/atlassian/bamboo-home/xml-data/build-dir/SMACK-NIGHTLY-JOB1/smack-omemo/src/main/java/org/jivesoftware/smackx/omemo/OmemoManager.java:234: warning: no description for @throws
21-May-2019 01:03:43      * @throws XMPPException.XMPPErrorException
21-May-2019 01:03:43        ^
21-May-2019 01:03:43 /var/atlassian/bamboo-home/xml-data/build-dir/SMACK-NIGHTLY-JOB1/smack-omemo/src/main/java/org/jivesoftware/smackx/omemo/OmemoManager.java:235: warning: no description for @throws
21-May-2019 01:03:43      * @throws SmackException.NotLoggedInException
21-May-2019 01:03:43        ^
21-May-2019 01:03:43 /var/atlassian/bamboo-home/xml-data/build-dir/SMACK-NIGHTLY-JOB1/smack-omemo/src/main/java/org/jivesoftware/smackx/omemo/OmemoManager.java:236: warning: no description for @throws
21-May-2019 01:03:43      * @throws PubSubException.NotALeafNodeException
21-May-2019 01:03:43        ^
21-May-2019 01:03:43 /var/atlassian/bamboo-home/xml-data/build-dir/SMACK-NIGHTLY-JOB1/smack-omemo/src/main/java/org/jivesoftware/smackx/omemo/OmemoManager.java:303: warning: no description for @throws
21-May-2019 01:03:43      * @throws InterruptedException
21-May-2019 01:03:43        ^
21-May-2019 01:03:43 /var/atlassian/bamboo-home/xml-data/build-dir/SMACK-NIGHTLY-JOB1/smack-omemo/src/main/java/org/jivesoftware/smackx/omemo/OmemoManager.java:304: warning: no description for @throws
21-May-2019 01:03:43      * @throws SmackException.NotConnectedException
21-May-2019 01:03:43        ^
21-May-2019 01:03:43 /var/atlassian/bamboo-home/xml-data/build-dir/SMACK-NIGHTLY-JOB1/smack-omemo/src/main/java/org/jivesoftware/smackx/omemo/OmemoManager.java:305: warning: no description for @throws
21-May-2019 01:03:43      * @throws SmackException.NoResponseException
21-May-2019 01:03:43        ^
21-May-2019 01:03:43 /var/atlassian/bamboo-home/xml-data/build-dir/SMACK-NIGHTLY-JOB1/smack-omemo/src/main/java/org/jivesoftware/smackx/omemo/OmemoManager.java:306: warning: no description for @throws
21-May-2019 01:03:43      * @throws SmackException.NotLoggedInException
21-May-2019 01:03:43        ^
21-May-2019 01:03:43 /var/atlassian/bamboo-home/xml-data/build-dir/SMACK-NIGHTLY-JOB1/smack-omemo/src/main/java/org/jivesoftware/smackx/omemo/OmemoManager.java:327: warning: no description for @throws
21-May-2019 01:03:43      * @throws InterruptedException
21-May-2019 01:03:43        ^
21-May-2019 01:03:43 /var/atlassian/bamboo-home/xml-data/build-dir/SMACK-NIGHTLY-JOB1/smack-omemo/src/main/java/org/jivesoftware/smackx/omemo/OmemoManager.java:328: warning: no description for @throws
21-May-2019 01:03:43      * @throws SmackException.NotConnectedException
21-May-2019 01:03:43        ^
21-May-2019 01:03:43 /var/atlassian/bamboo-home/xml-data/build-dir/SMACK-NIGHTLY-JOB1/smack-omemo/src/main/java/org/jivesoftware/smackx/omemo/OmemoManager.java:329: warning: no description for @throws
21-May-2019 01:03:43      * @throws SmackException.NoResponseException
21-May-2019 01:03:43        ^
21-May-2019 01:03:43 /var/atlassian/bamboo-home/xml-data/build-dir/SMACK-NIGHTLY-JOB1/smack-omemo/src/main/java/org/jivesoftware/smackx/omemo/OmemoManager.java:330: warning: no description for @throws
21-May-2019 01:03:43      * @throws SmackException.NotLoggedInException
21-May-2019 01:03:43        ^
21-May-2019 01:03:43 /var/atlassian/bamboo-home/xml-data/build-dir/SMACK-NIGHTLY-JOB1/smack-omemo/src/main/java/org/jivesoftware/smackx/omemo/OmemoManager.java:353: warning: no description for @throws
21-May-2019 01:03:43      * @throws CryptoFailedException
21-May-2019 01:03:43        ^
21-May-2019 01:03:43 /var/atlassian/bamboo-home/xml-data/build-dir/SMACK-NIGHTLY-JOB1/smack-omemo/src/main/java/org/jivesoftware/smackx/omemo/OmemoManager.java:354: warning: no description for @throws
21-May-2019 01:03:43      * @throws XMPPException.XMPPErrorException
21-May-2019 01:03:43        ^
21-May-2019 01:03:43 /var/atlassian/bamboo-home/xml-data/build-dir/SMACK-NIGHTLY-JOB1/smack-omemo/src/main/java/org/jivesoftware/smackx/omemo/OmemoManager.java:355: warning: no description for @throws
21-May-2019 01:03:43      * @throws SmackException.NotConnectedException
21-May-2019 01:03:43        ^
21-May-2019 01:03:43 /var/atlassian/bamboo-home/xml-data/build-dir/SMACK-NIGHTLY-JOB1/smack-omemo/src/main/java/org/jivesoftware/smackx/omemo/OmemoManager.java:356: warning: no description for @throws
21-May-2019 01:03:43      * @throws InterruptedException
21-May-2019 01:03:43        ^
21-May-2019 01:03:43 /var/atlassian/bamboo-home/xml-data/build-dir/SMACK-NIGHTLY-JOB1/smack-omemo/src/main/java/org/jivesoftware/smackx/omemo/OmemoManager.java:357: warning: no description for @throws
21-May-2019 01:03:43      * @throws SmackException.NoResponseException
21-May-2019 01:03:43        ^
21-May-2019 01:03:43 /var/atlassian/bamboo-home/xml-data/build-dir/SMACK-NIGHTLY-JOB1/smack-omemo/src/main/java/org/jivesoftware/smackx/omemo/OmemoManager.java:359: warning: no description for @throws
21-May-2019 01:03:43      * @throws SmackException.NotLoggedInException
21-May-2019 01:03:43        ^
21-May-2019 01:03:43 /var/atlassian/bamboo-home/xml-data/build-dir/SMACK-NIGHTLY-JOB1/smack-omemo/src/main/java/org/jivesoftware/smackx/omemo/OmemoManager.java:450: warning: no description for @return
21-May-2019 01:03:43      * @return
21-May-2019 01:03:43        ^
21-May-2019 01:03:43 /var/atlassian/bamboo-home/xml-data/build-dir/SMACK-NIGHTLY-JOB1/smack-omemo/src/main/java/org/jivesoftware/smackx/omemo/OmemoManager.java:466: warning: no description for @return
21-May-2019 01:03:43      * @return
21-May-2019 01:03:43        ^
21-May-2019 01:03:43 /var/atlassian/bamboo-home/xml-data/build-dir/SMACK-NIGHTLY-JOB1/smack-omemo/src/main/java/org/jivesoftware/smackx/omemo/OmemoManager.java:484: warning: no description for @throws
21-May-2019 01:03:43      * @throws SmackException.NotLoggedInException
21-May-2019 01:03:43        ^
21-May-2019 01:03:43 /var/atlassian/bamboo-home/xml-data/build-dir/SMACK-NIGHTLY-JOB1/smack-omemo/src/main/java/org/jivesoftware/smackx/omemo/OmemoManager.java:485: warning: no description for @throws
21-May-2019 01:03:43      * @throws InterruptedException
21-May-2019 01:03:43        ^
21-May-2019 01:03:43 /var/atlassian/bamboo-home/xml-data/build-dir/SMACK-NIGHTLY-JOB1/smack-omemo/src/main/java/org/jivesoftware/smackx/omemo/OmemoManager.java:486: warning: no description for @throws
21-May-2019 01:03:43      * @throws SmackException.NoResponseException
21-May-2019 01:03:43        ^
21-May-2019 01:03:43 /var/atlassian/bamboo-home/xml-data/build-dir/SMACK-NIGHTLY-JOB1/smack-omemo/src/main/java/org/jivesoftware/smackx/omemo/OmemoManager.java:487: warning: no description for @throws
21-May-2019 01:03:43      * @throws NoSuchAlgorithmException
21-May-2019 01:03:43        ^
21-May-2019 01:03:43 /var/atlassian/bamboo-home/xml-data/build-dir/SMACK-NIGHTLY-JOB1/smack-omemo/src/main/java/org/jivesoftware/smackx/omemo/OmemoManager.java:488: warning: no description for @throws
21-May-2019 01:03:43      * @throws SmackException.NotConnectedException
21-May-2019 01:03:43        ^
21-May-2019 01:03:43 /var/atlassian/bamboo-home/xml-data/build-dir/SMACK-NIGHTLY-JOB1/smack-omemo/src/main/java/org/jivesoftware/smackx/omemo/OmemoManager.java:514: warning: no description for @throws
21-May-2019 01:03:43      * @throws SmackException.NotConnectedException
21-May-2019 01:03:43        ^
21-May-2019 01:03:43 /var/atlassian/bamboo-home/xml-data/build-dir/SMACK-NIGHTLY-JOB1/smack-omemo/src/main/java/org/jivesoftware/smackx/omemo/OmemoManager.java:515: warning: no description for @throws
21-May-2019 01:03:43      * @throws InterruptedException
21-May-2019 01:03:43        ^
21-May-2019 01:03:43 /var/atlassian/bamboo-home/xml-data/build-dir/SMACK-NIGHTLY-JOB1/smack-omemo/src/main/java/org/jivesoftware/smackx/omemo/OmemoManager.java:516: warning: no description for @throws
21-May-2019 01:03:43      * @throws SmackException.NoResponseException
21-May-2019 01:03:43        ^
21-May-2019 01:03:43 /var/atlassian/bamboo-home/xml-data/build-dir/SMACK-NIGHTLY-JOB1/smack-omemo/src/main/java/org/jivesoftware/smackx/omemo/OmemoManager.java:517: warning: no description for @throws
21-May-2019 01:03:43      * @throws PubSubException.NotALeafNodeException
21-May-2019 01:03:43        ^
21-May-2019 01:03:43 /var/atlassian/bamboo-home/xml-data/build-dir/SMACK-NIGHTLY-JOB1/smack-omemo/src/main/java/org/jivesoftware/smackx/omemo/OmemoManager.java:518: warning: no description for @throws
21-May-2019 01:03:43      * @throws XMPPException.XMPPErrorException
21-May-2019 01:03:43        ^
21-May-2019 01:03:43 /var/atlassian/bamboo-home/xml-data/build-dir/SMACK-NIGHTLY-JOB1/smack-omemo/src/main/java/org/jivesoftware/smackx/omemo/OmemoManager.java:554: warning: no description for @throws
21-May-2019 01:03:43      * @throws XMPPException.XMPPErrorException
21-May-2019 01:03:43        ^
21-May-2019 01:03:43 /var/atlassian/bamboo-home/xml-data/build-dir/SMACK-NIGHTLY-JOB1/smack-omemo/src/main/java/org/jivesoftware/smackx/omemo/OmemoManager.java:555: warning: no description for @throws
21-May-2019 01:03:43      * @throws SmackException.NotConnectedException
21-May-2019 01:03:43        ^
21-May-2019 01:03:43 /var/atlassian/bamboo-home/xml-data/build-dir/SMACK-NIGHTLY-JOB1/smack-omemo/src/main/java/org/jivesoftware/smackx/omemo/OmemoManager.java:556: warning: no description for @throws
21-May-2019 01:03:43      * @throws InterruptedException
21-May-2019 01:03:43        ^
21-May-2019 01:03:43 /var/atlassian/bamboo-home/xml-data/build-dir/SMACK-NIGHTLY-JOB1/smack-omemo/src/main/java/org/jivesoftware/smackx/omemo/OmemoManager.java:557: warning: no description for @throws
21-May-2019 01:03:43      * @throws SmackException.NoResponseException
21-May-2019 01:03:43        ^
21-May-2019 01:03:43 /var/atlassian/bamboo-home/xml-data/build-dir/SMACK-NIGHTLY-JOB1/smack-omemo/src/main/java/org/jivesoftware/smackx/omemo/OmemoManager.java:589: warning: no description for @throws
21-May-2019 01:03:43      * @throws SmackException.NotLoggedInException
21-May-2019 01:03:43        ^
21-May-2019 01:03:43 /var/atlassian/bamboo-home/xml-data/build-dir/SMACK-NIGHTLY-JOB1/smack-omemo/src/main/java/org/jivesoftware/smackx/omemo/OmemoManager.java:591: warning: no description for @throws
21-May-2019 01:03:43      * @throws SmackException.NotConnectedException
21-May-2019 01:03:43        ^
21-May-2019 01:03:43 /var/atlassian/bamboo-home/xml-data/build-dir/SMACK-NIGHTLY-JOB1/smack-omemo/src/main/java/org/jivesoftware/smackx/omemo/OmemoManager.java:592: warning: no description for @throws
21-May-2019 01:03:43      * @throws InterruptedException
21-May-2019 01:03:43        ^
21-May-2019 01:03:43 /var/atlassian/bamboo-home/xml-data/build-dir/SMACK-NIGHTLY-JOB1/smack-omemo/src/main/java/org/jivesoftware/smackx/omemo/OmemoManager.java:593: warning: no description for @throws
21-May-2019 01:03:43      * @throws SmackException.NoResponseException
21-May-2019 01:03:43        ^
21-May-2019 01:03:43 /var/atlassian/bamboo-home/xml-data/build-dir/SMACK-NIGHTLY-JOB1/smack-omemo/src/main/java/org/jivesoftware/smackx/omemo/OmemoManager.java:618: warning: no description for @throws
21-May-2019 01:03:43      * @throws SmackException.NotLoggedInException
21-May-2019 01:03:43        ^
21-May-2019 01:03:43 /var/atlassian/bamboo-home/xml-data/build-dir/SMACK-NIGHTLY-JOB1/smack-omemo/src/main/java/org/jivesoftware/smackx/omemo/OmemoManager.java:619: warning: no description for @throws
21-May-2019 01:03:43      * @throws CorruptedOmemoKeyException
21-May-2019 01:03:43        ^
21-May-2019 01:03:43 /var/atlassian/bamboo-home/xml-data/build-dir/SMACK-NIGHTLY-JOB1/smack-omemo/src/main/java/org/jivesoftware/smackx/omemo/OmemoManager.java:620: warning: no description for @throws
21-May-2019 01:03:43      * @throws CannotEstablishOmemoSessionException
21-May-2019 01:03:43        ^
21-May-2019 01:03:43 /var/atlassian/bamboo-home/xml-data/build-dir/SMACK-NIGHTLY-JOB1/smack-omemo/src/main/java/org/jivesoftware/smackx/omemo/OmemoManager.java:621: warning: no description for @throws
21-May-2019 01:03:43      * @throws SmackException.NotConnectedException
21-May-2019 01:03:43        ^
21-May-2019 01:03:43 /var/atlassian/bamboo-home/xml-data/build-dir/SMACK-NIGHTLY-JOB1/smack-omemo/src/main/java/org/jivesoftware/smackx/omemo/OmemoManager.java:622: warning: no description for @throws
21-May-2019 01:03:43      * @throws InterruptedException
21-May-2019 01:03:43        ^
21-May-2019 01:03:43 /var/atlassian/bamboo-home/xml-data/build-dir/SMACK-NIGHTLY-JOB1/smack-omemo/src/main/java/org/jivesoftware/smackx/omemo/OmemoManager.java:623: warning: no description for @throws
21-May-2019 01:03:43      * @throws SmackException.NoResponseException
21-May-2019 01:03:43        ^
21-May-2019 01:03:43 /var/atlassian/bamboo-home/xml-data/build-dir/SMACK-NIGHTLY-JOB1/smack-omemo/src/main/java/org/jivesoftware/smackx/omemo/OmemoManager.java:690: warning: no description for @throws
21-May-2019 01:03:43      * @throws InterruptedException
21-May-2019 01:03:43        ^
21-May-2019 01:03:43 /var/atlassian/bamboo-home/xml-data/build-dir/SMACK-NIGHTLY-JOB1/smack-omemo/src/main/java/org/jivesoftware/smackx/omemo/OmemoManager.java:691: warning: no description for @throws
21-May-2019 01:03:43      * @throws PubSubException.NotALeafNodeException
21-May-2019 01:03:43        ^
21-May-2019 01:03:43 /var/atlassian/bamboo-home/xml-data/build-dir/SMACK-NIGHTLY-JOB1/smack-omemo/src/main/java/org/jivesoftware/smackx/omemo/OmemoManager.java:692: warning: no description for @throws
21-May-2019 01:03:43      * @throws XMPPException.XMPPErrorException
21-May-2019 01:03:43        ^
21-May-2019 01:03:43 /var/atlassian/bamboo-home/xml-data/build-dir/SMACK-NIGHTLY-JOB1/smack-omemo/src/main/java/org/jivesoftware/smackx/omemo/OmemoManager.java:693: warning: no description for @throws
21-May-2019 01:03:43      * @throws SmackException.NotConnectedException
21-May-2019 01:03:43        ^
21-May-2019 01:03:43 /var/atlassian/bamboo-home/xml-data/build-dir/SMACK-NIGHTLY-JOB1/smack-omemo/src/main/java/org/jivesoftware/smackx/omemo/OmemoManager.java:694: warning: no description for @throws
21-May-2019 01:03:43      * @throws SmackException.NoResponseException
21-May-2019 01:03:43        ^
21-May-2019 01:03:43 /var/atlassian/bamboo-home/xml-data/build-dir/SMACK-NIGHTLY-JOB1/smack-omemo/src/main/java/org/jivesoftware/smackx/omemo/OmemoManager.java:707: warning: no description for @throws
21-May-2019 01:03:43      * @throws SmackException.NotLoggedInException
21-May-2019 01:03:43        ^
21-May-2019 01:03:43 /var/atlassian/bamboo-home/xml-data/build-dir/SMACK-NIGHTLY-JOB1/smack-omemo/src/main/java/org/jivesoftware/smackx/omemo/OmemoManager.java:708: warning: no description for @throws
21-May-2019 01:03:43      * @throws InterruptedException
21-May-2019 01:03:43        ^
21-May-2019 01:03:43 /var/atlassian/bamboo-home/xml-data/build-dir/SMACK-NIGHTLY-JOB1/smack-omemo/src/main/java/org/jivesoftware/smackx/omemo/OmemoManager.java:709: warning: no description for @throws
21-May-2019 01:03:43      * @throws XMPPException.XMPPErrorException
21-May-2019 01:03:43        ^
21-May-2019 01:03:43 /var/atlassian/bamboo-home/xml-data/build-dir/SMACK-NIGHTLY-JOB1/smack-omemo/src/main/java/org/jivesoftware/smackx/omemo/OmemoManager.java:710: warning: no description for @throws
21-May-2019 01:03:43      * @throws SmackException.NotConnectedException
21-May-2019 01:03:43        ^
21-May-2019 01:03:43 /var/atlassian/bamboo-home/xml-data/build-dir/SMACK-NIGHTLY-JOB1/smack-omemo/src/main/java/org/jivesoftware/smackx/omemo/OmemoManager.java:711: warning: no description for @throws
21-May-2019 01:03:43      * @throws SmackException.NoResponseException
21-May-2019 01:03:43        ^
21-May-2019 01:03:43 /var/atlassian/bamboo-home/xml-data/build-dir/SMACK-NIGHTLY-JOB1/smack-omemo/src/main/java/org/jivesoftware/smackx/omemo/OmemoManager.java:731: warning: no description for @throws
21-May-2019 01:03:43      * @throws SmackException.NotLoggedInException
21-May-2019 01:03:43        ^
21-May-2019 01:03:43 /var/atlassian/bamboo-home/xml-data/build-dir/SMACK-NIGHTLY-JOB1/smack-omemo/src/main/java/org/jivesoftware/smackx/omemo/OmemoManager.java:910: warning: no description for @throws
21-May-2019 01:03:43      * @throws InterruptedException
21-May-2019 01:03:43        ^
21-May-2019 01:03:43 /var/atlassian/bamboo-home/xml-data/build-dir/SMACK-NIGHTLY-JOB1/smack-omemo/src/main/java/org/jivesoftware/smackx/omemo/OmemoManager.java:911: warning: no description for @throws
21-May-2019 01:03:43      * @throws SmackException.NoResponseException
21-May-2019 01:03:43        ^
21-May-2019 01:03:43 /var/atlassian/bamboo-home/xml-data/build-dir/SMACK-NIGHTLY-JOB1/smack-omemo/src/main/java/org/jivesoftware/smackx/omemo/OmemoManager.java:913: warning: no description for @throws
21-May-2019 01:03:43      * @throws SmackException.NotConnectedException
21-May-2019 01:03:43        ^
21-May-2019 01:03:43 /var/atlassian/bamboo-home/xml-data/build-dir/SMACK-NIGHTLY-JOB1/smack-omemo/src/main/java/org/jivesoftware/smackx/omemo/OmemoRatchet.java:64: warning: no description for @throws
21-May-2019 01:03:43      * @throws CorruptedOmemoKeyException
21-May-2019 01:03:43        ^
21-May-2019 01:03:43 /var/atlassian/bamboo-home/xml-data/build-dir/SMACK-NIGHTLY-JOB1/smack-omemo/src/main/java/org/jivesoftware/smackx/omemo/OmemoRatchet.java:66: warning: no description for @throws
21-May-2019 01:03:43      * @throws CryptoFailedException
21-May-2019 01:03:43        ^
21-May-2019 01:03:43 /var/atlassian/bamboo-home/xml-data/build-dir/SMACK-NIGHTLY-JOB1/smack-omemo/src/main/java/org/jivesoftware/smackx/omemo/OmemoRatchet.java:67: warning: no description for @throws
21-May-2019 01:03:43      * @throws UntrustedOmemoIdentityException
21-May-2019 01:03:43        ^
21-May-2019 01:03:43 /var/atlassian/bamboo-home/xml-data/build-dir/SMACK-NIGHTLY-JOB1/smack-omemo/src/main/java/org/jivesoftware/smackx/omemo/OmemoService.java:879: warning: no description for @throws
21-May-2019 01:03:43      * @throws CorruptedOmemoKeyException
21-May-2019 01:03:43        ^
21-May-2019 01:03:43 100 warnings
21-May-2019 01:03:43
21-May-2019 01:03:43 > Task :smack-omemo:javadocJar
21-May-2019 01:03:43 > Task :smack-omemo:sourcesJar
21-May-2019 01:03:43 > Task :smack-omemo:signArchives SKIPPED
21-May-2019 01:03:43 > Task :smack-omemo:assemble
21-May-2019 01:03:44 > Task :smack-omemo:animalsnifferMain
21-May-2019 01:03:44 > Task :smack-omemo:checkstyleMain
21-May-2019 01:03:45 > Task :smack-omemo:checkstyleTest
21-May-2019 01:03:45 > Task :smack-omemo:clirr
21-May-2019 01:03:47 > Task :smack-omemo:test
21-May-2019 01:03:47 > Task :smack-omemo:check
21-May-2019 01:03:47 > Task :smack-omemo:build
21-May-2019 01:03:47 > Task :smack-omemo-signal:processResources NO-SOURCE
21-May-2019 01:03:47 > Task :smack-omemo-signal:classes
21-May-2019 01:03:47 > Task :smack-omemo-signal:jar
21-May-2019 01:03:47 > Task :smack-omemo-signal:copyJavadocDocFiles NO-SOURCE
21-May-2019 01:03:48 > Task :smack-omemo-signal:javadoc
21-May-2019 01:03:48 > Task :smack-omemo-signal:javadocJar
21-May-2019 01:03:48 > Task :smack-omemo-signal:sourcesJar
21-May-2019 01:03:49 > Task :smack-omemo-signal:compileTestJava
21-May-2019 01:03:49 > Task :smack-omemo-signal:processTestResources NO-SOURCE
21-May-2019 01:03:49 > Task :smack-omemo-signal:testClasses
21-May-2019 01:03:49 > Task :smack-omemo-signal:testJar
21-May-2019 01:03:49 > Task :smack-omemo-signal:signArchives SKIPPED
21-May-2019 01:03:49 > Task :smack-omemo-signal:assemble
21-May-2019 01:03:50 > Task :smack-omemo-signal:animalsnifferMain
21-May-2019 01:03:50 > Task :smack-omemo-signal:checkstyleMain
21-May-2019 01:03:50 > Task :smack-omemo-signal:checkstyleTest
21-May-2019 01:03:50 > Task :smack-omemo-signal:clirr
21-May-2019 01:03:53 > Task :smack-omemo-signal:test
21-May-2019 01:03:53 > Task :smack-omemo-signal:check
21-May-2019 01:03:53 > Task :smack-omemo-signal:build
21-May-2019 01:03:55 > Task :smack-omemo-signal-integration-test:compileJava
21-May-2019 01:03:55 > Task :smack-omemo-signal-integration-test:processResources NO-SOURCE
21-May-2019 01:03:55 > Task :smack-omemo-signal-integration-test:classes
21-May-2019 01:03:55 > Task :smack-omemo-signal-integration-test:jar
21-May-2019 01:03:55 > Task :smack-omemo-signal-integration-test:startScripts
21-May-2019 01:03:55 > Task :smack-omemo-signal-integration-test:distTar
21-May-2019 01:03:55 > Task :smack-omemo-signal-integration-test:distZip
21-May-2019 01:03:55 > Task :smack-omemo-signal-integration-test:copyJavadocDocFiles NO-SOURCE
21-May-2019 01:03:57 > Task :smack-omemo-signal-integration-test:javadoc
21-May-2019 01:03:57 > Task :smack-omemo-signal-integration-test:javadocJar
21-May-2019 01:03:57 > Task :smack-omemo-signal-integration-test:sourcesJar
21-May-2019 01:03:57 > Task :smack-omemo-signal-integration-test:compileTestJava NO-SOURCE
21-May-2019 01:03:57 > Task :smack-omemo-signal-integration-test:processTestResources NO-SOURCE
21-May-2019 01:03:57 > Task :smack-omemo-signal-integration-test:testClasses UP-TO-DATE
21-May-2019 01:03:57 > Task :smack-omemo-signal-integration-test:testJar
21-May-2019 01:03:57 > Task :smack-omemo-signal-integration-test:signArchives SKIPPED
21-May-2019 01:03:57 > Task :smack-omemo-signal-integration-test:assemble
21-May-2019 01:03:57 > Task :smack-omemo-signal-integration-test:checkstyleMain
21-May-2019 01:03:57 > Task :smack-omemo-signal-integration-test:checkstyleTest NO-SOURCE
21-May-2019 01:03:57 > Task :smack-omemo-signal-integration-test:clirr
21-May-2019 01:03:57 > Task :smack-omemo-signal-integration-test:test NO-SOURCE
21-May-2019 01:03:57 > Task :smack-omemo-signal-integration-test:check
21-May-2019 01:03:57 > Task :smack-omemo-signal-integration-test:build
21-May-2019 01:03:57 > Task :smack-openpgp:copyJavadocDocFiles NO-SOURCE
21-May-2019 01:03:59 > Task :smack-openpgp:javadoc
21-May-2019 01:03:59 > Task :smack-openpgp:javadocJar
21-May-2019 01:03:59 > Task :smack-openpgp:sourcesJar
21-May-2019 01:04:01 > Task :smack-openpgp:compileTestJava
21-May-2019 01:04:01 > Task :smack-openpgp:processTestResources NO-SOURCE
21-May-2019 01:04:01 > Task :smack-openpgp:testClasses
21-May-2019 01:04:01 > Task :smack-openpgp:testJar
21-May-2019 01:04:01 > Task :smack-openpgp:signArchives SKIPPED
21-May-2019 01:04:01 > Task :smack-openpgp:assemble
21-May-2019 01:04:01 > Task :smack-openpgp:animalsnifferMain
21-May-2019 01:04:02 > Task :smack-openpgp:checkstyleMain
21-May-2019 01:04:02 > Task :smack-openpgp:checkstyleTest
21-May-2019 01:04:02 > Task :smack-openpgp:clirr
21-May-2019 01:04:07 > Task :smack-openpgp:test
21-May-2019 01:04:07 > Task :smack-openpgp:check
21-May-2019 01:04:07 > Task :smack-openpgp:build
21-May-2019 01:04:07 > Task :smack-repl:compileJava UP-TO-DATE
21-May-2019 01:04:07 > Task :smack-repl:compileScala UP-TO-DATE
21-May-2019 01:04:07 > Task :smack-repl:processResources NO-SOURCE
21-May-2019 01:04:07 > Task :smack-repl:classes UP-TO-DATE
21-May-2019 01:04:07 > Task :smack-repl:jar
21-May-2019 01:04:07 > Task :smack-repl:copyJavadocDocFiles NO-SOURCE
21-May-2019 01:04:08 > Task :smack-repl:javadoc
21-May-2019 01:04:08 > Task :smack-repl:javadocJar
21-May-2019 01:04:08 > Task :smack-repl:sourcesJar
21-May-2019 01:04:09 > Task :smack-repl:compileTestJava
21-May-2019 01:04:09 > Task :smack-repl:compileTestScala NO-SOURCE
21-May-2019 01:04:09 > Task :smack-repl:processTestResources NO-SOURCE
21-May-2019 01:04:09 > Task :smack-repl:testClasses
21-May-2019 01:04:09 > Task :smack-repl:testJar
21-May-2019 01:04:09 > Task :smack-repl:signArchives SKIPPED
21-May-2019 01:04:09 > Task :smack-repl:assemble
21-May-2019 01:04:09 > Task :smack-repl:checkstyleMain
21-May-2019 01:04:09 > Task :smack-repl:checkstyleTest
21-May-2019 01:04:09 > Task :smack-resolver-minidns-dox:processResources NO-SOURCE
21-May-2019 01:04:09 > Task :smack-resolver-minidns-dox:classes UP-TO-DATE
21-May-2019 01:04:09 > Task :smack-resolver-minidns-dox:jar UP-TO-DATE
21-May-2019 01:04:09 > Task :smack-repl:clirr
21-May-2019 01:04:10 Found 0 errors
21-May-2019 01:04:10
21-May-2019 01:04:10 > Task :smack-repl:scalaStyleMainCheck
21-May-2019 01:04:10 Processed 1 file(s)
21-May-2019 01:04:10 Found 0 warnings
21-May-2019 01:04:10 Finished in 787 ms
21-May-2019 01:04:10
21-May-2019 01:04:10 > Task :smack-repl:scalaStyleTestCheck NO-SOURCE
21-May-2019 01:04:10 > Task :smack-repl:scalaStyleCheck
21-May-2019 01:04:12 > Task :smack-repl:test
21-May-2019 01:04:12 > Task :smack-repl:check
21-May-2019 01:04:12 > Task :smack-repl:build
21-May-2019 01:04:13 > Task :smack-resolver-dnsjava:compileJava
21-May-2019 01:04:13 > Task :smack-resolver-dnsjava:processResources NO-SOURCE
21-May-2019 01:04:13 > Task :smack-resolver-dnsjava:classes
21-May-2019 01:04:13 > Task :smack-resolver-dnsjava:jar
21-May-2019 01:04:13 > Task :smack-resolver-dnsjava:copyJavadocDocFiles NO-SOURCE
21-May-2019 01:04:14 > Task :smack-resolver-dnsjava:javadoc
21-May-2019 01:04:14 > Task :smack-resolver-dnsjava:javadocJar
21-May-2019 01:04:14 > Task :smack-resolver-dnsjava:sourcesJar
21-May-2019 01:04:14 > Task :smack-resolver-dnsjava:compileTestJava NO-SOURCE
21-May-2019 01:04:14 > Task :smack-resolver-dnsjava:processTestResources NO-SOURCE
21-May-2019 01:04:14 > Task :smack-resolver-dnsjava:testClasses UP-TO-DATE
21-May-2019 01:04:14 > Task :smack-resolver-dnsjava:testJar
21-May-2019 01:04:14 > Task :smack-resolver-dnsjava:signArchives SKIPPED
21-May-2019 01:04:14 > Task :smack-resolver-dnsjava:assemble
21-May-2019 01:04:14 > Task :smack-resolver-dnsjava:checkstyleMain
21-May-2019 01:04:14 > Task :smack-resolver-dnsjava:checkstyleTest NO-SOURCE
21-May-2019 01:04:14 > Task :smack-resolver-dnsjava:clirr
21-May-2019 01:04:14 > Task :smack-resolver-dnsjava:test NO-SOURCE
21-May-2019 01:04:14 > Task :smack-resolver-dnsjava:check
21-May-2019 01:04:14 > Task :smack-resolver-dnsjava:build
21-May-2019 01:04:14 > Task :smack-resolver-javax:copyJavadocDocFiles NO-SOURCE
21-May-2019 01:04:15 > Task :smack-resolver-javax:javadoc
21-May-2019 01:04:15 > Task :smack-resolver-javax:javadocJar
21-May-2019 01:04:15 > Task :smack-resolver-javax:sourcesJar
21-May-2019 01:04:15 > Task :smack-resolver-javax:compileTestJava NO-SOURCE
21-May-2019 01:04:15 > Task :smack-resolver-javax:processTestResources NO-SOURCE
21-May-2019 01:04:15 > Task :smack-resolver-javax:testClasses UP-TO-DATE
21-May-2019 01:04:15 > Task :smack-resolver-javax:testJar
21-May-2019 01:04:15 > Task :smack-resolver-javax:signArchives SKIPPED
21-May-2019 01:04:15 > Task :smack-resolver-javax:assemble
21-May-2019 01:04:15 > Task :smack-resolver-javax:checkstyleMain
21-May-2019 01:04:15 > Task :smack-resolver-javax:checkstyleTest NO-SOURCE
21-May-2019 01:04:15 > Task :smack-resolver-javax:clirr
21-May-2019 01:04:15 > Task :smack-resolver-javax:test NO-SOURCE
21-May-2019 01:04:15 > Task :smack-resolver-javax:check
21-May-2019 01:04:15 > Task :smack-resolver-javax:build
21-May-2019 01:04:15 > Task :smack-resolver-minidns:copyJavadocDocFiles NO-SOURCE
21-May-2019 01:04:16 > Task :smack-resolver-minidns:javadoc
21-May-2019 01:04:16 > Task :smack-resolver-minidns:javadocJar
21-May-2019 01:04:16 > Task :smack-resolver-minidns:sourcesJar
21-May-2019 01:04:16 > Task :smack-resolver-minidns:compileTestJava NO-SOURCE
21-May-2019 01:04:16 > Task :smack-resolver-minidns:processTestResources NO-SOURCE
21-May-2019 01:04:16 > Task :smack-resolver-minidns:testClasses UP-TO-DATE
21-May-2019 01:04:16 > Task :smack-resolver-minidns:testJar
21-May-2019 01:04:16 > Task :smack-resolver-minidns:signArchives SKIPPED
21-May-2019 01:04:16 > Task :smack-resolver-minidns:assemble
21-May-2019 01:04:16 > Task :smack-resolver-minidns:animalsnifferMain
21-May-2019 01:04:16 > Task :smack-resolver-minidns:checkstyleMain
21-May-2019 01:04:16 > Task :smack-resolver-minidns:checkstyleTest NO-SOURCE
21-May-2019 01:04:16 > Task :smack-resolver-minidns:clirr
21-May-2019 01:04:16 > Task :smack-resolver-minidns:test NO-SOURCE
21-May-2019 01:04:16 > Task :smack-resolver-minidns:check
21-May-2019 01:04:16 > Task :smack-resolver-minidns:build
21-May-2019 01:04:16 > Task :smack-resolver-minidns-dox:copyJavadocDocFiles NO-SOURCE
21-May-2019 01:04:17 > Task :smack-resolver-minidns-dox:javadoc
21-May-2019 01:04:17 > Task :smack-resolver-minidns-dox:javadocJar
21-May-2019 01:04:17 > Task :smack-resolver-minidns-dox:sourcesJar
21-May-2019 01:04:18 > Task :smack-resolver-minidns-dox:compileTestJava
21-May-2019 01:04:18 > Task :smack-resolver-minidns-dox:processTestResources NO-SOURCE
21-May-2019 01:04:18 > Task :smack-resolver-minidns-dox:testClasses
21-May-2019 01:04:18 > Task :smack-resolver-minidns-dox:testJar
21-May-2019 01:04:18 > Task :smack-resolver-minidns-dox:signArchives SKIPPED
21-May-2019 01:04:18 > Task :smack-resolver-minidns-dox:assemble
21-May-2019 01:04:18 > Task :smack-resolver-minidns-dox:checkstyleMain
21-May-2019 01:04:18 > Task :smack-resolver-minidns-dox:checkstyleTest
21-May-2019 01:04:18 > Task :smack-resolver-minidns-dox:clirr
21-May-2019 01:04:20 > Task :smack-resolver-minidns-dox:test
21-May-2019 01:04:20 > Task :smack-resolver-minidns-dox:check
21-May-2019 01:04:20 > Task :smack-resolver-minidns-dox:build
21-May-2019 01:04:20 > Task :smack-sasl-javax:copyJavadocDocFiles NO-SOURCE
21-May-2019 01:04:21 > Task :smack-sasl-javax:javadoc
21-May-2019 01:04:21 > Task :smack-sasl-javax:javadocJar
21-May-2019 01:04:21 > Task :smack-sasl-javax:sourcesJar
21-May-2019 01:04:22 > Task :smack-sasl-javax:compileTestJava
21-May-2019 01:04:22 > Task :smack-sasl-javax:processTestResources NO-SOURCE
21-May-2019 01:04:22 > Task :smack-sasl-javax:testClasses
21-May-2019 01:04:22 > Task :smack-sasl-javax:testJar
21-May-2019 01:04:22 > Task :smack-sasl-javax:signArchives SKIPPED
21-May-2019 01:04:22 > Task :smack-sasl-javax:assemble
21-May-2019 01:04:22 > Task :smack-sasl-javax:checkstyleMain
21-May-2019 01:04:22 > Task :smack-sasl-javax:checkstyleTest
21-May-2019 01:04:22 > Task :smack-sasl-javax:clirr
21-May-2019 01:04:24 > Task :smack-sasl-javax:test
21-May-2019 01:04:24 > Task :smack-sasl-javax:check
21-May-2019 01:04:24 > Task :smack-sasl-javax:build
21-May-2019 01:04:24 > Task :smack-sasl-provided:copyJavadocDocFiles NO-SOURCE
21-May-2019 01:04:25 > Task :smack-sasl-provided:javadoc
21-May-2019 01:04:25 > Task :smack-sasl-provided:javadocJar
21-May-2019 01:04:25 > Task :smack-sasl-provided:sourcesJar
21-May-2019 01:04:26 > Task :smack-sasl-provided:compileTestJava
21-May-2019 01:04:26 > Task :smack-sasl-provided:processTestResources NO-SOURCE
21-May-2019 01:04:26 > Task :smack-sasl-provided:testClasses
21-May-2019 01:04:26 > Task :smack-sasl-provided:testJar
21-May-2019 01:04:26 > Task :smack-sasl-provided:signArchives SKIPPED
21-May-2019 01:04:26 > Task :smack-sasl-provided:assemble
21-May-2019 01:04:26 > Task :smack-sasl-provided:animalsnifferMain
21-May-2019 01:04:26 > Task :smack-sasl-provided:checkstyleMain
21-May-2019 01:04:26 > Task :smack-sasl-provided:checkstyleTest
21-May-2019 01:04:26 > Task :smack-sasl-provided:clirr
21-May-2019 01:04:28 > Task :smack-sasl-provided:test
21-May-2019 01:04:28 > Task :smack-sasl-provided:check
21-May-2019 01:04:28 > Task :smack-sasl-provided:build
21-May-2019 01:04:28 > Task :smack-tcp:copyJavadocDocFiles
21-May-2019 01:04:30
21-May-2019 01:04:30 > Task :smack-tcp:javadoc
21-May-2019 01:04:30 17 warnings
21-May-2019 01:04:30
21-May-2019 01:04:30 > Task :smack-tcp:javadocJar
21-May-2019 01:04:30 > Task :smack-tcp:sourcesJar
21-May-2019 01:04:30 /var/atlassian/bamboo-home/xml-data/build-dir/SMACK-NIGHTLY-JOB1/smack-tcp/src/main/java/org/jivesoftware/smack/tcp/XMPPTCPConnection.java:811: warning: no description for @throws
21-May-2019 01:04:30      * @throws SmackException
21-May-2019 01:04:30        ^
21-May-2019 01:04:30 /var/atlassian/bamboo-home/xml-data/build-dir/SMACK-NIGHTLY-JOB1/smack-tcp/src/main/java/org/jivesoftware/smack/tcp/XMPPTCPConnection.java:812: warning: no description for @throws
21-May-2019 01:04:30      * @throws IOException
21-May-2019 01:04:30        ^
21-May-2019 01:04:30 /var/atlassian/bamboo-home/xml-data/build-dir/SMACK-NIGHTLY-JOB1/smack-tcp/src/main/java/org/jivesoftware/smack/tcp/XMPPTCPConnection.java:813: warning: no description for @throws
21-May-2019 01:04:30      * @throws InterruptedException
21-May-2019 01:04:30        ^
21-May-2019 01:04:30 /var/atlassian/bamboo-home/xml-data/build-dir/SMACK-NIGHTLY-JOB1/smack-tcp/src/main/java/org/jivesoftware/smack/tcp/XMPPTCPConnection.java:835: warning: no description for @param
21-May-2019 01:04:30      * @param writer
21-May-2019 01:04:30        ^
21-May-2019 01:04:30 /var/atlassian/bamboo-home/xml-data/build-dir/SMACK-NIGHTLY-JOB1/smack-tcp/src/main/java/org/jivesoftware/smack/tcp/XMPPTCPConnection.java:1573: warning: no description for @throws
21-May-2019 01:04:30      * @throws InterruptedException
21-May-2019 01:04:30        ^
21-May-2019 01:04:30 /var/atlassian/bamboo-home/xml-data/build-dir/SMACK-NIGHTLY-JOB1/smack-tcp/src/main/java/org/jivesoftware/smack/tcp/XMPPTCPConnection.java:1596: warning: no description for @throws
21-May-2019 01:04:30      * @throws InterruptedException
21-May-2019 01:04:30        ^
21-May-2019 01:04:30 /var/atlassian/bamboo-home/xml-data/build-dir/SMACK-NIGHTLY-JOB1/smack-tcp/src/main/java/org/jivesoftware/smack/tcp/XMPPTCPConnection.java:1873: warning: no description for @param
21-May-2019 01:04:30      * @param defaultBundleAndDeferCallback
21-May-2019 01:04:30        ^
21-May-2019 01:04:30 /var/atlassian/bamboo-home/xml-data/build-dir/SMACK-NIGHTLY-JOB1/smack-tcp/src/main/java/org/jivesoftware/smack/tcp/XMPPTCPConnection.java:317: warning: no description for @throws
21-May-2019 01:04:30      * @throws XmppStringprepException
21-May-2019 01:04:30        ^
21-May-2019 01:04:30 /var/atlassian/bamboo-home/xml-data/build-dir/SMACK-NIGHTLY-JOB1/smack-tcp/src/main/java/org/jivesoftware/smack/tcp/XMPPTCPConnection.java:330: warning: no description for @param
21-May-2019 01:04:30      * @param username
21-May-2019 01:04:30        ^
21-May-2019 01:04:30 /var/atlassian/bamboo-home/xml-data/build-dir/SMACK-NIGHTLY-JOB1/smack-tcp/src/main/java/org/jivesoftware/smack/tcp/XMPPTCPConnection.java:331: warning: no description for @param
21-May-2019 01:04:30      * @param password
21-May-2019 01:04:30        ^
21-May-2019 01:04:30 /var/atlassian/bamboo-home/xml-data/build-dir/SMACK-NIGHTLY-JOB1/smack-tcp/src/main/java/org/jivesoftware/smack/tcp/XMPPTCPConnection.java:332: warning: no description for @param
21-May-2019 01:04:30      * @param serviceName
21-May-2019 01:04:30        ^
21-May-2019 01:04:30 /var/atlassian/bamboo-home/xml-data/build-dir/SMACK-NIGHTLY-JOB1/smack-tcp/src/main/java/org/jivesoftware/smack/tcp/XMPPTCPConnection.java:333: warning: no description for @throws
21-May-2019 01:04:30      * @throws XmppStringprepException
21-May-2019 01:04:30        ^
21-May-2019 01:04:30 /var/atlassian/bamboo-home/xml-data/build-dir/SMACK-NIGHTLY-JOB1/smack-tcp/src/main/java/org/jivesoftware/smack/tcp/XMPPTCPConnection.java:1240: warning: no description for @throws
21-May-2019 01:04:30          * @throws NotConnectedException
21-May-2019 01:04:30            ^
21-May-2019 01:04:30 /var/atlassian/bamboo-home/xml-data/build-dir/SMACK-NIGHTLY-JOB1/smack-tcp/src/main/java/org/jivesoftware/smack/tcp/XMPPTCPConnection.java:1241: warning: no description for @throws
21-May-2019 01:04:30          * @throws InterruptedException
21-May-2019 01:04:30            ^
21-May-2019 01:04:30 /var/atlassian/bamboo-home/xml-data/build-dir/SMACK-NIGHTLY-JOB1/smack-tcp/src/main/java/org/jivesoftware/smack/sm/SMUtils.java:33: warning: no description for @param
21-May-2019 01:04:30      * @param height
21-May-2019 01:04:30        ^
21-May-2019 01:04:30 /var/atlassian/bamboo-home/xml-data/build-dir/SMACK-NIGHTLY-JOB1/smack-tcp/src/main/java/org/jivesoftware/smack/sm/SMUtils.java:45: warning: no description for @param
21-May-2019 01:04:30      * @param reportedHandledCount
21-May-2019 01:04:30        ^
21-May-2019 01:04:30 /var/atlassian/bamboo-home/xml-data/build-dir/SMACK-NIGHTLY-JOB1/smack-tcp/src/main/java/org/jivesoftware/smack/sm/SMUtils.java:46: warning: no description for @param
21-May-2019 01:04:30      * @param lastKnownHandledCount
21-May-2019 01:04:30        ^
21-May-2019 01:04:31 > Task :smack-tcp:compileTestJava
21-May-2019 01:04:31 > Task :smack-tcp:processTestResources NO-SOURCE
21-May-2019 01:04:31 > Task :smack-tcp:testClasses
21-May-2019 01:04:31 > Task :smack-tcp:testJar
21-May-2019 01:04:31 > Task :smack-tcp:signArchives SKIPPED
21-May-2019 01:04:31 > Task :smack-tcp:assemble
21-May-2019 01:04:31 > Task :smack-tcp:animalsnifferMain
21-May-2019 01:04:32 > Task :smack-tcp:checkstyleMain
21-May-2019 01:04:32 > Task :smack-tcp:checkstyleTest
21-May-2019 01:04:32 > Task :smack-tcp:clirr
21-May-2019 01:04:34 > Task :smack-tcp:test
21-May-2019 01:04:34 > Task :smack-tcp:check
21-May-2019 01:04:34 > Task :smack-tcp:build
21-May-2019 01:04:34 > Task :smack-xmlparser:copyJavadocDocFiles NO-SOURCE
21-May-2019 01:04:35 > Task :smack-xmlparser:javadoc
21-May-2019 01:04:35 > Task :smack-xmlparser:javadocJar
21-May-2019 01:04:35 > Task :smack-xmlparser:sourcesJar
21-May-2019 01:04:36 > Task :smack-xmlparser:compileTestJava
21-May-2019 01:04:36 > Task :smack-xmlparser:processTestResources NO-SOURCE
21-May-2019 01:04:36 > Task :smack-xmlparser:testClasses
21-May-2019 01:04:36 > Task :smack-xmlparser:testJar
21-May-2019 01:04:36 > Task :smack-xmlparser:signArchives SKIPPED
21-May-2019 01:04:36 > Task :smack-xmlparser:assemble
21-May-2019 01:04:36 > Task :smack-xmlparser:animalsnifferMain UP-TO-DATE
21-May-2019 01:04:36 > Task :smack-xmlparser:checkstyleMain
21-May-2019 01:04:36 > Task :smack-xmlparser:checkstyleTest
21-May-2019 01:04:36 > Task :smack-xmlparser:clirr
21-May-2019 01:04:37 > Task :smack-xmlparser:test
21-May-2019 01:04:37 > Task :smack-xmlparser:check
21-May-2019 01:04:37 > Task :smack-xmlparser:build
21-May-2019 01:04:37 > Task :smack-xmlparser-stax:copyJavadocDocFiles NO-SOURCE
21-May-2019 01:04:38 > Task :smack-xmlparser-stax:javadoc
21-May-2019 01:04:38 > Task :smack-xmlparser-stax:javadocJar
21-May-2019 01:04:38 > Task :smack-xmlparser-stax:sourcesJar
21-May-2019 01:04:39 > Task :smack-xmlparser-stax:compileTestJava
21-May-2019 01:04:39 > Task :smack-xmlparser-stax:processTestResources NO-SOURCE
21-May-2019 01:04:39 > Task :smack-xmlparser-stax:testClasses
21-May-2019 01:04:39 > Task :smack-xmlparser-stax:testJar
21-May-2019 01:04:39 > Task :smack-xmlparser-stax:signArchives SKIPPED
21-May-2019 01:04:39 > Task :smack-xmlparser-stax:assemble
21-May-2019 01:04:39 > Task :smack-xmlparser-stax:checkstyleMain
21-May-2019 01:04:39 > Task :smack-xmlparser-stax:checkstyleTest
21-May-2019 01:04:39 > Task :smack-xmlparser-stax:clirr
21-May-2019 01:04:40 > Task :smack-xmlparser-stax:test
21-May-2019 01:04:40 > Task :smack-xmlparser-stax:check
21-May-2019 01:04:40 > Task :smack-xmlparser-stax:build
21-May-2019 01:04:40 > Task :smack-xmlparser-xpp3:copyJavadocDocFiles NO-SOURCE
21-May-2019 01:04:41 > Task :smack-xmlparser-xpp3:javadoc
21-May-2019 01:04:41 > Task :smack-xmlparser-xpp3:javadocJar
21-May-2019 01:04:41 > Task :smack-xmlparser-xpp3:sourcesJar
21-May-2019 01:04:42 > Task :smack-xmlparser-xpp3:compileTestJava
21-May-2019 01:04:42 > Task :smack-xmlparser-xpp3:processTestResources NO-SOURCE
21-May-2019 01:04:42 > Task :smack-xmlparser-xpp3:testClasses
21-May-2019 01:04:42 > Task :smack-xmlparser-xpp3:testJar
21-May-2019 01:04:42 > Task :smack-xmlparser-xpp3:signArchives SKIPPED
21-May-2019 01:04:42 > Task :smack-xmlparser-xpp3:assemble
21-May-2019 01:04:42 > Task :smack-xmlparser-xpp3:animalsnifferMain UP-TO-DATE
21-May-2019 01:04:42 > Task :smack-xmlparser-xpp3:checkstyleMain
21-May-2019 01:04:42 > Task :smack-xmlparser-xpp3:checkstyleTest
21-May-2019 01:04:42 > Task :smack-xmlparser-xpp3:clirr
21-May-2019 01:04:44 > Task :smack-xmlparser-xpp3:test
21-May-2019 01:04:44 > Task :smack-xmlparser-xpp3:check
21-May-2019 01:04:44 > Task :smack-xmlparser-xpp3:build
21-May-2019 01:04:47 > Task :distributionZip
21-May-2019 01:04:48 > Task :smack-core:jacocoTestReport
21-May-2019 01:04:48 > Task :smack-experimental:jacocoTestReport
21-May-2019 01:04:49 > Task :smack-extensions:jacocoTestReport
21-May-2019 01:04:49 > Task :smack-im:jacocoTestReport
21-May-2019 01:04:50 > Task :smack-integration-test:jacocoTestReport
21-May-2019 01:04:50 > Task :smack-legacy:jacocoTestReport
21-May-2019 01:04:50 > Task :smack-omemo:jacocoTestReport
21-May-2019 01:04:50 > Task :smack-omemo-signal:jacocoTestReport
21-May-2019 01:04:50 > Task :smack-openpgp:jacocoTestReport
21-May-2019 01:04:50 > Task :smack-repl:jacocoTestReport
21-May-2019 01:04:50 > Task :smack-resolver-minidns-dox:jacocoTestReport
21-May-2019 01:04:50 > Task :smack-sasl-javax:jacocoTestReport
21-May-2019 01:04:50 > Task :smack-sasl-provided:jacocoTestReport
21-May-2019 01:04:50 > Task :smack-tcp:jacocoTestReport
21-May-2019 01:04:50 > Task :smack-xmlparser:jacocoTestReport
21-May-2019 01:04:50 > Task :smack-xmlparser-stax:jacocoTestReport
21-May-2019 01:04:50 > Task :smack-xmlparser-xpp3:jacocoTestReport
21-May-2019 01:04:53 > Task :jacocoRootReport
21-May-2019 01:04:53
21-May-2019 01:04:53 BUILD SUCCESSFUL in 4m 50s
21-May-2019 01:04:53 375 actionable tasks: 316 executed, 59 up-to-date
21-May-2019 01:04:53 Finished task 'Gradle distribution zip' with result: Success
21-May-2019 01:04:53 Starting task 'Parse test reports' of type 'com.atlassian.bamboo.plugins.testresultparser:task.testresultparser.junit'
21-May-2019 01:04:53 Parsing test results under /var/atlassian/bamboo-home/xml-data/build-dir/SMACK-NIGHTLY-JOB1...
21-May-2019 01:04:54 Finished task 'Parse test reports' with result: Success
21-May-2019 01:04:54 Starting task 'Install artifacts in system-local Ignite Maven Repo' of type 'com.atlassian.bamboo.plugins.scripttask:task.builder.command'
21-May-2019 01:04:54
Beginning to execute external process for build 'Smack - Nightly Binary Distribution Build - Default Job #1662 (SMACK-NIGHTLY-JOB1-1662)'
... running command line:
/opt/gradle/bin/gradle --stacktrace uploadLocal -Dmaven.repo.local=/mnt/maven
... in: /var/atlassian/bamboo-home/xml-data/build-dir/SMACK-NIGHTLY-JOB1
... using extra environment variables:
bamboo_planRepository_1_branch=master
bamboo_planRepository_1_branchDisplayName=master
bamboo_repository_revision_number=02f7cfcf277b8c5f359134040674ece472dae308
bamboo_capability_daily_xfer=
bamboo_resultsUrl=https://bamboo.igniterealtime.org/browse/SMACK-NIGHTLY-JOB1-1662
bamboo_repository_39256079_git_branch=master
bamboo_build_working_directory=/var/atlassian/bamboo-home/xml-data/build-dir/SMACK-NIGHTLY-JOB1
bamboo_capability_system_builder_command_Gradle=/opt/gradle/bin/gradle
bamboo_planRepository_1_name=Smack (master)
bamboo_buildKey=SMACK-NIGHTLY-JOB1
bamboo_shortPlanName=Nightly Binary Distribution Build
bamboo_planRepository_name=Smack (master)
bamboo_capability_system_jdk_JDK_1_6_0_20=/opt/java/sdk/Sun/jdk1.6.0_20
bamboo_buildNumber=1662
bamboo_shortJobName=Default Job
bamboo_buildResultsUrl=https://bamboo.igniterealtime.org/browse/SMACK-NIGHTLY-JOB1-1662
bamboo_capability_system_builder_command_Gradle__Faketime_=/opt/gradle-faketime
bamboo_planRepository_repositoryUrl=https://github.com/igniterealtime/Smack.git
bamboo_repository_39256079_branch_name=master
bamboo_agentId=131073
bamboo_planName=Smack - Nightly Binary Distribution Build
bamboo_shortPlanKey=NIGHTLY
bamboo_capability_system_builder_command_Gradle_4_9=/opt/gradle-4.9/bin/gradle
bamboo_shortJobKey=JOB1
bamboo_planRepository_revision=02f7cfcf277b8c5f359134040674ece472dae308
bamboo_buildTimeStamp=2019-05-21T01:00:01.249Z
bamboo_repository_previous_revision_number=f7762c5db7dedb636fb54758b9854291da4a7fdb
bamboo_capability_system_builder_mvn2_Maven_2=/opt/maven/apache-maven-2.2.1
bamboo_planRepository_previousRevision=f7762c5db7dedb636fb54758b9854291da4a7fdb
bamboo_capability_rpm=
bamboo_capability_system_builder_ant_Ant_1_9_4=/opt/apache-ant-1.9.4
bamboo_repository_git_branch=master
bamboo_buildResultKey=SMACK-NIGHTLY-JOB1-1662
bamboo_repository_branch_name=master
bamboo_buildPlanName=Smack - Nightly Binary Distribution Build - Default Job
bamboo_capability_Install4j=7.0.7
bamboo_planRepository_1_revision=02f7cfcf277b8c5f359134040674ece472dae308
bamboo_capability_system_builder_ant_Ant_1_7_1=/opt/apache-ant-1.7.1
bamboo_repository_name=Smack (master)
bamboo_repository_39256079_revision_number=02f7cfcf277b8c5f359134040674ece472dae308
bamboo_capability_system_builder_mvn2_Maven_2_2_1=/opt/maven/apache-maven-2.2.1
bamboo_buildFailed=false
bamboo_planRepository_branch=master
bamboo_capability_system_jdk_JDK_1_7_0_51=/opt/java/sdk/1.7
bamboo_capability_system_builder_command_Bash=/bin/bash
bamboo_agentWorkingDirectory=/var/atlassian/bamboo-home/xml-data/build-dir
bamboo_capability_system_git_executable=/usr/bin/git
bamboo_repository_git_username=
bamboo_repository_39256079_previous_revision_number=f7762c5db7dedb636fb54758b9854291da4a7fdb
bamboo_planRepository_1_previousRevision=f7762c5db7dedb636fb54758b9854291da4a7fdb
bamboo_planRepository_branchDisplayName=master
bamboo_planRepository_1_type=gitv2
bamboo_repository_39256079_git_repositoryUrl=https://github.com/igniterealtime/Smack.git
bamboo_planRepository_branchName=master
bamboo_capability_flex_sdk=4.6
bamboo_repository_39256079_name=Smack (master)
bamboo_capability_system_builder_mvn3_Maven=/opt/maven
bamboo_capability_system_jdk_JDK=/opt/java/sdk/current
bamboo_capability_android=
bamboo_plan_storageTag=SMACK-NIGHTLY
bamboo_hg_cache_directory=/var/atlassian/bamboo-home/xml-data/build-dir/_hg-repositories-cache
bamboo_planRepository_1_username=
bamboo_planRepository_type=gitv2
bamboo_git_cache_directory=/var/atlassian/bamboo-home/xml-data/build-dir/_git-repositories-cache
bamboo_repository_git_repositoryUrl=https://github.com/igniterealtime/Smack.git
bamboo_capability_system_builder_ant_Ant=/opt/apache-ant-1.9.7
bamboo_tmp_directory=/var/atlassian/bamboo-home/temp
bamboo_working_directory=/var/atlassian/bamboo-home/xml-data/build-dir/SMACK-NIGHTLY-JOB1
bamboo_capability_faketime=
bamboo_planKey=SMACK-NIGHTLY
bamboo_planRepository_1_repositoryUrl=https://github.com/igniterealtime/Smack.git
bamboo_planRepository_username=
bamboo_build_commandline_com_atlassian_bamboo_plugins_scripttask_task_builder_command_4=/opt/gradle/bin/gradle --stacktrace --no-daemon clean distributionZip javadocAll jacocoRootReport
bamboo_capability_system_jdk_JDK_1_8=/opt/java/sdk/current
bamboo_capability_system_builder_ant_Ant_1_8_1=/opt/apache-ant-1.8.1
bamboo_capability_system_jdk_JDK_1_6=/opt/java/sdk/1.6
bamboo_repository_39256079_git_username=
bamboo_capability_system_jdk_JDK_1_7=/opt/java/sdk/1.7
bamboo_capability_system_builder_ant_Ant_1_6_5=/opt/apache-ant-1.6.5
bamboo_planRepository_1_branchName=master
21-May-2019 01:04:56 > Task :smack-core:createVersionResource UP-TO-DATE
21-May-2019 01:04:56 > Task :smack-xmlparser:compileJava UP-TO-DATE
21-May-2019 01:04:57 > Task :smack-core:compileJava UP-TO-DATE
21-May-2019 01:04:57 > Task :smack-im:compileJava UP-TO-DATE
21-May-2019 01:04:57 > Task :smack-extensions:compileJava UP-TO-DATE
21-May-2019 01:04:57 > Task :smack-experimental:compileJava UP-TO-DATE
21-May-2019 01:04:57 > Task :smack-openpgp:compileJava UP-TO-DATE
21-May-2019 01:04:57 > Task :smack-resolver-minidns:compileJava UP-TO-DATE
21-May-2019 01:04:57 > Task :smack-sasl-provided:compileJava UP-TO-DATE
21-May-2019 01:04:57 > Task :smack-xmlparser-xpp3:compileJava UP-TO-DATE
21-May-2019 01:04:57 > Task :smack-android:compileJava UP-TO-DATE
21-May-2019 01:04:57 > Task :smack-android:processResources NO-SOURCE
21-May-2019 01:04:57 > Task :smack-android:classes UP-TO-DATE
21-May-2019 01:04:57 > Task :smack-android:jar UP-TO-DATE
21-May-2019 01:04:57 > Task :smack-android:copyJavadocDocFiles NO-SOURCE
21-May-2019 01:04:57 > Task :smack-android:javadoc UP-TO-DATE
21-May-2019 01:04:57 > Task :smack-android:javadocJar UP-TO-DATE
21-May-2019 01:04:57 > Task :smack-android:sourcesJar UP-TO-DATE
21-May-2019 01:04:57 > Task :smack-android:compileTestJava NO-SOURCE
21-May-2019 01:04:57 > Task :smack-android:processTestResources NO-SOURCE
21-May-2019 01:04:57 > Task :smack-android:testClasses UP-TO-DATE
21-May-2019 01:04:57 > Task :smack-android:testJar UP-TO-DATE
21-May-2019 01:04:57 > Task :smack-android:signArchives SKIPPED
21-May-2019 01:04:57 > Task :smack-android:uploadLocal FAILED
21-May-2019 01:04:57
21-May-2019 01:04:57 FAILURE: Build failed with an exception.
21-May-2019 01:04:57
21-May-2019 01:04:57 * What went wrong:
21-May-2019 01:04:57 Execution failed for task ':smack-android:uploadLocal'.
21-May-2019 01:04:57 > Could not publish configuration 'archives'
21-May-2019 01:04:57    > Could not write to file '/var/atlassian/bamboo-home/xml-data/build-dir/SMACK-NIGHTLY-JOB1/smack-android/build/poms/pom-default.xml'.
21-May-2019 01:04:57
21-May-2019 01:04:57 * Try:
21-May-2019 01:04:57 Run with --info or --debug option to get more log output. Run with --scan to get full insights.
21-May-2019 01:04:57
21-May-2019 01:04:57 * Exception is:
21-May-2019 01:04:57 org.gradle.api.tasks.TaskExecutionException: Execution failed for task ':smack-android:uploadLocal'.
21-May-2019 01:04:57         at org.gradle.api.internal.tasks.execution.ExecuteActionsTaskExecuter$2.accept(ExecuteActionsTaskExecuter.java:121)
21-May-2019 01:04:57         at org.gradle.api.internal.tasks.execution.ExecuteActionsTaskExecuter$2.accept(ExecuteActionsTaskExecuter.java:117)
21-May-2019 01:04:57         at org.gradle.internal.Try$Failure.ifSuccessfulOrElse(Try.java:184)
21-May-2019 01:04:57         at org.gradle.api.internal.tasks.execution.ExecuteActionsTaskExecuter.execute(ExecuteActionsTaskExecuter.java:110)
21-May-2019 01:04:57         at org.gradle.api.internal.tasks.execution.ResolveIncrementalChangesTaskExecuter.execute(ResolveIncrementalChangesTaskExecuter.java:84)
21-May-2019 01:04:57         at org.gradle.api.internal.tasks.execution.ResolveTaskOutputCachingStateExecuter.execute(ResolveTaskOutputCachingStateExecuter.java:91)
21-May-2019 01:04:57         at org.gradle.api.internal.tasks.execution.ResolveBeforeExecutionStateTaskExecuter.execute(ResolveBeforeExecutionStateTaskExecuter.java:74)
21-May-2019 01:04:57         at org.gradle.api.internal.tasks.execution.ValidatingTaskExecuter.execute(ValidatingTaskExecuter.java:58)
21-May-2019 01:04:57         at org.gradle.api.internal.tasks.execution.SkipEmptySourceFilesTaskExecuter.execute(SkipEmptySourceFilesTaskExecuter.java:109)
21-May-2019 01:04:57         at org.gradle.api.internal.tasks.execution.ResolveBeforeExecutionOutputsTaskExecuter.execute(ResolveBeforeExecutionOutputsTaskExecuter.java:67)
21-May-2019 01:04:57         at org.gradle.api.internal.tasks.execution.ResolveAfterPreviousExecutionStateTaskExecuter.execute(ResolveAfterPreviousExecutionStateTaskExecuter.java:46)
21-May-2019 01:04:57         at org.gradle.api.internal.tasks.execution.CleanupStaleOutputsExecuter.execute(CleanupStaleOutputsExecuter.java:93)
21-May-2019 01:04:57         at org.gradle.api.internal.tasks.execution.FinalizePropertiesTaskExecuter.execute(FinalizePropertiesTaskExecuter.java:45)
21-May-2019 01:04:57         at org.gradle.api.internal.tasks.execution.ResolveTaskExecutionModeExecuter.execute(ResolveTaskExecutionModeExecuter.java:94)
21-May-2019 01:04:57         at org.gradle.api.internal.tasks.execution.SkipTaskWithNoActionsExecuter.execute(SkipTaskWithNoActionsExecuter.java:57)
21-May-2019 01:04:57         at org.gradle.api.internal.tasks.execution.SkipOnlyIfTaskExecuter.execute(SkipOnlyIfTaskExecuter.java:56)
21-May-2019 01:04:57         at org.gradle.api.internal.tasks.execution.CatchExceptionTaskExecuter.execute(CatchExceptionTaskExecuter.java:36)
21-May-2019 01:04:57         at org.gradle.api.internal.tasks.execution.EventFiringTaskExecuter$1.executeTask(EventFiringTaskExecuter.java:63)
21-May-2019 01:04:57         at org.gradle.api.internal.tasks.execution.EventFiringTaskExecuter$1.call(EventFiringTaskExecuter.java:49)
21-May-2019 01:04:57         at org.gradle.api.internal.tasks.execution.EventFiringTaskExecuter$1.call(EventFiringTaskExecuter.java:46)
21-May-2019 01:04:57         at org.gradle.internal.operations.DefaultBuildOperationExecutor$CallableBuildOperationWorker.execute(DefaultBuildOperationExecutor.java:416)
21-May-2019 01:04:57         at org.gradle.internal.operations.DefaultBuildOperationExecutor$CallableBuildOperationWorker.execute(DefaultBuildOperationExecutor.java:406)
21-May-2019 01:04:57         at org.gradle.internal.operations.DefaultBuildOperationExecutor$1.execute(DefaultBuildOperationExecutor.java:165)
21-May-2019 01:04:57         at org.gradle.internal.operations.DefaultBuildOperationExecutor.execute(DefaultBuildOperationExecutor.java:250)
21-May-2019 01:04:57         at org.gradle.internal.operations.DefaultBuildOperationExecutor.execute(DefaultBuildOperationExecutor.java:158)
21-May-2019 01:04:57         at org.gradle.internal.operations.DefaultBuildOperationExecutor.call(DefaultBuildOperationExecutor.java:102)
21-May-2019 01:04:57         at org.gradle.internal.operations.DelegatingBuildOperationExecutor.call(DelegatingBuildOperationExecutor.java:36)
21-May-2019 01:04:57         at org.gradle.api.internal.tasks.execution.EventFiringTaskExecuter.execute(EventFiringTaskExecuter.java:46)
21-May-2019 01:04:57         at org.gradle.execution.plan.LocalTaskNodeExecutor.execute(LocalTaskNodeExecutor.java:43)
21-May-2019 01:04:57         at org.gradle.execution.taskgraph.DefaultTaskExecutionGraph$InvokeNodeExecutorsAction.execute(DefaultTaskExecutionGraph.java:355)
21-May-2019 01:04:57         at org.gradle.execution.taskgraph.DefaultTaskExecutionGraph$InvokeNodeExecutorsAction.execute(DefaultTaskExecutionGraph.java:343)
21-May-2019 01:04:57         at org.gradle.execution.taskgraph.DefaultTaskExecutionGraph$BuildOperationAwareExecutionAction.execute(DefaultTaskExecutionGraph.java:336)
21-May-2019 01:04:57         at org.gradle.execution.taskgraph.DefaultTaskExecutionGraph$BuildOperationAwareExecutionAction.execute(DefaultTaskExecutionGraph.java:322)
21-May-2019 01:04:57         at org.gradle.execution.plan.DefaultPlanExecutor$ExecutorWorker$1.execute(DefaultPlanExecutor.java:134)
21-May-2019 01:04:57         at org.gradle.execution.plan.DefaultPlanExecutor$ExecutorWorker$1.execute(DefaultPlanExecutor.java:129)
21-May-2019 01:04:57         at org.gradle.execution.plan.DefaultPlanExecutor$ExecutorWorker.execute(DefaultPlanExecutor.java:202)
21-May-2019 01:04:57         at org.gradle.execution.plan.DefaultPlanExecutor$ExecutorWorker.executeNextNode(DefaultPlanExecutor.java:193)
21-May-2019 01:04:57         at org.gradle.execution.plan.DefaultPlanExecutor$ExecutorWorker.run(DefaultPlanExecutor.java:129)
21-May-2019 01:04:57         at org.gradle.execution.plan.DefaultPlanExecutor.process(DefaultPlanExecutor.java:74)
21-May-2019 01:04:57         at org.gradle.execution.taskgraph.DefaultTaskExecutionGraph.executeWithServices(DefaultTaskExecutionGraph.java:178)
21-May-2019 01:04:57         at org.gradle.execution.taskgraph.DefaultTaskExecutionGraph.execute(DefaultTaskExecutionGraph.java:154)
21-May-2019 01:04:57         at org.gradle.execution.SelectedTaskExecutionAction.execute(SelectedTaskExecutionAction.java:41)
21-May-2019 01:04:57         at org.gradle.execution.DefaultBuildExecuter.execute(DefaultBuildExecuter.java:40)
21-May-2019 01:04:57         at org.gradle.execution.DefaultBuildExecuter.access$000(DefaultBuildExecuter.java:24)
21-May-2019 01:04:57         at org.gradle.execution.DefaultBuildExecuter$1.proceed(DefaultBuildExecuter.java:46)
21-May-2019 01:04:57         at org.gradle.execution.DryRunBuildExecutionAction.execute(DryRunBuildExecutionAction.java:49)
21-May-2019 01:04:57         at org.gradle.execution.DefaultBuildExecuter.execute(DefaultBuildExecuter.java:40)
21-May-2019 01:04:57         at org.gradle.execution.DefaultBuildExecuter.execute(DefaultBuildExecuter.java:33)
21-May-2019 01:04:57         at org.gradle.initialization.DefaultGradleLauncher$ExecuteTasks.run(DefaultGradleLauncher.java:383)
21-May-2019 01:04:57         at org.gradle.internal.operations.DefaultBuildOperationExecutor$RunnableBuildOperationWorker.execute(DefaultBuildOperationExecutor.java:402)
21-May-2019 01:04:57         at org.gradle.internal.operations.DefaultBuildOperationExecutor$RunnableBuildOperationWorker.execute(DefaultBuildOperationExecutor.java:394)
21-May-2019 01:04:57         at org.gradle.internal.operations.DefaultBuildOperationExecutor$1.execute(DefaultBuildOperationExecutor.java:165)
21-May-2019 01:04:57         at org.gradle.internal.operations.DefaultBuildOperationExecutor.execute(DefaultBuildOperationExecutor.java:250)
21-May-2019 01:04:57         at org.gradle.internal.operations.DefaultBuildOperationExecutor.execute(DefaultBuildOperationExecutor.java:158)
21-May-2019 01:04:57         at org.gradle.internal.operations.DefaultBuildOperationExecutor.run(DefaultBuildOperationExecutor.java:92)
21-May-2019 01:04:57         at org.gradle.internal.operations.DelegatingBuildOperationExecutor.run(DelegatingBuildOperationExecutor.java:31)
21-May-2019 01:04:57         at org.gradle.initialization.DefaultGradleLauncher.runTasks(DefaultGradleLauncher.java:247)
21-May-2019 01:04:57         at org.gradle.initialization.DefaultGradleLauncher.doBuildStages(DefaultGradleLauncher.java:159)
21-May-2019 01:04:57         at org.gradle.initialization.DefaultGradleLauncher.executeTasks(DefaultGradleLauncher.java:134)
21-May-2019 01:04:57         at org.gradle.internal.invocation.GradleBuildController$1.execute(GradleBuildController.java:58)
21-May-2019 01:04:57         at org.gradle.internal.invocation.GradleBuildController$1.execute(GradleBuildController.java:55)
21-May-2019 01:04:57         at org.gradle.internal.invocation.GradleBuildController$3.create(GradleBuildController.java:82)
21-May-2019 01:04:57         at org.gradle.internal.invocation.GradleBuildController$3.create(GradleBuildController.java:75)
21-May-2019 01:04:57         at org.gradle.internal.work.DefaultWorkerLeaseService.withLocks(DefaultWorkerLeaseService.java:183)
21-May-2019 01:04:57         at org.gradle.internal.work.StopShieldingWorkerLeaseService.withLocks(StopShieldingWorkerLeaseService.java:40)
21-May-2019 01:04:57         at org.gradle.internal.invocation.GradleBuildController.doBuild(GradleBuildController.java:75)
21-May-2019 01:04:57         at org.gradle.internal.invocation.GradleBuildController.run(GradleBuildController.java:55)
21-May-2019 01:04:57         at org.gradle.tooling.internal.provider.ExecuteBuildActionRunner.run(ExecuteBuildActionRunner.java:31)
21-May-2019 01:04:57         at org.gradle.launcher.exec.ChainingBuildActionRunner.run(ChainingBuildActionRunner.java:35)
21-May-2019 01:04:57         at org.gradle.launcher.exec.BuildOutcomeReportingBuildActionRunner.run(BuildOutcomeReportingBuildActionRunner.java:58)
21-May-2019 01:04:57         at org.gradle.tooling.internal.provider.ValidatingBuildActionRunner.run(ValidatingBuildActionRunner.java:32)
21-May-2019 01:04:57         at org.gradle.launcher.exec.BuildCompletionNotifyingBuildActionRunner.run(BuildCompletionNotifyingBuildActionRunner.java:39)
21-May-2019 01:04:57         at org.gradle.launcher.exec.RunAsBuildOperationBuildActionRunner$3.call(RunAsBuildOperationBuildActionRunner.java:49)
21-May-2019 01:04:57         at org.gradle.launcher.exec.RunAsBuildOperationBuildActionRunner$3.call(RunAsBuildOperationBuildActionRunner.java:44)
21-May-2019 01:04:57         at org.gradle.internal.operations.DefaultBuildOperationExecutor$CallableBuildOperationWorker.execute(DefaultBuildOperationExecutor.java:416)
21-May-2019 01:04:57         at org.gradle.internal.operations.DefaultBuildOperationExecutor$CallableBuildOperationWorker.execute(DefaultBuildOperationExecutor.java:406)
21-May-2019 01:04:57         at org.gradle.internal.operations.DefaultBuildOperationExecutor$1.execute(DefaultBuildOperationExecutor.java:165)
21-May-2019 01:04:57         at org.gradle.internal.operations.DefaultBuildOperationExecutor.execute(DefaultBuildOperationExecutor.java:250)
21-May-2019 01:04:57         at org.gradle.internal.operations.DefaultBuildOperationExecutor.execute(DefaultBuildOperationExecutor.java:158)
21-May-2019 01:04:57         at org.gradle.internal.operations.DefaultBuildOperationExecutor.call(DefaultBuildOperationExecutor.java:102)
21-May-2019 01:04:57         at org.gradle.internal.operations.DelegatingBuildOperationExecutor.call(DelegatingBuildOperationExecutor.java:36)
21-May-2019 01:04:57         at org.gradle.launcher.exec.RunAsBuildOperationBuildActionRunner.run(RunAsBuildOperationBuildActionRunner.java:44)
21-May-2019 01:04:57         at org.gradle.launcher.exec.InProcessBuildActionExecuter$1.transform(InProcessBuildActionExecuter.java:49)
21-May-2019 01:04:57         at org.gradle.launcher.exec.InProcessBuildActionExecuter$1.transform(InProcessBuildActionExecuter.java:46)
21-May-2019 01:04:57         at org.gradle.composite.internal.DefaultRootBuildState.run(DefaultRootBuildState.java:78)
21-May-2019 01:04:57         at org.gradle.launcher.exec.InProcessBuildActionExecuter.execute(InProcessBuildActionExecuter.java:46)
21-May-2019 01:04:57         at org.gradle.launcher.exec.InProcessBuildActionExecuter.execute(InProcessBuildActionExecuter.java:31)
21-May-2019 01:04:57         at org.gradle.launcher.exec.BuildTreeScopeBuildActionExecuter.execute(BuildTreeScopeBuildActionExecuter.java:42)
21-May-2019 01:04:57         at org.gradle.launcher.exec.BuildTreeScopeBuildActionExecuter.execute(BuildTreeScopeBuildActionExecuter.java:28)
21-May-2019 01:04:57         at org.gradle.tooling.internal.provider.ContinuousBuildActionExecuter.execute(ContinuousBuildActionExecuter.java:78)
21-May-2019 01:04:57         at org.gradle.tooling.internal.provider.ContinuousBuildActionExecuter.execute(ContinuousBuildActionExecuter.java:52)
21-May-2019 01:04:57         at org.gradle.tooling.internal.provider.SubscribableBuildActionExecuter.execute(SubscribableBuildActionExecuter.java:59)
21-May-2019 01:04:57         at org.gradle.tooling.internal.provider.SubscribableBuildActionExecuter.execute(SubscribableBuildActionExecuter.java:36)
21-May-2019 01:04:57         at org.gradle.tooling.internal.provider.SessionScopeBuildActionExecuter.execute(SessionScopeBuildActionExecuter.java:68)
21-May-2019 01:04:57         at org.gradle.tooling.internal.provider.SessionScopeBuildActionExecuter.execute(SessionScopeBuildActionExecuter.java:38)
21-May-2019 01:04:57         at org.gradle.tooling.internal.provider.GradleThreadBuildActionExecuter.execute(GradleThreadBuildActionExecuter.java:37)
21-May-2019 01:04:57         at org.gradle.tooling.internal.provider.GradleThreadBuildActionExecuter.execute(GradleThreadBuildActionExecuter.java:26)
21-May-2019 01:04:57         at org.gradle.tooling.internal.provider.ParallelismConfigurationBuildActionExecuter.execute(ParallelismConfigurationBuildActionExecuter.java:43)
21-May-2019 01:04:57         at org.gradle.tooling.internal.provider.ParallelismConfigurationBuildActionExecuter.execute(ParallelismConfigurationBuildActionExecuter.java:29)
21-May-2019 01:04:57         at org.gradle.tooling.internal.provider.StartParamsValidatingActionExecuter.execute(StartParamsValidatingActionExecuter.java:60)
21-May-2019 01:04:57         at org.gradle.tooling.internal.provider.StartParamsValidatingActionExecuter.execute(StartParamsValidatingActionExecuter.java:32)
21-May-2019 01:04:57         at org.gradle.tooling.internal.provider.SessionFailureReportingActionExecuter.execute(SessionFailureReportingActionExecuter.java:55)
21-May-2019 01:04:57         at org.gradle.tooling.internal.provider.SessionFailureReportingActionExecuter.execute(SessionFailureReportingActionExecuter.java:41)
21-May-2019 01:04:57         at org.gradle.tooling.internal.provider.SetupLoggingActionExecuter.execute(SetupLoggingActionExecuter.java:48)
21-May-2019 01:04:57         at org.gradle.tooling.internal.provider.SetupLoggingActionExecuter.execute(SetupLoggingActionExecuter.java:32)
21-May-2019 01:04:57         at org.gradle.launcher.daemon.server.exec.ExecuteBuild.doBuild(ExecuteBuild.java:67)
21-May-2019 01:04:57         at org.gradle.launcher.daemon.server.exec.BuildCommandOnly.execute(BuildCommandOnly.java:36)
21-May-2019 01:04:57         at org.gradle.launcher.daemon.server.api.DaemonCommandExecution.proceed(DaemonCommandExecution.java:104)
21-May-2019 01:04:57         at org.gradle.launcher.daemon.server.exec.WatchForDisconnection.execute(WatchForDisconnection.java:37)
21-May-2019 01:04:57         at org.gradle.launcher.daemon.server.api.DaemonCommandExecution.proceed(DaemonCommandExecution.java:104)
21-May-2019 01:04:57         at org.gradle.launcher.daemon.server.exec.ResetDeprecationLogger.execute(ResetDeprecationLogger.java:26)
21-May-2019 01:04:57         at org.gradle.launcher.daemon.server.api.DaemonCommandExecution.proceed(DaemonCommandExecution.java:104)
21-May-2019 01:04:57         at org.gradle.launcher.daemon.server.exec.RequestStopIfSingleUsedDaemon.execute(RequestStopIfSingleUsedDaemon.java:34)
21-May-2019 01:04:57         at org.gradle.launcher.daemon.server.api.DaemonCommandExecution.proceed(DaemonCommandExecution.java:104)
21-May-2019 01:04:57         at org.gradle.launcher.daemon.server.exec.ForwardClientInput$2.call(ForwardClientInput.java:74)
21-May-2019 01:04:57         at org.gradle.launcher.daemon.server.exec.ForwardClientInput$2.call(ForwardClientInput.java:72)
21-May-2019 01:04:57         at org.gradle.util.Swapper.swap(Swapper.java:38)
21-May-2019 01:04:57         at org.gradle.launcher.daemon.server.exec.ForwardClientInput.execute(ForwardClientInput.java:72)
21-May-2019 01:04:57         at org.gradle.launcher.daemon.server.api.DaemonCommandExecution.proceed(DaemonCommandExecution.java:104)
21-May-2019 01:04:57         at org.gradle.launcher.daemon.server.exec.LogAndCheckHealth.execute(LogAndCheckHealth.java:55)
21-May-2019 01:04:57         at org.gradle.launcher.daemon.server.api.DaemonCommandExecution.proceed(DaemonCommandExecution.java:104)
21-May-2019 01:04:57         at org.gradle.launcher.daemon.server.exec.LogToClient.doBuild(LogToClient.java:62)
21-May-2019 01:04:57         at org.gradle.launcher.daemon.server.exec.BuildCommandOnly.execute(BuildCommandOnly.java:36)
21-May-2019 01:04:57         at org.gradle.launcher.daemon.server.api.DaemonCommandExecution.proceed(DaemonCommandExecution.java:104)
21-May-2019 01:04:57         at org.gradle.launcher.daemon.server.exec.EstablishBuildEnvironment.doBuild(EstablishBuildEnvironment.java:81)
21-May-2019 01:04:57         at org.gradle.launcher.daemon.server.exec.BuildCommandOnly.execute(BuildCommandOnly.java:36)
21-May-2019 01:04:57         at org.gradle.launcher.daemon.server.api.DaemonCommandExecution.proceed(DaemonCommandExecution.java:104)
21-May-2019 01:04:57         at org.gradle.launcher.daemon.server.exec.StartBuildOrRespondWithBusy$1.run(StartBuildOrRespondWithBusy.java:50)
21-May-2019 01:04:57         at org.gradle.launcher.daemon.server.DaemonStateCoordinator$1.run(DaemonStateCoordinator.java:295)
21-May-2019 01:04:57         at org.gradle.internal.concurrent.ExecutorPolicy$CatchAndRecordFailures.onExecute(ExecutorPolicy.java:63)
21-May-2019 01:04:57         at org.gradle.internal.concurrent.ManagedExecutorImpl$1.run(ManagedExecutorImpl.java:46)
21-May-2019 01:04:57         at org.gradle.internal.concurrent.ThreadFactoryImpl$ManagedThreadRunnable.run(ThreadFactoryImpl.java:55)
21-May-2019 01:04:57 Caused by: org.gradle.api.artifacts.PublishException: Could not publish configuration 'archives'
21-May-2019 01:04:57         at org.gradle.api.tasks.Upload.upload(Upload.java:68)
21-May-2019 01:04:57         at org.gradle.internal.reflect.JavaMethod.invoke(JavaMethod.java:103)
21-May-2019 01:04:57         at org.gradle.api.internal.project.taskfactory.StandardTaskAction.doExecute(StandardTaskAction.java:48)
21-May-2019 01:04:57         at org.gradle.api.internal.project.taskfactory.StandardTaskAction.execute(StandardTaskAction.java:41)
21-May-2019 01:04:57         at org.gradle.api.internal.project.taskfactory.StandardTaskAction.execute(StandardTaskAction.java:28)
21-May-2019 01:04:57         at org.gradle.api.internal.AbstractTask$TaskActionWrapper.execute(AbstractTask.java:705)
21-May-2019 01:04:57         at org.gradle.api.internal.AbstractTask$TaskActionWrapper.execute(AbstractTask.java:672)
21-May-2019 01:04:57         at org.gradle.api.internal.tasks.execution.ExecuteActionsTaskExecuter$4.run(ExecuteActionsTaskExecuter.java:338)
21-May-2019 01:04:57         at org.gradle.internal.operations.DefaultBuildOperationExecutor$RunnableBuildOperationWorker.execute(DefaultBuildOperationExecutor.java:402)
21-May-2019 01:04:57         at org.gradle.internal.operations.DefaultBuildOperationExecutor$RunnableBuildOperationWorker.execute(DefaultBuildOperationExecutor.java:394)
21-May-2019 01:04:57         at org.gradle.internal.operations.DefaultBuildOperationExecutor$1.execute(DefaultBuildOperationExecutor.java:165)
21-May-2019 01:04:57         at org.gradle.internal.operations.DefaultBuildOperationExecutor.execute(DefaultBuildOperationExecutor.java:250)
21-May-2019 01:04:57         at org.gradle.internal.operations.DefaultBuildOperationExecutor.execute(DefaultBuildOperationExecutor.java:158)
21-May-2019 01:04:57         at org.gradle.internal.operations.DefaultBuildOperationExecutor.run(DefaultBuildOperationExecutor.java:92)
21-May-2019 01:04:57         at org.gradle.internal.operations.DelegatingBuildOperationExecutor.run(DelegatingBuildOperationExecutor.java:31)
21-May-2019 01:04:57         at org.gradle.api.internal.tasks.execution.ExecuteActionsTaskExecuter.executeAction(ExecuteActionsTaskExecuter.java:327)
21-May-2019 01:04:57         at org.gradle.api.internal.tasks.execution.ExecuteActionsTaskExecuter.executeActions(ExecuteActionsTaskExecuter.java:312)
21-May-2019 01:04:57         at org.gradle.api.internal.tasks.execution.ExecuteActionsTaskExecuter.access$200(ExecuteActionsTaskExecuter.java:75)
21-May-2019 01:04:57         at org.gradle.api.internal.tasks.execution.ExecuteActionsTaskExecuter$TaskExecution.execute(ExecuteActionsTaskExecuter.java:158)
21-May-2019 01:04:57         at org.gradle.internal.execution.impl.steps.ExecuteStep.execute(ExecuteStep.java:46)
21-May-2019 01:04:57         at org.gradle.internal.execution.impl.steps.CancelExecutionStep.execute(CancelExecutionStep.java:34)
21-May-2019 01:04:57         at org.gradle.internal.execution.impl.steps.TimeoutStep.executeWithoutTimeout(TimeoutStep.java:69)
21-May-2019 01:04:57         at org.gradle.internal.execution.impl.steps.TimeoutStep.execute(TimeoutStep.java:49)
21-May-2019 01:04:57         at org.gradle.internal.execution.impl.steps.CatchExceptionStep.execute(CatchExceptionStep.java:34)
21-May-2019 01:04:57         at org.gradle.internal.execution.impl.steps.CreateOutputsStep.execute(CreateOutputsStep.java:49)
21-May-2019 01:04:57         at org.gradle.internal.execution.impl.steps.SnapshotOutputStep.execute(SnapshotOutputStep.java:42)
21-May-2019 01:04:57         at org.gradle.internal.execution.impl.steps.SnapshotOutputStep.execute(SnapshotOutputStep.java:28)
21-May-2019 01:04:57         at org.gradle.internal.execution.impl.steps.CacheStep.executeWithoutCache(CacheStep.java:133)
21-May-2019 01:04:57         at org.gradle.internal.execution.impl.steps.CacheStep.lambda$execute$5(CacheStep.java:83)
21-May-2019 01:04:57         at org.gradle.internal.execution.impl.steps.CacheStep.execute(CacheStep.java:82)
21-May-2019 01:04:57         at org.gradle.internal.execution.impl.steps.CacheStep.execute(CacheStep.java:37)
21-May-2019 01:04:57         at org.gradle.internal.execution.impl.steps.PrepareCachingStep.execute(PrepareCachingStep.java:33)
21-May-2019 01:04:57         at org.gradle.internal.execution.impl.steps.StoreSnapshotsStep.execute(StoreSnapshotsStep.java:38)
21-May-2019 01:04:57         at org.gradle.internal.execution.impl.steps.StoreSnapshotsStep.execute(StoreSnapshotsStep.java:23)
21-May-2019 01:04:57         at org.gradle.internal.execution.impl.steps.SkipUpToDateStep.executeBecause(SkipUpToDateStep.java:95)
21-May-2019 01:04:57         at org.gradle.internal.execution.impl.steps.SkipUpToDateStep.lambda$execute$0(SkipUpToDateStep.java:88)
21-May-2019 01:04:57         at org.gradle.internal.execution.impl.steps.SkipUpToDateStep.execute(SkipUpToDateStep.java:52)
21-May-2019 01:04:57         at org.gradle.internal.execution.impl.steps.SkipUpToDateStep.execute(SkipUpToDateStep.java:36)
21-May-2019 01:04:57         at org.gradle.internal.execution.impl.DefaultWorkExecutor.execute(DefaultWorkExecutor.java:34)
21-May-2019 01:04:57         at org.gradle.api.internal.tasks.execution.ExecuteActionsTaskExecuter.execute(ExecuteActionsTaskExecuter.java:109)
21-May-2019 01:04:57         ... 128 more
21-May-2019 01:04:57 Caused by: org.gradle.api.UncheckedIOException: Could not write to file '/var/atlassian/bamboo-home/xml-data/build-dir/SMACK-NIGHTLY-JOB1/smack-android/build/poms/pom-default.xml'.
21-May-2019 01:04:57         at org.gradle.internal.IoActions$TextFileWriterIoAction.execute(IoActions.java:151)
21-May-2019 01:04:57         at org.gradle.internal.IoActions$TextFileWriterIoAction.execute(IoActions.java:127)
21-May-2019 01:04:57         at org.gradle.internal.IoActions.writeTextFile(IoActions.java:45)
21-May-2019 01:04:57         at org.gradle.api.publication.maven.internal.pom.DefaultMavenPom.writeTo(DefaultMavenPom.java:201)
21-May-2019 01:04:57         at org.gradle.api.publication.maven.internal.pom.DefaultMavenPom.writeTo(DefaultMavenPom.java:44)
21-May-2019 01:04:57         at org.gradle.api.publication.maven.internal.DefaultArtifactPom.writePom(DefaultArtifactPom.java:56)
21-May-2019 01:04:57         at org.gradle.api.publication.maven.internal.DefaultArtifactPomContainer.createDeployableFilesInfos(DefaultArtifactPomContainer.java:68)
21-May-2019 01:04:57         at org.gradle.api.publication.maven.internal.deployer.AbstractMavenResolver.publish(AbstractMavenResolver.java:121)
21-May-2019 01:04:57         at org.gradle.api.publication.maven.internal.deployer.AbstractMavenResolver.publish(AbstractMavenResolver.java:106)
21-May-2019 01:04:57         at org.gradle.api.publication.maven.internal.deployer.BaseMavenDeployer.publish(BaseMavenDeployer.java:36)
21-May-2019 01:04:57         at org.gradle.internal.component.external.ivypublish.DefaultArtifactPublisher.publish(DefaultArtifactPublisher.java:76)
21-May-2019 01:04:57         at org.gradle.api.internal.artifacts.ivyservice.IvyContextualArtifactPublisher$1.execute(IvyContextualArtifactPublisher.java:43)
21-May-2019 01:04:57         at org.gradle.api.internal.artifacts.ivyservice.IvyContextualArtifactPublisher$1.execute(IvyContextualArtifactPublisher.java:40)
21-May-2019 01:04:57         at org.gradle.internal.Transformers$4.transform(Transformers.java:133)
21-May-2019 01:04:57         at org.gradle.api.internal.artifacts.ivyservice.DefaultIvyContextManager.withIvy(DefaultIvyContextManager.java:63)
21-May-2019 01:04:57         at org.gradle.api.internal.artifacts.ivyservice.DefaultIvyContextManager.withIvy(DefaultIvyContextManager.java:41)
21-May-2019 01:04:57         at org.gradle.api.internal.artifacts.ivyservice.IvyContextualArtifactPublisher.publish(IvyContextualArtifactPublisher.java:40)
21-May-2019 01:04:57         at org.gradle.api.tasks.Upload.upload(Upload.java:66)
21-May-2019 01:04:57         ... 167 more
21-May-2019 01:04:57 Caused by: org.gradle.api.InvalidUserDataException: The configuration to scope mapping is not unique. The following configurations have the same priority: [org.gradle.api.artifacts.maven.Conf2ScopeMapping@7832de1a, org.gradle.api.artifacts.maven.Conf2ScopeMapping@5da8cc76]
21-May-2019 01:04:57         at org.gradle.api.publication.maven.internal.pom.DefaultConf2ScopeMappingContainer.getMapping(DefaultConf2ScopeMappingContainer.java:41)
21-May-2019 01:04:57         at org.gradle.api.publication.maven.internal.pom.DefaultPomDependenciesConverter.createDependencyToScopeMap(DefaultPomDependenciesConverter.java:68)
21-May-2019 01:04:57         at org.gradle.api.publication.maven.internal.pom.DefaultPomDependenciesConverter.convert(DefaultPomDependenciesConverter.java:48)
21-May-2019 01:04:57         at org.gradle.api.publication.maven.internal.pom.DefaultMavenPom.getGeneratedDependencies(DefaultMavenPom.java:170)
21-May-2019 01:04:57         at org.gradle.api.publication.maven.internal.pom.DefaultMavenPom.getEffectivePom(DefaultMavenPom.java:176)
21-May-2019 01:04:57         at org.gradle.api.publication.maven.internal.pom.DefaultMavenPom.writeTo(DefaultMavenPom.java:193)
21-May-2019 01:04:57         at org.gradle.api.publication.maven.internal.pom.DefaultMavenPom$2.execute(DefaultMavenPom.java:203)
21-May-2019 01:04:57         at org.gradle.api.publication.maven.internal.pom.DefaultMavenPom$2.execute(DefaultMavenPom.java:201)
21-May-2019 01:04:57         at org.gradle.internal.IoActions$TextFileWriterIoAction.execute(IoActions.java:146)
21-May-2019 01:04:57         ... 184 more
21-May-2019 01:04:57
21-May-2019 01:04:57
21-May-2019 01:04:57 * Get more help at https://help.gradle.org
21-May-2019 01:04:57
21-May-2019 01:04:57 BUILD FAILED in 3s
21-May-2019 01:04:57 17 actionable tasks: 1 executed, 16 up-to-date
21-May-2019 01:04:58 Failing task since return code of [/opt/gradle/bin/gradle --stacktrace uploadLocal -Dmaven.repo.local=/mnt/maven] was 1 while expected 0
21-May-2019 01:04:58 Finished task 'Install artifacts in system-local Ignite Maven Repo' with result: Failed
21-May-2019 01:04:58 Running post build plugin 'NCover Results Collector'
21-May-2019 01:04:58 Running post build plugin 'Artifact Copier'
21-May-2019 01:04:58 Publishing an artifact: Project binary files
21-May-2019 01:04:58 Finished publishing of artifact Non required shared artifact: [Project binary files], pattern: [*.zip] anchored at: [build/distributions/] in 52.63 ms
21-May-2019 01:04:58 Running post build plugin 'npm Cache Cleanup'
21-May-2019 01:04:58 Running post build plugin 'Clover Results Collector'
21-May-2019 01:04:58 Running post build plugin 'Docker Container Cleanup'
21-May-2019 01:04:58 Finalising the build...
21-May-2019 01:04:58 Stopping timer.
21-May-2019 01:04:58 Build SMACK-NIGHTLY-JOB1-1662 completed.
21-May-2019 01:04:58 Running on server: post build plugin 'NCover Results Collector'
21-May-2019 01:04:58 Running on server: post build plugin 'Build Hanging Detection Configuration'
21-May-2019 01:04:58 Running on server: post build plugin 'Clover Delta Calculator'
21-May-2019 01:04:58 Running on server: post build plugin 'Maven Dependencies Postprocessor'
21-May-2019 01:04:58 All post build plugins have finished
21-May-2019 01:04:58 Generating build results summary...
21-May-2019 01:04:58 Saving build results to disk...
21-May-2019 01:04:58 Logging substituted variables...
21-May-2019 01:04:58 Indexing build results...
21-May-2019 01:04:58 Finished building SMACK-NIGHTLY-JOB1-1662.