Build: #149 failed Manual run by Florian Schmaus

Stages & jobs

  1. Default Stage

  2. Deploy

Build result summary

Details

Completed
Duration
8 minutes
Labels
None
Revision
78dcaec75bbd26f795e37776d3d8b8748a03226f 78dcaec75bbd26f795e37776d3d8b8748a03226f
Total tests
582
Failing since
#148 (Changes by Florian Schmaus)
Fixed in
#150 (Rebuilt by Florian Schmaus)

No failed tests found, a possible compilation error occurred.

Responsible

Shared artifacts

Artifact File size
Project binary files 544 MB

Error summary for Default Job

The job generated some errors, drill down into the full build log for more details.

       ^
/var/atlassian/bamboo-home/xml-data/build-dir/SMACK-NIGHTLYSTABLE-JOB1/smack-core/src/main/java/org/jivesoftware/smack/util/PacketParserUtils.java:217: warning: no description for @throws
     * @throws Exception
       ^
/var/atlassian/bamboo-home/xml-data/build-dir/SMACK-NIGHTLYSTABLE-JOB1/smack-core/src/main/java/org/jivesoftware/smack/util/PacketParserUtils.java:295: warning: no description for @param
     * @param parser
       ^
/var/atlassian/bamboo-home/xml-data/build-dir/SMACK-NIGHTLYSTABLE-JOB1/smack-core/src/main/java/org/jivesoftware/smack/util/PacketParserUtils.java:297: warning: no description for @throws
     * @throws XmlPullParserException
       ^
/var/atlassian/bamboo-home/xml-data/build-dir/SMACK-NIGHTLYSTABLE-JOB1/smack-core/src/main/java/org/jivesoftware/smack/util/PacketParserUtils.java:298: warning: no description for @throws
     * @throws IOException
       ^
/var/atlassian/bamboo-home/xml-data/build-dir/SMACK-NIGHTLYSTABLE-JOB1/smack-core/src/main/java/org/jivesoftware/smack/util/PacketParserUtils.java:341: warning: no description for @throws
     * @throws XmlPullParserException
       ^
/var/atlassian/bamboo-home/xml-data/build-dir/SMACK-NIGHTLYSTABLE-JOB1/smack-core/src/main/java/org/jivesoftware/smack/util/PacketParserUtils.java:342: warning: no description for @throws
     * @throws IOException
       ^
/var/atlassian/bamboo-home/xml-data/build-dir/SMACK-NIGHTLYSTABLE-JOB1/smack-core/src/main/java/org/jivesoftware/smack/util/PacketParserUtils.java:403: warning: no description for @param
     * @param parser
       ^
/var/atlassian/bamboo-home/xml-data/build-dir/SMACK-NIGHTLYSTABLE-JOB1/smack-core/src/main/java/org/jivesoftware/smack/util/PacketParserUtils.java:404: warning: no description for @param
     * @param depth
       ^
/var/atlassian/bamboo-home/xml-data/build-dir/SMACK-NIGHTLYSTABLE-JOB1/smack-core/src/main/java/org/jivesoftware/smack/util/PacketParserUtils.java:405: warning: no description for @param
     * @param fullNamespaces
       ^
/var/atlassian/bamboo-home/xml-data/build-dir/SMACK-NIGHTLYSTABLE-JOB1/smack-core/src/main/java/org/jivesoftware/smack/util/PacketParserUtils.java:407: warning: no description for @throws
     * @throws XmlPullParserException
       ^
/var/atlassian/bamboo-home/xml-data/build-dir/SMACK-NIGHTLYSTABLE-JOB1/smack-core/src/main/java/org/jivesoftware/smack/util/PacketParserUtils.java:408: warning: no description for @throws
     * @throws IOException
       ^
/var/atlassian/bamboo-home/xml-data/build-dir/SMACK-NIGHTLYSTABLE-JOB1/smack-core/src/main/java/org/jivesoftware/smack/util/PacketParserUtils.java:502: warning: no description for @throws
     * @throws Exception
       ^
/var/atlassian/bamboo-home/xml-data/build-dir/SMACK-NIGHTLYSTABLE-JOB1/smack-core/src/main/java/org/jivesoftware/smack/util/PacketParserUtils.java:587: warning: no description for @throws
     * @throws Exception
       ^
/var/atlassian/bamboo-home/xml-data/build-dir/SMACK-NIGHTLYSTABLE-JOB1/smack-core/src/main/java/org/jivesoftware/smack/util/PacketParserUtils.java:665: warning: no description for @throws
     * @throws IOException
       ^
/var/atlassian/bamboo-home/xml-data/build-dir/SMACK-NIGHTLYSTABLE-JOB1/smack-core/src/main/java/org/jivesoftware/smack/util/PacketParserUtils.java:666: warning: no description for @throws
     * @throws XmlPullParserException
       ^
/var/atlassian/bamboo-home/xml-data/build-dir/SMACK-NIGHTLYSTABLE-JOB1/smack-core/src/main/java/org/jivesoftware/smack/util/PacketParserUtils.java:695: warning: no description for @throws
     * @throws IOException
       ^
/var/atlassian/bamboo-home/xml-data/build-dir/SMACK-NIGHTLYSTABLE-JOB1/smack-core/src/main/java/org/jivesoftware/smack/util/PacketParserUtils.java:753: warning: no description for @throws
     * @throws IOException
       ^
/var/atlassian/bamboo-home/xml-data/build-dir/SMACK-NIGHTLYSTABLE-JOB1/smack-core/src/main/java/org/jivesoftware/smack/util/PacketParserUtils.java:754: warning: no description for @throws
     * @throws XmlPullParserException
       ^
/var/atlassian/bamboo-home/xml-data/build-dir/SMACK-NIGHTLYSTABLE-JOB1/smack-core/src/main/java/org/jivesoftware/smack/util/PacketParserUtils.java:838: warning: no description for @throws
     * @throws Exception
       ^
/var/atlassian/bamboo-home/xml-data/build-dir/SMACK-NIGHTLYSTABLE-JOB1/smack-core/src/main/java/org/jivesoftware/smack/util/PacketUtil.java:27: warning: no description for @param
     * @param collection
       ^
/var/atlassian/bamboo-home/xml-data/build-dir/SMACK-NIGHTLYSTABLE-JOB1/smack-core/src/main/java/org/jivesoftware/smack/util/PacketUtil.java:28: warning: no description for @param
     * @param element
       ^
/var/atlassian/bamboo-home/xml-data/build-dir/SMACK-NIGHTLYSTABLE-JOB1/smack-core/src/main/java/org/jivesoftware/smack/util/PacketUtil.java:29: warning: no description for @param
     * @param namespace
       ^
/var/atlassian/bamboo-home/xml-data/build-dir/SMACK-NIGHTLYSTABLE-JOB1/smack-core/src/main/java/org/jivesoftware/smack/util/PacketUtil.java:30: warning: no description for @param
     * @param <PE>
       ^
/var/atlassian/bamboo-home/xml-data/build-dir/SMACK-NIGHTLYSTABLE-JOB1/smack-core/src/main/java/org/jivesoftware/smack/util/ParserUtils.java:156: warning: no description for @param
     * @param parser
       ^
/var/atlassian/bamboo-home/xml-data/build-dir/SMACK-NIGHTLYSTABLE-JOB1/smack-core/src/main/java/org/jivesoftware/smack/util/ParserUtils.java:157: warning: no description for @param
     * @param name
       ^
/var/atlassian/bamboo-home/xml-data/build-dir/SMACK-NIGHTLYSTABLE-JOB1/smack-core/src/main/java/org/jivesoftware/smack/util/StringUtils.java:346: warning: no description for @param
     * @param cs
       ^
/var/atlassian/bamboo-home/xml-data/build-dir/SMACK-NIGHTLYSTABLE-JOB1/smack-core/src/main/java/org/jivesoftware/smack/util/StringUtils.java:386: warning: no description for @param
     * @param cs
       ^
/var/atlassian/bamboo-home/xml-data/build-dir/SMACK-NIGHTLYSTABLE-JOB1/smack-core/src/main/java/org/jivesoftware/smack/util/TLSUtils.java:102: warning: no description for @throws
     * @throws NoSuchAlgorithmException
       ^
/var/atlassian/bamboo-home/xml-data/build-dir/SMACK-NIGHTLYSTABLE-JOB1/smack-core/src/main/java/org/jivesoftware/smack/util/TLSUtils.java:103: warning: no description for @throws
     * @throws KeyManagementException
       ^
/var/atlassian/bamboo-home/xml-data/build-dir/SMACK-NIGHTLYSTABLE-JOB1/smack-core/src/main/java/org/jivesoftware/smack/util/TLSUtils.java:187: warning: no description for @throws
     * @throws SSLPeerUnverifiedException
       ^
/var/atlassian/bamboo-home/xml-data/build-dir/SMACK-NIGHTLYSTABLE-JOB1/smack-core/src/main/java/org/jivesoftware/smack/util/TLSUtils.java:188: warning: no description for @throws
     * @throws CertificateEncodingException
       ^
/var/atlassian/bamboo-home/xml-data/build-dir/SMACK-NIGHTLYSTABLE-JOB1/smack-core/src/main/java/org/jivesoftware/smack/util/TLSUtils.java:189: warning: no description for @throws
     * @throws NoSuchAlgorithmException
       ^
/var/atlassian/bamboo-home/xml-data/build-dir/SMACK-NIGHTLYSTABLE-JOB1/smack-core/src/main/java/org/jivesoftware/smack/util/XmlStringBuilder.java:73: warning: no description for @param
     * @param name
       ^
import static org.junit.Assert.assertEquals;
^
/var/atlassian/bamboo-home/xml-data/build-dir/SMACK-NIGHTLYSTABLE-JOB1/smack-integration-test/src/main/java/org/jivesoftware/smackx/caps/EntityCapsTest.java:20: error: package org.junit does not exist
import static org.junit.Assert.assertFalse;
                       ^
/var/atlassian/bamboo-home/xml-data/build-dir/SMACK-NIGHTLYSTABLE-JOB1/smack-integration-test/src/main/java/org/jivesoftware/smackx/caps/EntityCapsTest.java:20: error: static import only from classes and interfaces
import static org.junit.Assert.assertFalse;
^
/var/atlassian/bamboo-home/xml-data/build-dir/SMACK-NIGHTLYSTABLE-JOB1/smack-integration-test/src/main/java/org/jivesoftware/smackx/caps/EntityCapsTest.java:21: error: package org.junit does not exist
import static org.junit.Assert.assertNotNull;
                       ^
/var/atlassian/bamboo-home/xml-data/build-dir/SMACK-NIGHTLYSTABLE-JOB1/smack-integration-test/src/main/java/org/jivesoftware/smackx/caps/EntityCapsTest.java:21: error: static import only from classes and interfaces
import static org.junit.Assert.assertNotNull;
^
/var/atlassian/bamboo-home/xml-data/build-dir/SMACK-NIGHTLYSTABLE-JOB1/smack-integration-test/src/main/java/org/jivesoftware/smackx/caps/EntityCapsTest.java:22: error: package org.junit does not exist
import static org.junit.Assert.assertTrue;
                       ^
/var/atlassian/bamboo-home/xml-data/build-dir/SMACK-NIGHTLYSTABLE-JOB1/smack-integration-test/src/main/java/org/jivesoftware/smackx/caps/EntityCapsTest.java:22: error: static import only from classes and interfaces
import static org.junit.Assert.assertTrue;
^
/var/atlassian/bamboo-home/xml-data/build-dir/SMACK-NIGHTLYSTABLE-JOB1/smack-integration-test/src/main/java/org/jivesoftware/smackx/caps/EntityCapsTest.java:51: error: package org.junit does not exist
import org.junit.AfterClass;
                ^
/var/atlassian/bamboo-home/xml-data/build-dir/SMACK-NIGHTLYSTABLE-JOB1/smack-integration-test/src/main/java/org/jivesoftware/smackx/caps/EntityCapsTest.java:52: error: package org.junit does not exist
import org.junit.BeforeClass;
                ^
/var/atlassian/bamboo-home/xml-data/build-dir/SMACK-NIGHTLYSTABLE-JOB1/smack-integration-test/src/main/java/org/jivesoftware/smackx/iqversion/VersionIntegrationTest.java:19: error: package org.junit does not exist
import static org.junit.Assert.assertEquals;
                       ^
/var/atlassian/bamboo-home/xml-data/build-dir/SMACK-NIGHTLYSTABLE-JOB1/smack-integration-test/src/main/java/org/jivesoftware/smackx/iqversion/VersionIntegrationTest.java:19: error: static import only from classes and interfaces
import static org.junit.Assert.assertEquals;
^
/var/atlassian/bamboo-home/xml-data/build-dir/SMACK-NIGHTLYSTABLE-JOB1/smack-integration-test/src/main/java/org/jivesoftware/smackx/iqversion/VersionIntegrationTest.java:20: error: package org.junit does not exist
import static org.junit.Assert.assertTrue;
                       ^
/var/atlassian/bamboo-home/xml-data/build-dir/SMACK-NIGHTLYSTABLE-JOB1/smack-integration-test/src/main/java/org/jivesoftware/smackx/iqversion/VersionIntegrationTest.java:20: error: static import only from classes and interfaces
import static org.junit.Assert.assertTrue;
^
/var/atlassian/bamboo-home/xml-data/build-dir/SMACK-NIGHTLYSTABLE-JOB1/smack-integration-test/src/main/java/org/jivesoftware/smack/StreamManagementTest.java:19: error: package org.junit does not exist
import static org.junit.Assert.assertEquals;
                       ^
/var/atlassian/bamboo-home/xml-data/build-dir/SMACK-NIGHTLYSTABLE-JOB1/smack-integration-test/src/main/java/org/jivesoftware/smack/StreamManagementTest.java:19: error: static import only from classes and interfaces
import static org.junit.Assert.assertEquals;
^
/var/atlassian/bamboo-home/xml-data/build-dir/SMACK-NIGHTLYSTABLE-JOB1/smack-integration-test/src/main/java/org/jivesoftware/smack/StreamManagementTest.java:20: error: package org.junit does not exist
import static org.junit.Assert.assertNotNull;
                       ^
/var/atlassian/bamboo-home/xml-data/build-dir/SMACK-NIGHTLYSTABLE-JOB1/smack-integration-test/src/main/java/org/jivesoftware/smack/StreamManagementTest.java:20: error: static import only from classes and interfaces
import static org.junit.Assert.assertNotNull;
^
/var/atlassian/bamboo-home/xml-data/build-dir/SMACK-NIGHTLYSTABLE-JOB1/smack-integration-test/src/main/java/org/jivesoftware/smack/LoginIntegrationTest.java:19: error: package org.junit does not exist
import static org.junit.Assert.assertEquals;
                       ^
/var/atlassian/bamboo-home/xml-data/build-dir/SMACK-NIGHTLYSTABLE-JOB1/smack-integration-test/src/main/java/org/jivesoftware/smack/LoginIntegrationTest.java:19: error: static import only from classes and interfaces
import static org.junit.Assert.assertEquals;
^
/var/atlassian/bamboo-home/xml-data/build-dir/SMACK-NIGHTLYSTABLE-JOB1/smack-integration-test/src/main/java/org/jivesoftware/smack/LoginIntegrationTest.java:20: error: package org.junit does not exist
import static org.junit.Assert.fail;
                       ^
/var/atlassian/bamboo-home/xml-data/build-dir/SMACK-NIGHTLYSTABLE-JOB1/smack-integration-test/src/main/java/org/jivesoftware/smack/LoginIntegrationTest.java:20: error: static import only from classes and interfaces
import static org.junit.Assert.fail;
^
/var/atlassian/bamboo-home/xml-data/build-dir/SMACK-NIGHTLYSTABLE-JOB1/smack-integration-test/src/main/java/org/jivesoftware/smack/ChatTest.java:22: error: package org.junit does not exist
import static org.junit.Assert.assertEquals;
                       ^
/var/atlassian/bamboo-home/xml-data/build-dir/SMACK-NIGHTLYSTABLE-JOB1/smack-integration-test/src/main/java/org/jivesoftware/smack/ChatTest.java:22: error: static import only from classes and interfaces
import static org.junit.Assert.assertEquals;
^
/var/atlassian/bamboo-home/xml-data/build-dir/SMACK-NIGHTLYSTABLE-JOB1/smack-integration-test/src/main/java/org/jivesoftware/smack/ChatTest.java:23: error: package org.junit does not exist
import static org.junit.Assert.assertNotNull;
                       ^
/var/atlassian/bamboo-home/xml-data/build-dir/SMACK-NIGHTLYSTABLE-JOB1/smack-integration-test/src/main/java/org/jivesoftware/smack/ChatTest.java:23: error: static import only from classes and interfaces
import static org.junit.Assert.assertNotNull;
^
/var/atlassian/bamboo-home/xml-data/build-dir/SMACK-NIGHTLYSTABLE-JOB1/smack-integration-test/src/main/java/org/jivesoftware/smack/ChatTest.java:24: error: package org.junit does not exist
import static org.junit.Assert.assertTrue;
                       ^
/var/atlassian/bamboo-home/xml-data/build-dir/SMACK-NIGHTLYSTABLE-JOB1/smack-integration-test/src/main/java/org/jivesoftware/smack/ChatTest.java:24: error: static import only from classes and interfaces
import static org.junit.Assert.assertTrue;
^
/var/atlassian/bamboo-home/xml-data/build-dir/SMACK-NIGHTLYSTABLE-JOB1/smack-integration-test/src/main/java/org/jivesoftware/smack/ChatTest.java:36: error: package org.junit does not exist
import org.junit.AfterClass;
                ^
/var/atlassian/bamboo-home/xml-data/build-dir/SMACK-NIGHTLYSTABLE-JOB1/smack-integration-test/src/main/java/org/jivesoftware/smack/ChatTest.java:37: error: package org.junit does not exist
import org.junit.BeforeClass;
                ^
100 errors

FAILURE: Build failed with an exception.

* What went wrong:
Execution failed for task ':smack-integration-test:compileJava'.
> Compilation failed with exit code 1; see the compiler error output for details.

* Try:
Run with --stacktrace option to get the stack trace. Run with --info or --debug option to get more log output. Run with --scan to get full insights.

* Get more help at https://help.gradle.org

BUILD FAILED in 1m 33s