Build: #148 failed

Job: Default Job failed

Stages & jobs

  1. Default Stage

  2. Deploy

Build log

The build generated 1,718 lines of output.The output is too long and has been truncated to the last 1,000 lines. Download or view full build log

10-Feb-2019 01:06:00        ^
10-Feb-2019 01:06:00 /var/atlassian/bamboo-home/xml-data/build-dir/SMACK-NIGHTLYSTABLE-JOB1/smack-experimental/src/main/java/org/jivesoftware/smackx/mam/MamManager.java:478: warning: no description for @param
10-Feb-2019 01:06:00      * @param withJid
10-Feb-2019 01:06:00        ^
10-Feb-2019 01:06:00 /var/atlassian/bamboo-home/xml-data/build-dir/SMACK-NIGHTLYSTABLE-JOB1/smack-experimental/src/main/java/org/jivesoftware/smackx/mam/MamManager.java:480: warning: no description for @throws
10-Feb-2019 01:06:00      * @throws NoResponseException
10-Feb-2019 01:06:00        ^
10-Feb-2019 01:06:00 /var/atlassian/bamboo-home/xml-data/build-dir/SMACK-NIGHTLYSTABLE-JOB1/smack-experimental/src/main/java/org/jivesoftware/smackx/mam/MamManager.java:481: warning: no description for @throws
10-Feb-2019 01:06:00      * @throws XMPPErrorException
10-Feb-2019 01:06:00        ^
10-Feb-2019 01:06:00 /var/atlassian/bamboo-home/xml-data/build-dir/SMACK-NIGHTLYSTABLE-JOB1/smack-experimental/src/main/java/org/jivesoftware/smackx/mam/MamManager.java:482: warning: no description for @throws
10-Feb-2019 01:06:00      * @throws NotConnectedException
10-Feb-2019 01:06:00        ^
10-Feb-2019 01:06:00 /var/atlassian/bamboo-home/xml-data/build-dir/SMACK-NIGHTLYSTABLE-JOB1/smack-experimental/src/main/java/org/jivesoftware/smackx/mam/MamManager.java:483: warning: no description for @throws
10-Feb-2019 01:06:00      * @throws InterruptedException
10-Feb-2019 01:06:00        ^
10-Feb-2019 01:06:00 /var/atlassian/bamboo-home/xml-data/build-dir/SMACK-NIGHTLYSTABLE-JOB1/smack-experimental/src/main/java/org/jivesoftware/smackx/mam/MamManager.java:484: warning: no description for @throws
10-Feb-2019 01:06:00      * @throws NotLoggedInException
10-Feb-2019 01:06:00        ^
10-Feb-2019 01:06:00 /var/atlassian/bamboo-home/xml-data/build-dir/SMACK-NIGHTLYSTABLE-JOB1/smack-experimental/src/main/java/org/jivesoftware/smackx/mam/MamManager.java:500: warning: no description for @param
10-Feb-2019 01:06:00      * @param start
10-Feb-2019 01:06:00        ^
10-Feb-2019 01:06:00 /var/atlassian/bamboo-home/xml-data/build-dir/SMACK-NIGHTLYSTABLE-JOB1/smack-experimental/src/main/java/org/jivesoftware/smackx/mam/MamManager.java:501: warning: no description for @param
10-Feb-2019 01:06:00      * @param end
10-Feb-2019 01:06:00        ^
10-Feb-2019 01:06:00 /var/atlassian/bamboo-home/xml-data/build-dir/SMACK-NIGHTLYSTABLE-JOB1/smack-experimental/src/main/java/org/jivesoftware/smackx/mam/MamManager.java:503: warning: no description for @throws
10-Feb-2019 01:06:00      * @throws NoResponseException
10-Feb-2019 01:06:00        ^
10-Feb-2019 01:06:00 /var/atlassian/bamboo-home/xml-data/build-dir/SMACK-NIGHTLYSTABLE-JOB1/smack-experimental/src/main/java/org/jivesoftware/smackx/mam/MamManager.java:504: warning: no description for @throws
10-Feb-2019 01:06:00      * @throws XMPPErrorException
10-Feb-2019 01:06:00        ^
10-Feb-2019 01:06:00 /var/atlassian/bamboo-home/xml-data/build-dir/SMACK-NIGHTLYSTABLE-JOB1/smack-experimental/src/main/java/org/jivesoftware/smackx/mam/MamManager.java:505: warning: no description for @throws
10-Feb-2019 01:06:00      * @throws NotConnectedException
10-Feb-2019 01:06:00        ^
10-Feb-2019 01:06:00 /var/atlassian/bamboo-home/xml-data/build-dir/SMACK-NIGHTLYSTABLE-JOB1/smack-experimental/src/main/java/org/jivesoftware/smackx/mam/MamManager.java:506: warning: no description for @throws
10-Feb-2019 01:06:00      * @throws InterruptedException
10-Feb-2019 01:06:00        ^
10-Feb-2019 01:06:00 /var/atlassian/bamboo-home/xml-data/build-dir/SMACK-NIGHTLYSTABLE-JOB1/smack-experimental/src/main/java/org/jivesoftware/smackx/mam/MamManager.java:507: warning: no description for @throws
10-Feb-2019 01:06:00      * @throws NotLoggedInException
10-Feb-2019 01:06:00        ^
10-Feb-2019 01:06:00 /var/atlassian/bamboo-home/xml-data/build-dir/SMACK-NIGHTLYSTABLE-JOB1/smack-experimental/src/main/java/org/jivesoftware/smackx/mam/MamManager.java:520: warning: no description for @param
10-Feb-2019 01:06:00      * @param additionalFields
10-Feb-2019 01:06:00        ^
10-Feb-2019 01:06:00 /var/atlassian/bamboo-home/xml-data/build-dir/SMACK-NIGHTLYSTABLE-JOB1/smack-experimental/src/main/java/org/jivesoftware/smackx/mam/MamManager.java:522: warning: no description for @throws
10-Feb-2019 01:06:00      * @throws NoResponseException
10-Feb-2019 01:06:00        ^
10-Feb-2019 01:06:00 /var/atlassian/bamboo-home/xml-data/build-dir/SMACK-NIGHTLYSTABLE-JOB1/smack-experimental/src/main/java/org/jivesoftware/smackx/mam/MamManager.java:523: warning: no description for @throws
10-Feb-2019 01:06:00      * @throws XMPPErrorException
10-Feb-2019 01:06:00        ^
10-Feb-2019 01:06:00 /var/atlassian/bamboo-home/xml-data/build-dir/SMACK-NIGHTLYSTABLE-JOB1/smack-experimental/src/main/java/org/jivesoftware/smackx/mam/MamManager.java:524: warning: no description for @throws
10-Feb-2019 01:06:00      * @throws NotConnectedException
10-Feb-2019 01:06:00        ^
10-Feb-2019 01:06:00 /var/atlassian/bamboo-home/xml-data/build-dir/SMACK-NIGHTLYSTABLE-JOB1/smack-experimental/src/main/java/org/jivesoftware/smackx/mam/MamManager.java:525: warning: no description for @throws
10-Feb-2019 01:06:00      * @throws InterruptedException
10-Feb-2019 01:06:00        ^
10-Feb-2019 01:06:00 /var/atlassian/bamboo-home/xml-data/build-dir/SMACK-NIGHTLYSTABLE-JOB1/smack-experimental/src/main/java/org/jivesoftware/smackx/mam/MamManager.java:526: warning: no description for @throws
10-Feb-2019 01:06:00      * @throws NotLoggedInException
10-Feb-2019 01:06:00        ^
10-Feb-2019 01:06:00 /var/atlassian/bamboo-home/xml-data/build-dir/SMACK-NIGHTLYSTABLE-JOB1/smack-experimental/src/main/java/org/jivesoftware/smackx/mam/MamManager.java:540: warning: no description for @param
10-Feb-2019 01:06:00      * @param start
10-Feb-2019 01:06:00        ^
10-Feb-2019 01:06:00 /var/atlassian/bamboo-home/xml-data/build-dir/SMACK-NIGHTLYSTABLE-JOB1/smack-experimental/src/main/java/org/jivesoftware/smackx/mam/MamManager.java:542: warning: no description for @throws
10-Feb-2019 01:06:00      * @throws NoResponseException
10-Feb-2019 01:06:00        ^
10-Feb-2019 01:06:00 /var/atlassian/bamboo-home/xml-data/build-dir/SMACK-NIGHTLYSTABLE-JOB1/smack-experimental/src/main/java/org/jivesoftware/smackx/mam/MamManager.java:543: warning: no description for @throws
10-Feb-2019 01:06:00      * @throws XMPPErrorException
10-Feb-2019 01:06:00        ^
10-Feb-2019 01:06:00 /var/atlassian/bamboo-home/xml-data/build-dir/SMACK-NIGHTLYSTABLE-JOB1/smack-experimental/src/main/java/org/jivesoftware/smackx/mam/MamManager.java:544: warning: no description for @throws
10-Feb-2019 01:06:00      * @throws NotConnectedException
10-Feb-2019 01:06:00        ^
10-Feb-2019 01:06:00 /var/atlassian/bamboo-home/xml-data/build-dir/SMACK-NIGHTLYSTABLE-JOB1/smack-experimental/src/main/java/org/jivesoftware/smackx/mam/MamManager.java:545: warning: no description for @throws
10-Feb-2019 01:06:00      * @throws InterruptedException
10-Feb-2019 01:06:00        ^
10-Feb-2019 01:06:00 /var/atlassian/bamboo-home/xml-data/build-dir/SMACK-NIGHTLYSTABLE-JOB1/smack-experimental/src/main/java/org/jivesoftware/smackx/mam/MamManager.java:546: warning: no description for @throws
10-Feb-2019 01:06:00      * @throws NotLoggedInException
10-Feb-2019 01:06:00        ^
10-Feb-2019 01:06:02 100 warnings
10-Feb-2019 01:06:05
10-Feb-2019 01:06:05 > Task :smack-experimental:test
10-Feb-2019 01:06:05 > Task :smack-experimental:check
10-Feb-2019 01:06:05 > Task :smack-extensions:animalsnifferMain
10-Feb-2019 01:06:11 > Task :smack-extensions:checkstyleMain
10-Feb-2019 01:06:12 > Task :smack-extensions:checkstyleTest
10-Feb-2019 01:06:12 > Task :smack-extensions:clirr
10-Feb-2019 01:06:14
10-Feb-2019 01:06:14 > Task :smack-extensions:javadoc
10-Feb-2019 01:06:14 /var/atlassian/bamboo-home/xml-data/build-dir/SMACK-NIGHTLYSTABLE-JOB1/smack-extensions/src/main/java/org/jivesoftware/smackx/xdata/XDataManager.java:79: warning: no description for @throws
10-Feb-2019 01:06:14      * @throws NoResponseException
10-Feb-2019 01:06:14        ^
10-Feb-2019 01:06:14 /var/atlassian/bamboo-home/xml-data/build-dir/SMACK-NIGHTLYSTABLE-JOB1/smack-extensions/src/main/java/org/jivesoftware/smackx/xdata/XDataManager.java:80: warning: no description for @throws
10-Feb-2019 01:06:14      * @throws XMPPErrorException
10-Feb-2019 01:06:14        ^
10-Feb-2019 01:06:14 /var/atlassian/bamboo-home/xml-data/build-dir/SMACK-NIGHTLYSTABLE-JOB1/smack-extensions/src/main/java/org/jivesoftware/smackx/xdata/XDataManager.java:81: warning: no description for @throws
10-Feb-2019 01:06:14      * @throws NotConnectedException
10-Feb-2019 01:06:14        ^
10-Feb-2019 01:06:14 /var/atlassian/bamboo-home/xml-data/build-dir/SMACK-NIGHTLYSTABLE-JOB1/smack-extensions/src/main/java/org/jivesoftware/smackx/xdata/XDataManager.java:82: warning: no description for @throws
10-Feb-2019 01:06:14      * @throws InterruptedException
10-Feb-2019 01:06:14        ^
10-Feb-2019 01:06:14 /var/atlassian/bamboo-home/xml-data/build-dir/SMACK-NIGHTLYSTABLE-JOB1/smack-extensions/src/main/java/org/jivesoftware/smackx/blocking/element/BlockContactsIQ.java:52: warning: no description for @param
10-Feb-2019 01:06:14      * @param jids
10-Feb-2019 01:06:14        ^
10-Feb-2019 01:06:14 /var/atlassian/bamboo-home/xml-data/build-dir/SMACK-NIGHTLYSTABLE-JOB1/smack-extensions/src/main/java/org/jivesoftware/smackx/blocking/element/BlockedErrorExtension.java:68: warning: no description for @param
10-Feb-2019 01:06:14      * @param message
10-Feb-2019 01:06:14        ^
10-Feb-2019 01:06:15 /var/atlassian/bamboo-home/xml-data/build-dir/SMACK-NIGHTLYSTABLE-JOB1/smack-extensions/src/main/java/org/jivesoftware/smackx/blocking/element/BlockListIQ.java:53: warning: no description for @param
10-Feb-2019 01:06:15      * @param jids
10-Feb-2019 01:06:15        ^
10-Feb-2019 01:06:15 /var/atlassian/bamboo-home/xml-data/build-dir/SMACK-NIGHTLYSTABLE-JOB1/smack-extensions/src/main/java/org/jivesoftware/smackx/blocking/element/UnblockContactsIQ.java:53: warning: no description for @param
10-Feb-2019 01:06:15      * @param jids
10-Feb-2019 01:06:15        ^
10-Feb-2019 01:06:15 /var/atlassian/bamboo-home/xml-data/build-dir/SMACK-NIGHTLYSTABLE-JOB1/smack-extensions/src/main/java/org/jivesoftware/smackx/geoloc/GeoLocationManager.java:98: warning: no description for @param
10-Feb-2019 01:06:15      * @param geoLocation
10-Feb-2019 01:06:15        ^
10-Feb-2019 01:06:15 /var/atlassian/bamboo-home/xml-data/build-dir/SMACK-NIGHTLYSTABLE-JOB1/smack-extensions/src/main/java/org/jivesoftware/smackx/geoloc/GeoLocationManager.java:99: warning: no description for @throws
10-Feb-2019 01:06:15      * @throws InterruptedException
10-Feb-2019 01:06:15        ^
10-Feb-2019 01:06:15 /var/atlassian/bamboo-home/xml-data/build-dir/SMACK-NIGHTLYSTABLE-JOB1/smack-extensions/src/main/java/org/jivesoftware/smackx/geoloc/GeoLocationManager.java:100: warning: no description for @throws
10-Feb-2019 01:06:15      * @throws NotConnectedException
10-Feb-2019 01:06:15        ^
10-Feb-2019 01:06:15 /var/atlassian/bamboo-home/xml-data/build-dir/SMACK-NIGHTLYSTABLE-JOB1/smack-extensions/src/main/java/org/jivesoftware/smackx/geoloc/GeoLocationManager.java:101: warning: no description for @throws
10-Feb-2019 01:06:15      * @throws XMPPErrorException
10-Feb-2019 01:06:15        ^
10-Feb-2019 01:06:15 /var/atlassian/bamboo-home/xml-data/build-dir/SMACK-NIGHTLYSTABLE-JOB1/smack-extensions/src/main/java/org/jivesoftware/smackx/geoloc/GeoLocationManager.java:102: warning: no description for @throws
10-Feb-2019 01:06:15      * @throws NoResponseException
10-Feb-2019 01:06:15        ^
10-Feb-2019 01:06:15 /var/atlassian/bamboo-home/xml-data/build-dir/SMACK-NIGHTLYSTABLE-JOB1/smack-extensions/src/main/java/org/jivesoftware/smackx/geoloc/GeoLocationManager.java:103: warning: no description for @throws
10-Feb-2019 01:06:15      * @throws NotALeafNodeException
10-Feb-2019 01:06:15        ^
10-Feb-2019 01:06:15 /var/atlassian/bamboo-home/xml-data/build-dir/SMACK-NIGHTLYSTABLE-JOB1/smack-extensions/src/main/java/org/jivesoftware/smackx/geoloc/GeoLocationManager.java:113: warning: no description for @throws
10-Feb-2019 01:06:15      * @throws InterruptedException
10-Feb-2019 01:06:15        ^
10-Feb-2019 01:06:15 /var/atlassian/bamboo-home/xml-data/build-dir/SMACK-NIGHTLYSTABLE-JOB1/smack-extensions/src/main/java/org/jivesoftware/smackx/geoloc/GeoLocationManager.java:114: warning: no description for @throws
10-Feb-2019 01:06:15      * @throws NotConnectedException
10-Feb-2019 01:06:15        ^
10-Feb-2019 01:06:15 /var/atlassian/bamboo-home/xml-data/build-dir/SMACK-NIGHTLYSTABLE-JOB1/smack-extensions/src/main/java/org/jivesoftware/smackx/geoloc/GeoLocationManager.java:115: warning: no description for @throws
10-Feb-2019 01:06:15      * @throws XMPPErrorException
10-Feb-2019 01:06:15        ^
10-Feb-2019 01:06:15 /var/atlassian/bamboo-home/xml-data/build-dir/SMACK-NIGHTLYSTABLE-JOB1/smack-extensions/src/main/java/org/jivesoftware/smackx/geoloc/GeoLocationManager.java:116: warning: no description for @throws
10-Feb-2019 01:06:15      * @throws NoResponseException
10-Feb-2019 01:06:15        ^
10-Feb-2019 01:06:15 /var/atlassian/bamboo-home/xml-data/build-dir/SMACK-NIGHTLYSTABLE-JOB1/smack-extensions/src/main/java/org/jivesoftware/smackx/geoloc/GeoLocationManager.java:117: warning: no description for @throws
10-Feb-2019 01:06:15      * @throws NotALeafNodeException
10-Feb-2019 01:06:15        ^
10-Feb-2019 01:06:15 /var/atlassian/bamboo-home/xml-data/build-dir/SMACK-NIGHTLYSTABLE-JOB1/smack-extensions/src/main/java/org/jivesoftware/smackx/shim/packet/HeadersExtension.java:73: warning: no description for @param
10-Feb-2019 01:06:15      * @param packet
10-Feb-2019 01:06:15        ^
10-Feb-2019 01:06:15 /var/atlassian/bamboo-home/xml-data/build-dir/SMACK-NIGHTLYSTABLE-JOB1/smack-extensions/src/main/java/org/jivesoftware/smackx/xhtmlim/XHTMLManager.java:132: warning: no description for @throws
10-Feb-2019 01:06:15      * @throws XMPPErrorException
10-Feb-2019 01:06:15        ^
10-Feb-2019 01:06:15 /var/atlassian/bamboo-home/xml-data/build-dir/SMACK-NIGHTLYSTABLE-JOB1/smack-extensions/src/main/java/org/jivesoftware/smackx/xhtmlim/XHTMLManager.java:133: warning: no description for @throws
10-Feb-2019 01:06:15      * @throws NoResponseException
10-Feb-2019 01:06:15        ^
10-Feb-2019 01:06:15 /var/atlassian/bamboo-home/xml-data/build-dir/SMACK-NIGHTLYSTABLE-JOB1/smack-extensions/src/main/java/org/jivesoftware/smackx/xhtmlim/XHTMLManager.java:134: warning: no description for @throws
10-Feb-2019 01:06:15      * @throws NotConnectedException
10-Feb-2019 01:06:15        ^
10-Feb-2019 01:06:15 /var/atlassian/bamboo-home/xml-data/build-dir/SMACK-NIGHTLYSTABLE-JOB1/smack-extensions/src/main/java/org/jivesoftware/smackx/xhtmlim/XHTMLManager.java:135: warning: no description for @throws
10-Feb-2019 01:06:15      * @throws InterruptedException
10-Feb-2019 01:06:15        ^
10-Feb-2019 01:06:15 /var/atlassian/bamboo-home/xml-data/build-dir/SMACK-NIGHTLYSTABLE-JOB1/smack-extensions/src/main/java/org/jivesoftware/smackx/xdata/packet/DataForm.java:153: warning: no description for @param
10-Feb-2019 01:06:15      * @param variableName
10-Feb-2019 01:06:15        ^
10-Feb-2019 01:06:15 /var/atlassian/bamboo-home/xml-data/build-dir/SMACK-NIGHTLYSTABLE-JOB1/smack-extensions/src/main/java/org/jivesoftware/smackx/xdata/packet/DataForm.java:166: warning: no description for @param
10-Feb-2019 01:06:15      * @param variableName
10-Feb-2019 01:06:15        ^
10-Feb-2019 01:06:15 /var/atlassian/bamboo-home/xml-data/build-dir/SMACK-NIGHTLYSTABLE-JOB1/smack-extensions/src/main/java/org/jivesoftware/smackx/xdata/packet/DataForm.java:241: warning: no description for @param
10-Feb-2019 01:06:15      * @param fieldsToAdd
10-Feb-2019 01:06:15        ^
10-Feb-2019 01:06:15 /var/atlassian/bamboo-home/xml-data/build-dir/SMACK-NIGHTLYSTABLE-JOB1/smack-extensions/src/main/java/org/jivesoftware/smackx/xdata/packet/DataForm.java:345: warning: no description for @param
10-Feb-2019 01:06:15      * @param packet
10-Feb-2019 01:06:15        ^
10-Feb-2019 01:06:15 /var/atlassian/bamboo-home/xml-data/build-dir/SMACK-NIGHTLYSTABLE-JOB1/smack-extensions/src/main/java/org/jivesoftware/smackx/disco/packet/DiscoverInfo.java:94: warning: no description for @param
10-Feb-2019 01:06:15      * @param featuresToAdd
10-Feb-2019 01:06:15        ^
10-Feb-2019 01:06:15 /var/atlassian/bamboo-home/xml-data/build-dir/SMACK-NIGHTLYSTABLE-JOB1/smack-extensions/src/main/java/org/jivesoftware/smackx/disco/packet/DiscoverInfo.java:134: warning: no description for @param
10-Feb-2019 01:06:15      * @param identitiesToAdd
10-Feb-2019 01:06:15        ^
10-Feb-2019 01:06:15 /var/atlassian/bamboo-home/xml-data/build-dir/SMACK-NIGHTLYSTABLE-JOB1/smack-extensions/src/main/java/org/jivesoftware/smackx/disco/packet/DiscoverInfo.java:62: warning: no description for @param
10-Feb-2019 01:06:15      * @param d
10-Feb-2019 01:06:15        ^
10-Feb-2019 01:06:15 /var/atlassian/bamboo-home/xml-data/build-dir/SMACK-NIGHTLYSTABLE-JOB1/smack-extensions/src/main/java/org/jivesoftware/smackx/disco/packet/DiscoverInfo.java:438: warning: no description for @param
10-Feb-2019 01:06:15          * @param other
10-Feb-2019 01:06:15            ^
10-Feb-2019 01:06:15 /var/atlassian/bamboo-home/xml-data/build-dir/SMACK-NIGHTLYSTABLE-JOB1/smack-extensions/src/main/java/org/jivesoftware/smackx/disco/packet/DiscoverItems.java:62: warning: no description for @param
10-Feb-2019 01:06:15      * @param itemsToAdd
10-Feb-2019 01:06:15        ^
10-Feb-2019 01:06:15 /var/atlassian/bamboo-home/xml-data/build-dir/SMACK-NIGHTLYSTABLE-JOB1/smack-extensions/src/main/java/org/jivesoftware/smackx/bob/BoBData.java:45: warning: no description for @param
10-Feb-2019 01:06:15      * @param type
10-Feb-2019 01:06:15        ^
10-Feb-2019 01:06:15 /var/atlassian/bamboo-home/xml-data/build-dir/SMACK-NIGHTLYSTABLE-JOB1/smack-extensions/src/main/java/org/jivesoftware/smackx/bob/BoBData.java:46: warning: no description for @param
10-Feb-2019 01:06:15      * @param content
10-Feb-2019 01:06:15        ^
10-Feb-2019 01:06:15 /var/atlassian/bamboo-home/xml-data/build-dir/SMACK-NIGHTLYSTABLE-JOB1/smack-extensions/src/main/java/org/jivesoftware/smackx/bob/BoBData.java:47: warning: no description for @param
10-Feb-2019 01:06:15      * @param maxAge
10-Feb-2019 01:06:15        ^
10-Feb-2019 01:06:15 /var/atlassian/bamboo-home/xml-data/build-dir/SMACK-NIGHTLYSTABLE-JOB1/smack-extensions/src/main/java/org/jivesoftware/smackx/bob/BoBHash.java:100: warning: no description for @param
10-Feb-2019 01:06:15      * @param src
10-Feb-2019 01:06:15        ^
10-Feb-2019 01:06:15 /var/atlassian/bamboo-home/xml-data/build-dir/SMACK-NIGHTLYSTABLE-JOB1/smack-extensions/src/main/java/org/jivesoftware/smackx/bob/BoBHash.java:112: warning: no description for @param
10-Feb-2019 01:06:15      * @param cid
10-Feb-2019 01:06:15        ^
10-Feb-2019 01:06:15 /var/atlassian/bamboo-home/xml-data/build-dir/SMACK-NIGHTLYSTABLE-JOB1/smack-extensions/src/main/java/org/jivesoftware/smackx/bob/BoBHash.java:38: warning: no description for @param
10-Feb-2019 01:06:15      * @param hash
10-Feb-2019 01:06:15        ^
10-Feb-2019 01:06:15 /var/atlassian/bamboo-home/xml-data/build-dir/SMACK-NIGHTLYSTABLE-JOB1/smack-extensions/src/main/java/org/jivesoftware/smackx/bob/BoBHash.java:39: warning: no description for @param
10-Feb-2019 01:06:15      * @param hashType
10-Feb-2019 01:06:15        ^
10-Feb-2019 01:06:15 /var/atlassian/bamboo-home/xml-data/build-dir/SMACK-NIGHTLYSTABLE-JOB1/smack-extensions/src/main/java/org/jivesoftware/smackx/bob/BoBManager.java:71: warning: no description for @param
10-Feb-2019 01:06:15      * @param connection
10-Feb-2019 01:06:15        ^
10-Feb-2019 01:06:15 /var/atlassian/bamboo-home/xml-data/build-dir/SMACK-NIGHTLYSTABLE-JOB1/smack-extensions/src/main/java/org/jivesoftware/smackx/bob/BoBManager.java:118: warning: no description for @throws
10-Feb-2019 01:06:15      * @throws NoResponseException
10-Feb-2019 01:06:15        ^
10-Feb-2019 01:06:15 /var/atlassian/bamboo-home/xml-data/build-dir/SMACK-NIGHTLYSTABLE-JOB1/smack-extensions/src/main/java/org/jivesoftware/smackx/bob/BoBManager.java:119: warning: no description for @throws
10-Feb-2019 01:06:15      * @throws XMPPErrorException
10-Feb-2019 01:06:15        ^
10-Feb-2019 01:06:15 /var/atlassian/bamboo-home/xml-data/build-dir/SMACK-NIGHTLYSTABLE-JOB1/smack-extensions/src/main/java/org/jivesoftware/smackx/bob/BoBManager.java:120: warning: no description for @throws
10-Feb-2019 01:06:15      * @throws NotConnectedException
10-Feb-2019 01:06:15        ^
10-Feb-2019 01:06:15 /var/atlassian/bamboo-home/xml-data/build-dir/SMACK-NIGHTLYSTABLE-JOB1/smack-extensions/src/main/java/org/jivesoftware/smackx/bob/BoBManager.java:121: warning: no description for @throws
10-Feb-2019 01:06:15      * @throws InterruptedException
10-Feb-2019 01:06:15        ^
10-Feb-2019 01:06:15 /var/atlassian/bamboo-home/xml-data/build-dir/SMACK-NIGHTLYSTABLE-JOB1/smack-extensions/src/main/java/org/jivesoftware/smackx/bob/BoBManager.java:131: warning: no description for @param
10-Feb-2019 01:06:15      * @param to
10-Feb-2019 01:06:15        ^
10-Feb-2019 01:06:15 /var/atlassian/bamboo-home/xml-data/build-dir/SMACK-NIGHTLYSTABLE-JOB1/smack-extensions/src/main/java/org/jivesoftware/smackx/bob/BoBManager.java:132: warning: no description for @param
10-Feb-2019 01:06:15      * @param bobHash
10-Feb-2019 01:06:15        ^
10-Feb-2019 01:06:15 /var/atlassian/bamboo-home/xml-data/build-dir/SMACK-NIGHTLYSTABLE-JOB1/smack-extensions/src/main/java/org/jivesoftware/smackx/bob/BoBManager.java:134: warning: no description for @throws
10-Feb-2019 01:06:15      * @throws NotLoggedInException
10-Feb-2019 01:06:15        ^
10-Feb-2019 01:06:15 /var/atlassian/bamboo-home/xml-data/build-dir/SMACK-NIGHTLYSTABLE-JOB1/smack-extensions/src/main/java/org/jivesoftware/smackx/bob/BoBManager.java:135: warning: no description for @throws
10-Feb-2019 01:06:15      * @throws NoResponseException
10-Feb-2019 01:06:15        ^
10-Feb-2019 01:06:15 /var/atlassian/bamboo-home/xml-data/build-dir/SMACK-NIGHTLYSTABLE-JOB1/smack-extensions/src/main/java/org/jivesoftware/smackx/bob/BoBManager.java:136: warning: no description for @throws
10-Feb-2019 01:06:15      * @throws XMPPErrorException
10-Feb-2019 01:06:15        ^
10-Feb-2019 01:06:15 /var/atlassian/bamboo-home/xml-data/build-dir/SMACK-NIGHTLYSTABLE-JOB1/smack-extensions/src/main/java/org/jivesoftware/smackx/bob/BoBManager.java:137: warning: no description for @throws
10-Feb-2019 01:06:15      * @throws NotConnectedException
10-Feb-2019 01:06:15        ^
10-Feb-2019 01:06:15 /var/atlassian/bamboo-home/xml-data/build-dir/SMACK-NIGHTLYSTABLE-JOB1/smack-extensions/src/main/java/org/jivesoftware/smackx/bob/BoBManager.java:138: warning: no description for @throws
10-Feb-2019 01:06:15      * @throws InterruptedException
10-Feb-2019 01:06:15        ^
10-Feb-2019 01:06:15 /var/atlassian/bamboo-home/xml-data/build-dir/SMACK-NIGHTLYSTABLE-JOB1/smack-extensions/src/main/java/org/jivesoftware/smackx/address/MultipleRecipientManager.java:71: warning: no description for @throws
10-Feb-2019 01:06:15      * @throws NotConnectedException
10-Feb-2019 01:06:15        ^
10-Feb-2019 01:06:15 /var/atlassian/bamboo-home/xml-data/build-dir/SMACK-NIGHTLYSTABLE-JOB1/smack-extensions/src/main/java/org/jivesoftware/smackx/address/MultipleRecipientManager.java:72: warning: no description for @throws
10-Feb-2019 01:06:15      * @throws InterruptedException
10-Feb-2019 01:06:15        ^
10-Feb-2019 01:06:15 /var/atlassian/bamboo-home/xml-data/build-dir/SMACK-NIGHTLYSTABLE-JOB1/smack-extensions/src/main/java/org/jivesoftware/smackx/address/MultipleRecipientManager.java:102: warning: no description for @throws
10-Feb-2019 01:06:15      * @throws NotConnectedException
10-Feb-2019 01:06:15        ^
10-Feb-2019 01:06:15 /var/atlassian/bamboo-home/xml-data/build-dir/SMACK-NIGHTLYSTABLE-JOB1/smack-extensions/src/main/java/org/jivesoftware/smackx/address/MultipleRecipientManager.java:103: warning: no description for @throws
10-Feb-2019 01:06:15      * @throws InterruptedException
10-Feb-2019 01:06:15        ^
10-Feb-2019 01:06:15 /var/atlassian/bamboo-home/xml-data/build-dir/SMACK-NIGHTLYSTABLE-JOB1/smack-extensions/src/main/java/org/jivesoftware/smackx/address/MultipleRecipientManager.java:143: warning: no description for @throws
10-Feb-2019 01:06:15      * @throws SmackException
10-Feb-2019 01:06:15        ^
10-Feb-2019 01:06:15 /var/atlassian/bamboo-home/xml-data/build-dir/SMACK-NIGHTLYSTABLE-JOB1/smack-extensions/src/main/java/org/jivesoftware/smackx/address/MultipleRecipientManager.java:144: warning: no description for @throws
10-Feb-2019 01:06:15      * @throws XMPPErrorException
10-Feb-2019 01:06:15        ^
10-Feb-2019 01:06:15 /var/atlassian/bamboo-home/xml-data/build-dir/SMACK-NIGHTLYSTABLE-JOB1/smack-extensions/src/main/java/org/jivesoftware/smackx/address/MultipleRecipientManager.java:145: warning: no description for @throws
10-Feb-2019 01:06:15      * @throws InterruptedException
10-Feb-2019 01:06:15        ^
10-Feb-2019 01:06:15 /var/atlassian/bamboo-home/xml-data/build-dir/SMACK-NIGHTLYSTABLE-JOB1/smack-extensions/src/main/java/org/jivesoftware/smackx/muc/MucConfigFormManager.java:159: warning: no description for @throws
10-Feb-2019 01:06:15      * @throws MucConfigurationNotSupportedException
10-Feb-2019 01:06:15        ^
10-Feb-2019 01:06:15 /var/atlassian/bamboo-home/xml-data/build-dir/SMACK-NIGHTLYSTABLE-JOB1/smack-extensions/src/main/java/org/jivesoftware/smackx/muc/MucConfigFormManager.java:170: warning: no description for @throws
10-Feb-2019 01:06:15      * @throws MucConfigurationNotSupportedException
10-Feb-2019 01:06:15        ^
10-Feb-2019 01:06:15 /var/atlassian/bamboo-home/xml-data/build-dir/SMACK-NIGHTLYSTABLE-JOB1/smack-extensions/src/main/java/org/jivesoftware/smackx/muc/MucConfigFormManager.java:195: warning: no description for @throws
10-Feb-2019 01:06:15      * @throws MucConfigurationNotSupportedException
10-Feb-2019 01:06:15        ^
10-Feb-2019 01:06:15 /var/atlassian/bamboo-home/xml-data/build-dir/SMACK-NIGHTLYSTABLE-JOB1/smack-extensions/src/main/java/org/jivesoftware/smackx/muc/MucConfigFormManager.java:206: warning: no description for @throws
10-Feb-2019 01:06:15      * @throws MucConfigurationNotSupportedException
10-Feb-2019 01:06:15        ^
10-Feb-2019 01:06:15 /var/atlassian/bamboo-home/xml-data/build-dir/SMACK-NIGHTLYSTABLE-JOB1/smack-extensions/src/main/java/org/jivesoftware/smackx/muc/MucConfigFormManager.java:215: warning: no description for @param
10-Feb-2019 01:06:15      * @param isPasswordProtected
10-Feb-2019 01:06:15        ^
10-Feb-2019 01:06:15 /var/atlassian/bamboo-home/xml-data/build-dir/SMACK-NIGHTLYSTABLE-JOB1/smack-extensions/src/main/java/org/jivesoftware/smackx/muc/MucConfigFormManager.java:217: warning: no description for @throws
10-Feb-2019 01:06:15      * @throws MucConfigurationNotSupportedException
10-Feb-2019 01:06:15        ^
10-Feb-2019 01:06:15 /var/atlassian/bamboo-home/xml-data/build-dir/SMACK-NIGHTLYSTABLE-JOB1/smack-extensions/src/main/java/org/jivesoftware/smackx/muc/MucConfigFormManager.java:235: warning: no description for @throws
10-Feb-2019 01:06:15      * @throws MucConfigurationNotSupportedException
10-Feb-2019 01:06:15        ^
10-Feb-2019 01:06:15 /var/atlassian/bamboo-home/xml-data/build-dir/SMACK-NIGHTLYSTABLE-JOB1/smack-extensions/src/main/java/org/jivesoftware/smackx/muc/MucConfigFormManager.java:250: warning: no description for @throws
10-Feb-2019 01:06:15      * @throws XMPPErrorException
10-Feb-2019 01:06:15        ^
10-Feb-2019 01:06:15 /var/atlassian/bamboo-home/xml-data/build-dir/SMACK-NIGHTLYSTABLE-JOB1/smack-extensions/src/main/java/org/jivesoftware/smackx/muc/MucConfigFormManager.java:251: warning: no description for @throws
10-Feb-2019 01:06:15      * @throws NotConnectedException
10-Feb-2019 01:06:15        ^
10-Feb-2019 01:06:15 /var/atlassian/bamboo-home/xml-data/build-dir/SMACK-NIGHTLYSTABLE-JOB1/smack-extensions/src/main/java/org/jivesoftware/smackx/muc/MucConfigFormManager.java:252: warning: no description for @throws
10-Feb-2019 01:06:15      * @throws InterruptedException
10-Feb-2019 01:06:15        ^
10-Feb-2019 01:06:15 /var/atlassian/bamboo-home/xml-data/build-dir/SMACK-NIGHTLYSTABLE-JOB1/smack-extensions/src/main/java/org/jivesoftware/smackx/muc/MucEnterConfiguration.java:104: warning: no description for @param
10-Feb-2019 01:06:15          * @param presence
10-Feb-2019 01:06:15            ^
10-Feb-2019 01:06:15 /var/atlassian/bamboo-home/xml-data/build-dir/SMACK-NIGHTLYSTABLE-JOB1/smack-extensions/src/main/java/org/jivesoftware/smackx/muc/MultiUserChat.java:432: warning: no description for @throws
10-Feb-2019 01:06:15      * @throws InterruptedException
10-Feb-2019 01:06:15        ^
10-Feb-2019 01:06:15 /var/atlassian/bamboo-home/xml-data/build-dir/SMACK-NIGHTLYSTABLE-JOB1/smack-extensions/src/main/java/org/jivesoftware/smackx/muc/MultiUserChat.java:433: warning: no description for @throws
10-Feb-2019 01:06:15      * @throws NotConnectedException
10-Feb-2019 01:06:15        ^
10-Feb-2019 01:06:15 /var/atlassian/bamboo-home/xml-data/build-dir/SMACK-NIGHTLYSTABLE-JOB1/smack-extensions/src/main/java/org/jivesoftware/smackx/muc/MultiUserChat.java:434: warning: no description for @throws
10-Feb-2019 01:06:15      * @throws MucAlreadyJoinedException
10-Feb-2019 01:06:15        ^
10-Feb-2019 01:06:15 /var/atlassian/bamboo-home/xml-data/build-dir/SMACK-NIGHTLYSTABLE-JOB1/smack-extensions/src/main/java/org/jivesoftware/smackx/muc/MultiUserChat.java:435: warning: no description for @throws
10-Feb-2019 01:06:15      * @throws MissingMucCreationAcknowledgeException
10-Feb-2019 01:06:15        ^
10-Feb-2019 01:06:15 /var/atlassian/bamboo-home/xml-data/build-dir/SMACK-NIGHTLYSTABLE-JOB1/smack-extensions/src/main/java/org/jivesoftware/smackx/muc/MultiUserChat.java:436: warning: no description for @throws
10-Feb-2019 01:06:15      * @throws NotAMucServiceException
10-Feb-2019 01:06:15        ^
10-Feb-2019 01:06:15 /var/atlassian/bamboo-home/xml-data/build-dir/SMACK-NIGHTLYSTABLE-JOB1/smack-extensions/src/main/java/org/jivesoftware/smackx/muc/MultiUserChat.java:460: warning: no description for @throws
10-Feb-2019 01:06:15      * @throws NoResponseException
10-Feb-2019 01:06:15        ^
10-Feb-2019 01:06:15 /var/atlassian/bamboo-home/xml-data/build-dir/SMACK-NIGHTLYSTABLE-JOB1/smack-extensions/src/main/java/org/jivesoftware/smackx/muc/MultiUserChat.java:461: warning: no description for @throws
10-Feb-2019 01:06:15      * @throws XMPPErrorException
10-Feb-2019 01:06:15        ^
10-Feb-2019 01:06:15 /var/atlassian/bamboo-home/xml-data/build-dir/SMACK-NIGHTLYSTABLE-JOB1/smack-extensions/src/main/java/org/jivesoftware/smackx/muc/MultiUserChat.java:462: warning: no description for @throws
10-Feb-2019 01:06:15      * @throws InterruptedException
10-Feb-2019 01:06:15        ^
10-Feb-2019 01:06:15 /var/atlassian/bamboo-home/xml-data/build-dir/SMACK-NIGHTLYSTABLE-JOB1/smack-extensions/src/main/java/org/jivesoftware/smackx/muc/MultiUserChat.java:463: warning: no description for @throws
10-Feb-2019 01:06:15      * @throws NotConnectedException
10-Feb-2019 01:06:15        ^
10-Feb-2019 01:06:15 /var/atlassian/bamboo-home/xml-data/build-dir/SMACK-NIGHTLYSTABLE-JOB1/smack-extensions/src/main/java/org/jivesoftware/smackx/muc/MultiUserChat.java:464: warning: no description for @throws
10-Feb-2019 01:06:15      * @throws MucAlreadyJoinedException
10-Feb-2019 01:06:15        ^
10-Feb-2019 01:06:15 /var/atlassian/bamboo-home/xml-data/build-dir/SMACK-NIGHTLYSTABLE-JOB1/smack-extensions/src/main/java/org/jivesoftware/smackx/muc/MultiUserChat.java:465: warning: no description for @throws
10-Feb-2019 01:06:15      * @throws NotAMucServiceException
10-Feb-2019 01:06:15        ^
10-Feb-2019 01:06:15 /var/atlassian/bamboo-home/xml-data/build-dir/SMACK-NIGHTLYSTABLE-JOB1/smack-extensions/src/main/java/org/jivesoftware/smackx/muc/MultiUserChat.java:487: warning: no description for @throws
10-Feb-2019 01:06:15      * @throws InterruptedException
10-Feb-2019 01:06:15        ^
10-Feb-2019 01:06:15 /var/atlassian/bamboo-home/xml-data/build-dir/SMACK-NIGHTLYSTABLE-JOB1/smack-extensions/src/main/java/org/jivesoftware/smackx/muc/MultiUserChat.java:489: warning: no description for @throws
10-Feb-2019 01:06:15      * @throws NotConnectedException
10-Feb-2019 01:06:15        ^
10-Feb-2019 01:06:15 /var/atlassian/bamboo-home/xml-data/build-dir/SMACK-NIGHTLYSTABLE-JOB1/smack-extensions/src/main/java/org/jivesoftware/smackx/muc/MultiUserChat.java:490: warning: no description for @throws
10-Feb-2019 01:06:15      * @throws NotAMucServiceException
10-Feb-2019 01:06:15        ^
10-Feb-2019 01:06:15 /var/atlassian/bamboo-home/xml-data/build-dir/SMACK-NIGHTLYSTABLE-JOB1/smack-extensions/src/main/java/org/jivesoftware/smackx/muc/MultiUserChat.java:514: warning: no description for @throws
10-Feb-2019 01:06:15      * @throws InterruptedException
10-Feb-2019 01:06:15        ^
10-Feb-2019 01:06:15 /var/atlassian/bamboo-home/xml-data/build-dir/SMACK-NIGHTLYSTABLE-JOB1/smack-extensions/src/main/java/org/jivesoftware/smackx/muc/MultiUserChat.java:516: warning: no description for @throws
10-Feb-2019 01:06:15      * @throws NotConnectedException
10-Feb-2019 01:06:15        ^
10-Feb-2019 01:06:15 /var/atlassian/bamboo-home/xml-data/build-dir/SMACK-NIGHTLYSTABLE-JOB1/smack-extensions/src/main/java/org/jivesoftware/smackx/muc/MultiUserChat.java:517: warning: no description for @throws
10-Feb-2019 01:06:15      * @throws NotAMucServiceException
10-Feb-2019 01:06:15        ^
10-Feb-2019 01:06:15 /var/atlassian/bamboo-home/xml-data/build-dir/SMACK-NIGHTLYSTABLE-JOB1/smack-extensions/src/main/java/org/jivesoftware/smackx/muc/MultiUserChat.java:586: warning: no description for @throws
10-Feb-2019 01:06:15      * @throws NoResponseException
10-Feb-2019 01:06:15        ^
10-Feb-2019 01:06:15 /var/atlassian/bamboo-home/xml-data/build-dir/SMACK-NIGHTLYSTABLE-JOB1/smack-extensions/src/main/java/org/jivesoftware/smackx/muc/MultiUserChat.java:587: warning: no description for @throws
10-Feb-2019 01:06:15      * @throws XMPPErrorException
10-Feb-2019 01:06:15        ^
10-Feb-2019 01:06:15 /var/atlassian/bamboo-home/xml-data/build-dir/SMACK-NIGHTLYSTABLE-JOB1/smack-extensions/src/main/java/org/jivesoftware/smackx/muc/MultiUserChat.java:588: warning: no description for @throws
10-Feb-2019 01:06:15      * @throws NotConnectedException
10-Feb-2019 01:06:15        ^
10-Feb-2019 01:06:15 /var/atlassian/bamboo-home/xml-data/build-dir/SMACK-NIGHTLYSTABLE-JOB1/smack-extensions/src/main/java/org/jivesoftware/smackx/muc/MultiUserChat.java:589: warning: no description for @throws
10-Feb-2019 01:06:15      * @throws InterruptedException
10-Feb-2019 01:06:15        ^
10-Feb-2019 01:06:15 /var/atlassian/bamboo-home/xml-data/build-dir/SMACK-NIGHTLYSTABLE-JOB1/smack-extensions/src/main/java/org/jivesoftware/smackx/muc/MultiUserChat.java:590: warning: no description for @throws
10-Feb-2019 01:06:15      * @throws NotAMucServiceException
10-Feb-2019 01:06:15        ^
10-Feb-2019 01:06:15 /var/atlassian/bamboo-home/xml-data/build-dir/SMACK-NIGHTLYSTABLE-JOB1/smack-extensions/src/main/java/org/jivesoftware/smackx/muc/MultiUserChat.java:615: warning: no description for @throws
10-Feb-2019 01:06:15      * @throws NoResponseException
10-Feb-2019 01:06:15        ^
10-Feb-2019 01:06:15 /var/atlassian/bamboo-home/xml-data/build-dir/SMACK-NIGHTLYSTABLE-JOB1/smack-extensions/src/main/java/org/jivesoftware/smackx/muc/MultiUserChat.java:623: warning: no description for @throws
10-Feb-2019 01:06:15      * @throws NotConnectedException
10-Feb-2019 01:06:15        ^
10-Feb-2019 01:06:15 /var/atlassian/bamboo-home/xml-data/build-dir/SMACK-NIGHTLYSTABLE-JOB1/smack-extensions/src/main/java/org/jivesoftware/smackx/muc/MultiUserChat.java:624: warning: no description for @throws
10-Feb-2019 01:06:15      * @throws InterruptedException
10-Feb-2019 01:06:15        ^
10-Feb-2019 01:06:15 /var/atlassian/bamboo-home/xml-data/build-dir/SMACK-NIGHTLYSTABLE-JOB1/smack-extensions/src/main/java/org/jivesoftware/smackx/muc/MultiUserChat.java:625: warning: no description for @throws
10-Feb-2019 01:06:15      * @throws NotAMucServiceException
10-Feb-2019 01:06:15        ^
10-Feb-2019 01:06:15 /var/atlassian/bamboo-home/xml-data/build-dir/SMACK-NIGHTLYSTABLE-JOB1/smack-extensions/src/main/java/org/jivesoftware/smackx/muc/MultiUserChat.java:651: warning: no description for @throws
10-Feb-2019 01:06:15      * @throws InterruptedException
10-Feb-2019 01:06:15        ^
10-Feb-2019 01:06:15 /var/atlassian/bamboo-home/xml-data/build-dir/SMACK-NIGHTLYSTABLE-JOB1/smack-extensions/src/main/java/org/jivesoftware/smackx/muc/MultiUserChat.java:652: warning: no description for @throws
10-Feb-2019 01:06:15      * @throws NotConnectedException
10-Feb-2019 01:06:15        ^
10-Feb-2019 01:06:15 /var/atlassian/bamboo-home/xml-data/build-dir/SMACK-NIGHTLYSTABLE-JOB1/smack-extensions/src/main/java/org/jivesoftware/smackx/muc/MultiUserChat.java:654: warning: no description for @throws
10-Feb-2019 01:06:15      * @throws NotAMucServiceException
10-Feb-2019 01:06:15        ^
10-Feb-2019 01:06:15 /var/atlassian/bamboo-home/xml-data/build-dir/SMACK-NIGHTLYSTABLE-JOB1/smack-extensions/src/main/java/org/jivesoftware/smackx/muc/MultiUserChat.java:687: warning: no description for @throws
10-Feb-2019 01:06:15      * @throws NotConnectedException
10-Feb-2019 01:06:15        ^
10-Feb-2019 01:06:17 100 warnings
10-Feb-2019 01:06:28
10-Feb-2019 01:06:28 > Task :smack-extensions:test
10-Feb-2019 01:06:28 > Task :smack-extensions:check
10-Feb-2019 01:06:28 > Task :smack-im:animalsnifferMain
10-Feb-2019 01:06:29 > Task :smack-im:checkstyleMain
10-Feb-2019 01:06:31 > Task :smack-im:compileTestJava
10-Feb-2019 01:06:31 > Task :smack-im:processTestResources NO-SOURCE
10-Feb-2019 01:06:31 > Task :smack-im:testClasses
10-Feb-2019 01:06:31 > Task :smack-im:checkstyleTest
10-Feb-2019 01:06:31 > Task :smack-im:clirr
10-Feb-2019 01:06:33 /var/atlassian/bamboo-home/xml-data/build-dir/SMACK-NIGHTLYSTABLE-JOB1/smack-im/src/main/java/org/jivesoftware/smack/roster/packet/RosterPacket.java:138: warning: no description for @param
10-Feb-2019 01:06:33          * @param jid
10-Feb-2019 01:06:33            ^
10-Feb-2019 01:06:33 /var/atlassian/bamboo-home/xml-data/build-dir/SMACK-NIGHTLYSTABLE-JOB1/smack-im/src/main/java/org/jivesoftware/smack/roster/packet/RosterPacket.java:139: warning: no description for @param
10-Feb-2019 01:06:33          * @param name
10-Feb-2019 01:06:33            ^
10-Feb-2019 01:06:33 /var/atlassian/bamboo-home/xml-data/build-dir/SMACK-NIGHTLYSTABLE-JOB1/smack-im/src/main/java/org/jivesoftware/smack/roster/packet/RosterPacket.java:150: warning: no description for @param
10-Feb-2019 01:06:33          * @param subscriptionPending
10-Feb-2019 01:06:33            ^
10-Feb-2019 01:06:33 /var/atlassian/bamboo-home/xml-data/build-dir/SMACK-NIGHTLYSTABLE-JOB1/smack-im/src/main/java/org/jivesoftware/smack/chat/Chat.java:97: warning: no description for @throws
10-Feb-2019 01:06:33      * @throws NotConnectedException
10-Feb-2019 01:06:33        ^
10-Feb-2019 01:06:33 /var/atlassian/bamboo-home/xml-data/build-dir/SMACK-NIGHTLYSTABLE-JOB1/smack-im/src/main/java/org/jivesoftware/smack/chat/Chat.java:98: warning: no description for @throws
10-Feb-2019 01:06:33      * @throws InterruptedException
10-Feb-2019 01:06:33        ^
10-Feb-2019 01:06:33 /var/atlassian/bamboo-home/xml-data/build-dir/SMACK-NIGHTLYSTABLE-JOB1/smack-im/src/main/java/org/jivesoftware/smack/chat/Chat.java:111: warning: no description for @throws
10-Feb-2019 01:06:33      * @throws NotConnectedException
10-Feb-2019 01:06:33        ^
10-Feb-2019 01:06:33 /var/atlassian/bamboo-home/xml-data/build-dir/SMACK-NIGHTLYSTABLE-JOB1/smack-im/src/main/java/org/jivesoftware/smack/chat/Chat.java:112: warning: no description for @throws
10-Feb-2019 01:06:33      * @throws InterruptedException
10-Feb-2019 01:06:33        ^
10-Feb-2019 01:06:33 /var/atlassian/bamboo-home/xml-data/build-dir/SMACK-NIGHTLYSTABLE-JOB1/smack-im/src/main/java/org/jivesoftware/smack/roster/Roster.java:440: warning: no description for @throws
10-Feb-2019 01:06:33      * @throws NotConnectedException
10-Feb-2019 01:06:33        ^
10-Feb-2019 01:06:33 /var/atlassian/bamboo-home/xml-data/build-dir/SMACK-NIGHTLYSTABLE-JOB1/smack-im/src/main/java/org/jivesoftware/smack/roster/Roster.java:441: warning: no description for @throws
10-Feb-2019 01:06:33      * @throws InterruptedException
10-Feb-2019 01:06:33        ^
10-Feb-2019 01:06:33 /var/atlassian/bamboo-home/xml-data/build-dir/SMACK-NIGHTLYSTABLE-JOB1/smack-im/src/main/java/org/jivesoftware/smack/roster/Roster.java:477: warning: no description for @throws
10-Feb-2019 01:06:33      * @throws NotLoggedInException
10-Feb-2019 01:06:33        ^
10-Feb-2019 01:06:33 /var/atlassian/bamboo-home/xml-data/build-dir/SMACK-NIGHTLYSTABLE-JOB1/smack-im/src/main/java/org/jivesoftware/smack/roster/Roster.java:478: warning: no description for @throws
10-Feb-2019 01:06:33      * @throws NotConnectedException
10-Feb-2019 01:06:33        ^
10-Feb-2019 01:06:33 /var/atlassian/bamboo-home/xml-data/build-dir/SMACK-NIGHTLYSTABLE-JOB1/smack-im/src/main/java/org/jivesoftware/smack/roster/Roster.java:479: warning: no description for @throws
10-Feb-2019 01:06:33      * @throws InterruptedException
10-Feb-2019 01:06:33        ^
10-Feb-2019 01:06:33 /var/atlassian/bamboo-home/xml-data/build-dir/SMACK-NIGHTLYSTABLE-JOB1/smack-im/src/main/java/org/jivesoftware/smack/roster/Roster.java:490: warning: no description for @param
10-Feb-2019 01:06:33      * @param rosterStore
10-Feb-2019 01:06:33        ^
10-Feb-2019 01:06:33 /var/atlassian/bamboo-home/xml-data/build-dir/SMACK-NIGHTLYSTABLE-JOB1/smack-im/src/main/java/org/jivesoftware/smack/roster/Roster.java:630: warning: no description for @throws
10-Feb-2019 01:06:33      * @throws NotConnectedException
10-Feb-2019 01:06:33        ^
10-Feb-2019 01:06:33 /var/atlassian/bamboo-home/xml-data/build-dir/SMACK-NIGHTLYSTABLE-JOB1/smack-im/src/main/java/org/jivesoftware/smack/roster/Roster.java:631: warning: no description for @throws
10-Feb-2019 01:06:33      * @throws InterruptedException
10-Feb-2019 01:06:33        ^
10-Feb-2019 01:06:33 /var/atlassian/bamboo-home/xml-data/build-dir/SMACK-NIGHTLYSTABLE-JOB1/smack-im/src/main/java/org/jivesoftware/smack/roster/Roster.java:664: warning: no description for @throws
10-Feb-2019 01:06:33      * @throws NotConnectedException
10-Feb-2019 01:06:33        ^
10-Feb-2019 01:06:33 /var/atlassian/bamboo-home/xml-data/build-dir/SMACK-NIGHTLYSTABLE-JOB1/smack-im/src/main/java/org/jivesoftware/smack/roster/Roster.java:665: warning: no description for @throws
10-Feb-2019 01:06:33      * @throws InterruptedException
10-Feb-2019 01:06:33        ^
10-Feb-2019 01:06:33 /var/atlassian/bamboo-home/xml-data/build-dir/SMACK-NIGHTLYSTABLE-JOB1/smack-im/src/main/java/org/jivesoftware/smack/roster/Roster.java:679: warning: no description for @throws
10-Feb-2019 01:06:33      * @throws NotConnectedException
10-Feb-2019 01:06:33        ^
10-Feb-2019 01:06:33 /var/atlassian/bamboo-home/xml-data/build-dir/SMACK-NIGHTLYSTABLE-JOB1/smack-im/src/main/java/org/jivesoftware/smack/roster/Roster.java:680: warning: no description for @throws
10-Feb-2019 01:06:33      * @throws InterruptedException
10-Feb-2019 01:06:33        ^
10-Feb-2019 01:06:33 /var/atlassian/bamboo-home/xml-data/build-dir/SMACK-NIGHTLYSTABLE-JOB1/smack-im/src/main/java/org/jivesoftware/smack/roster/Roster.java:761: warning: no description for @throws
10-Feb-2019 01:06:33      * @throws NotConnectedException
10-Feb-2019 01:06:33        ^
10-Feb-2019 01:06:33 /var/atlassian/bamboo-home/xml-data/build-dir/SMACK-NIGHTLYSTABLE-JOB1/smack-im/src/main/java/org/jivesoftware/smack/roster/Roster.java:762: warning: no description for @throws
10-Feb-2019 01:06:33      * @throws InterruptedException
10-Feb-2019 01:06:33        ^
10-Feb-2019 01:06:33 /var/atlassian/bamboo-home/xml-data/build-dir/SMACK-NIGHTLYSTABLE-JOB1/smack-im/src/main/java/org/jivesoftware/smack/roster/Roster.java:923: warning: empty <p> tag
10-Feb-2019 01:06:33      * </p>
10-Feb-2019 01:06:33        ^
10-Feb-2019 01:06:33 /var/atlassian/bamboo-home/xml-data/build-dir/SMACK-NIGHTLYSTABLE-JOB1/smack-im/src/main/java/org/jivesoftware/smack/roster/Roster.java:1127: warning: no description for @param
10-Feb-2019 01:06:33      * @param jid
10-Feb-2019 01:06:33        ^
10-Feb-2019 01:06:33 /var/atlassian/bamboo-home/xml-data/build-dir/SMACK-NIGHTLYSTABLE-JOB1/smack-im/src/main/java/org/jivesoftware/smack/roster/Roster.java:1792: warning: no description for @param
10-Feb-2019 01:06:33      * @param maximumSize
10-Feb-2019 01:06:33        ^
10-Feb-2019 01:06:33 /var/atlassian/bamboo-home/xml-data/build-dir/SMACK-NIGHTLYSTABLE-JOB1/smack-im/src/main/java/org/jivesoftware/smack/roster/RosterEntry.java:96: warning: no description for @throws
10-Feb-2019 01:06:33      * @throws NotConnectedException
10-Feb-2019 01:06:33        ^
10-Feb-2019 01:06:33 /var/atlassian/bamboo-home/xml-data/build-dir/SMACK-NIGHTLYSTABLE-JOB1/smack-im/src/main/java/org/jivesoftware/smack/roster/RosterEntry.java:97: warning: no description for @throws
10-Feb-2019 01:06:33      * @throws XMPPErrorException
10-Feb-2019 01:06:33        ^
10-Feb-2019 01:06:33 /var/atlassian/bamboo-home/xml-data/build-dir/SMACK-NIGHTLYSTABLE-JOB1/smack-im/src/main/java/org/jivesoftware/smack/roster/RosterEntry.java:98: warning: no description for @throws
10-Feb-2019 01:06:33      * @throws NoResponseException
10-Feb-2019 01:06:33        ^
10-Feb-2019 01:06:33 /var/atlassian/bamboo-home/xml-data/build-dir/SMACK-NIGHTLYSTABLE-JOB1/smack-im/src/main/java/org/jivesoftware/smack/roster/RosterEntry.java:99: warning: no description for @throws
10-Feb-2019 01:06:33      * @throws InterruptedException
10-Feb-2019 01:06:33        ^
10-Feb-2019 01:06:33
10-Feb-2019 01:06:33 > Task :smack-im:javadoc
10-Feb-2019 01:06:33 /var/atlassian/bamboo-home/xml-data/build-dir/SMACK-NIGHTLYSTABLE-JOB1/smack-im/src/main/java/org/jivesoftware/smack/roster/RosterEntry.java:215: warning: no description for @throws
10-Feb-2019 01:06:33      * @throws NotConnectedException
10-Feb-2019 01:06:33        ^
10-Feb-2019 01:06:33 /var/atlassian/bamboo-home/xml-data/build-dir/SMACK-NIGHTLYSTABLE-JOB1/smack-im/src/main/java/org/jivesoftware/smack/roster/RosterEntry.java:216: warning: no description for @throws
10-Feb-2019 01:06:33      * @throws InterruptedException
10-Feb-2019 01:06:33        ^
10-Feb-2019 01:06:33 /var/atlassian/bamboo-home/xml-data/build-dir/SMACK-NIGHTLYSTABLE-JOB1/smack-im/src/main/java/org/jivesoftware/smack/roster/RosterGroup.java:74: warning: no description for @throws
10-Feb-2019 01:06:33      * @throws NotConnectedException
10-Feb-2019 01:06:33        ^
10-Feb-2019 01:06:33 /var/atlassian/bamboo-home/xml-data/build-dir/SMACK-NIGHTLYSTABLE-JOB1/smack-im/src/main/java/org/jivesoftware/smack/roster/RosterGroup.java:75: warning: no description for @throws
10-Feb-2019 01:06:33      * @throws XMPPErrorException
10-Feb-2019 01:06:33        ^
10-Feb-2019 01:06:33 /var/atlassian/bamboo-home/xml-data/build-dir/SMACK-NIGHTLYSTABLE-JOB1/smack-im/src/main/java/org/jivesoftware/smack/roster/RosterGroup.java:76: warning: no description for @throws
10-Feb-2019 01:06:33      * @throws NoResponseException
10-Feb-2019 01:06:33        ^
10-Feb-2019 01:06:33 /var/atlassian/bamboo-home/xml-data/build-dir/SMACK-NIGHTLYSTABLE-JOB1/smack-im/src/main/java/org/jivesoftware/smack/roster/RosterGroup.java:77: warning: no description for @throws
10-Feb-2019 01:06:33      * @throws InterruptedException
10-Feb-2019 01:06:33        ^
10-Feb-2019 01:06:33 /var/atlassian/bamboo-home/xml-data/build-dir/SMACK-NIGHTLYSTABLE-JOB1/smack-im/src/main/java/org/jivesoftware/smack/roster/RosterGroup.java:170: warning: no description for @throws
10-Feb-2019 01:06:33      * @throws NotConnectedException
10-Feb-2019 01:06:33        ^
10-Feb-2019 01:06:33 /var/atlassian/bamboo-home/xml-data/build-dir/SMACK-NIGHTLYSTABLE-JOB1/smack-im/src/main/java/org/jivesoftware/smack/roster/RosterGroup.java:171: warning: no description for @throws
10-Feb-2019 01:06:33      * @throws InterruptedException
10-Feb-2019 01:06:33        ^
10-Feb-2019 01:06:33 /var/atlassian/bamboo-home/xml-data/build-dir/SMACK-NIGHTLYSTABLE-JOB1/smack-im/src/main/java/org/jivesoftware/smack/roster/RosterGroup.java:198: warning: no description for @throws
10-Feb-2019 01:06:33      * @throws NotConnectedException
10-Feb-2019 01:06:33        ^
10-Feb-2019 01:06:33 /var/atlassian/bamboo-home/xml-data/build-dir/SMACK-NIGHTLYSTABLE-JOB1/smack-im/src/main/java/org/jivesoftware/smack/roster/RosterGroup.java:199: warning: no description for @throws
10-Feb-2019 01:06:33      * @throws InterruptedException
10-Feb-2019 01:06:33        ^
10-Feb-2019 01:06:33 /var/atlassian/bamboo-home/xml-data/build-dir/SMACK-NIGHTLYSTABLE-JOB1/smack-im/src/main/java/org/jivesoftware/smack/roster/RosterUtil.java:95: warning: no description for @throws
10-Feb-2019 01:06:33      * @throws NotLoggedInException
10-Feb-2019 01:06:33        ^
10-Feb-2019 01:06:33 /var/atlassian/bamboo-home/xml-data/build-dir/SMACK-NIGHTLYSTABLE-JOB1/smack-im/src/main/java/org/jivesoftware/smack/roster/RosterUtil.java:96: warning: no description for @throws
10-Feb-2019 01:06:33      * @throws NotConnectedException
10-Feb-2019 01:06:33        ^
10-Feb-2019 01:06:33 /var/atlassian/bamboo-home/xml-data/build-dir/SMACK-NIGHTLYSTABLE-JOB1/smack-im/src/main/java/org/jivesoftware/smack/roster/RosterUtil.java:97: warning: no description for @throws
10-Feb-2019 01:06:33      * @throws InterruptedException
10-Feb-2019 01:06:33        ^
10-Feb-2019 01:06:33 41 warnings
10-Feb-2019 01:06:34
10-Feb-2019 01:06:34 > Task :smack-im:test
10-Feb-2019 01:06:34 > Task :smack-im:check
10-Feb-2019 01:06:36 > Task :smack-resolver-javax:compileJava
10-Feb-2019 01:06:36 > Task :smack-resolver-javax:processResources NO-SOURCE
10-Feb-2019 01:06:36 > Task :smack-resolver-javax:classes
10-Feb-2019 01:06:36 > Task :smack-resolver-javax:osgiClasses
10-Feb-2019 01:06:36 > Task :smack-resolver-javax:jar
10-Feb-2019 01:06:37 > Task :smack-sasl-javax:compileJava
10-Feb-2019 01:06:37 > Task :smack-sasl-javax:processResources NO-SOURCE
10-Feb-2019 01:06:37 > Task :smack-sasl-javax:classes
10-Feb-2019 01:06:37 > Task :smack-sasl-javax:osgiClasses
10-Feb-2019 01:06:37 > Task :smack-sasl-javax:jar
10-Feb-2019 01:06:39 > Task :smack-java7:compileJava
10-Feb-2019 01:06:39 > Task :smack-java7:processResources NO-SOURCE
10-Feb-2019 01:06:39 > Task :smack-java7:classes
10-Feb-2019 01:06:39 > Task :smack-java7:osgiClasses
10-Feb-2019 01:06:39 > Task :smack-java7:jar
10-Feb-2019 01:06:42 > Task :smack-omemo:compileJava
10-Feb-2019 01:06:42 > Task :smack-omemo:processResources
10-Feb-2019 01:06:42 > Task :smack-omemo:classes
10-Feb-2019 01:06:42 > Task :smack-omemo:osgiClasses
10-Feb-2019 01:06:43 > Task :smack-omemo:jar
10-Feb-2019 01:06:45 > Task :smack-tcp:compileJava
10-Feb-2019 01:06:45 > Task :smack-tcp:processResources
10-Feb-2019 01:06:45 > Task :smack-tcp:classes
10-Feb-2019 01:06:45 > Task :smack-tcp:osgiClasses
10-Feb-2019 01:06:45 > Task :smack-tcp:jar
10-Feb-2019 01:06:47
10-Feb-2019 01:06:47 > Task :smack-integration-test:compileJava FAILED
10-Feb-2019 01:06:47
10-Feb-2019 01:06:47 Deprecated Gradle features were used in this build, making it incompatible with Gradle 6.0.
10-Feb-2019 01:06:47 Use '--warning-mode all' to show the individual deprecation warnings.
10-Feb-2019 01:06:47 See https://docs.gradle.org/5.2/userguide/command_line_interface.html#sec:command_line_warnings
10-Feb-2019 01:06:47 115 actionable tasks: 115 executed
10-Feb-2019 01:06:47 /var/atlassian/bamboo-home/xml-data/build-dir/SMACK-NIGHTLYSTABLE-JOB1/smack-integration-test/src/main/java/org/igniterealtime/smack/inttest/SmackIntegrationTestFramework.java:62: error: package org.junit does not exist
10-Feb-2019 01:06:47 import org.junit.AfterClass;
10-Feb-2019 01:06:47                 ^
10-Feb-2019 01:06:47 /var/atlassian/bamboo-home/xml-data/build-dir/SMACK-NIGHTLYSTABLE-JOB1/smack-integration-test/src/main/java/org/igniterealtime/smack/inttest/SmackIntegrationTestFramework.java:63: error: package org.junit does not exist
10-Feb-2019 01:06:47 import org.junit.BeforeClass;
10-Feb-2019 01:06:47                 ^
10-Feb-2019 01:06:47 /var/atlassian/bamboo-home/xml-data/build-dir/SMACK-NIGHTLYSTABLE-JOB1/smack-integration-test/src/main/java/org/jivesoftware/smackx/chatstate/ChatStateIntegrationTest.java:30: error: package org.junit does not exist
10-Feb-2019 01:06:47 import org.junit.After;
10-Feb-2019 01:06:47                 ^
10-Feb-2019 01:06:47 /var/atlassian/bamboo-home/xml-data/build-dir/SMACK-NIGHTLYSTABLE-JOB1/smack-integration-test/src/main/java/org/jivesoftware/smackx/pubsub/PubSubIntegrationTest.java:19: error: package org.junit does not exist
10-Feb-2019 01:06:47 import static org.junit.Assert.assertEquals;
10-Feb-2019 01:06:47                        ^
10-Feb-2019 01:06:47 /var/atlassian/bamboo-home/xml-data/build-dir/SMACK-NIGHTLYSTABLE-JOB1/smack-integration-test/src/main/java/org/jivesoftware/smackx/pubsub/PubSubIntegrationTest.java:19: error: static import only from classes and interfaces
10-Feb-2019 01:06:47 import static org.junit.Assert.assertEquals;
10-Feb-2019 01:06:47 ^
10-Feb-2019 01:06:47 /var/atlassian/bamboo-home/xml-data/build-dir/SMACK-NIGHTLYSTABLE-JOB1/smack-integration-test/src/main/java/org/jivesoftware/smackx/iot/IoTControlIntegrationTest.java:19: error: package org.junit does not exist
10-Feb-2019 01:06:47 import static org.junit.Assert.assertNotNull;
10-Feb-2019 01:06:47                        ^
10-Feb-2019 01:06:47 /var/atlassian/bamboo-home/xml-data/build-dir/SMACK-NIGHTLYSTABLE-JOB1/smack-integration-test/src/main/java/org/jivesoftware/smackx/iot/IoTControlIntegrationTest.java:19: error: static import only from classes and interfaces
10-Feb-2019 01:06:47 import static org.junit.Assert.assertNotNull;
10-Feb-2019 01:06:47 ^
10-Feb-2019 01:06:47 /var/atlassian/bamboo-home/xml-data/build-dir/SMACK-NIGHTLYSTABLE-JOB1/smack-integration-test/src/main/java/org/jivesoftware/smackx/iot/IoTDataIntegrationTest.java:19: error: package org.junit does not exist
10-Feb-2019 01:06:47 import static org.junit.Assert.assertEquals;
10-Feb-2019 01:06:47                        ^
10-Feb-2019 01:06:47 /var/atlassian/bamboo-home/xml-data/build-dir/SMACK-NIGHTLYSTABLE-JOB1/smack-integration-test/src/main/java/org/jivesoftware/smackx/iot/IoTDataIntegrationTest.java:19: error: static import only from classes and interfaces
10-Feb-2019 01:06:47 import static org.junit.Assert.assertEquals;
10-Feb-2019 01:06:47 ^
10-Feb-2019 01:06:47 /var/atlassian/bamboo-home/xml-data/build-dir/SMACK-NIGHTLYSTABLE-JOB1/smack-integration-test/src/main/java/org/jivesoftware/smackx/iot/IoTDataIntegrationTest.java:20: error: package org.junit does not exist
10-Feb-2019 01:06:47 import static org.junit.Assert.assertTrue;
10-Feb-2019 01:06:47                        ^
10-Feb-2019 01:06:47 /var/atlassian/bamboo-home/xml-data/build-dir/SMACK-NIGHTLYSTABLE-JOB1/smack-integration-test/src/main/java/org/jivesoftware/smackx/iot/IoTDataIntegrationTest.java:20: error: static import only from classes and interfaces
10-Feb-2019 01:06:47 import static org.junit.Assert.assertTrue;
10-Feb-2019 01:06:47 ^
10-Feb-2019 01:06:47 /var/atlassian/bamboo-home/xml-data/build-dir/SMACK-NIGHTLYSTABLE-JOB1/smack-integration-test/src/main/java/org/jivesoftware/smackx/iot/IoTDiscoveryIntegrationTest.java:19: error: package org.junit does not exist
10-Feb-2019 01:06:47 import static org.junit.Assert.assertEquals;
10-Feb-2019 01:06:47                        ^
10-Feb-2019 01:06:47 /var/atlassian/bamboo-home/xml-data/build-dir/SMACK-NIGHTLYSTABLE-JOB1/smack-integration-test/src/main/java/org/jivesoftware/smackx/iot/IoTDiscoveryIntegrationTest.java:19: error: static import only from classes and interfaces
10-Feb-2019 01:06:47 import static org.junit.Assert.assertEquals;
10-Feb-2019 01:06:47 ^
10-Feb-2019 01:06:47 /var/atlassian/bamboo-home/xml-data/build-dir/SMACK-NIGHTLYSTABLE-JOB1/smack-integration-test/src/main/java/org/jivesoftware/smackx/ping/PingIntegrationTest.java:19: error: package org.junit does not exist
10-Feb-2019 01:06:47 import static org.junit.Assert.assertTrue;
10-Feb-2019 01:06:47                        ^
10-Feb-2019 01:06:47 /var/atlassian/bamboo-home/xml-data/build-dir/SMACK-NIGHTLYSTABLE-JOB1/smack-integration-test/src/main/java/org/jivesoftware/smackx/ping/PingIntegrationTest.java:19: error: static import only from classes and interfaces
10-Feb-2019 01:06:47 import static org.junit.Assert.assertTrue;
10-Feb-2019 01:06:47 ^
10-Feb-2019 01:06:47 /var/atlassian/bamboo-home/xml-data/build-dir/SMACK-NIGHTLYSTABLE-JOB1/smack-integration-test/src/main/java/org/jivesoftware/smackx/muc/MultiUserChatIntegrationTest.java:19: error: package org.junit does not exist
10-Feb-2019 01:06:47 import static org.junit.Assert.assertNotNull;
10-Feb-2019 01:06:47                        ^
10-Feb-2019 01:06:47 /var/atlassian/bamboo-home/xml-data/build-dir/SMACK-NIGHTLYSTABLE-JOB1/smack-integration-test/src/main/java/org/jivesoftware/smackx/muc/MultiUserChatIntegrationTest.java:19: error: static import only from classes and interfaces
10-Feb-2019 01:06:47 import static org.junit.Assert.assertNotNull;
10-Feb-2019 01:06:47 ^
10-Feb-2019 01:06:47 /var/atlassian/bamboo-home/xml-data/build-dir/SMACK-NIGHTLYSTABLE-JOB1/smack-integration-test/src/main/java/org/jivesoftware/smackx/muc/MultiUserChatIntegrationTest.java:20: error: package org.junit does not exist
10-Feb-2019 01:06:47 import static org.junit.Assert.assertTrue;
10-Feb-2019 01:06:47                        ^
10-Feb-2019 01:06:47 /var/atlassian/bamboo-home/xml-data/build-dir/SMACK-NIGHTLYSTABLE-JOB1/smack-integration-test/src/main/java/org/jivesoftware/smackx/muc/MultiUserChatIntegrationTest.java:20: error: static import only from classes and interfaces
10-Feb-2019 01:06:47 import static org.junit.Assert.assertTrue;
10-Feb-2019 01:06:47 ^
10-Feb-2019 01:06:47 /var/atlassian/bamboo-home/xml-data/build-dir/SMACK-NIGHTLYSTABLE-JOB1/smack-integration-test/src/main/java/org/jivesoftware/smackx/muc/MultiUserChatLowLevelIntegrationTest.java:19: error: package org.junit does not exist
10-Feb-2019 01:06:47 import static org.junit.Assert.assertTrue;
10-Feb-2019 01:06:47                        ^
10-Feb-2019 01:06:47 /var/atlassian/bamboo-home/xml-data/build-dir/SMACK-NIGHTLYSTABLE-JOB1/smack-integration-test/src/main/java/org/jivesoftware/smackx/muc/MultiUserChatLowLevelIntegrationTest.java:19: error: static import only from classes and interfaces
10-Feb-2019 01:06:47 import static org.junit.Assert.assertTrue;
10-Feb-2019 01:06:47 ^
10-Feb-2019 01:06:47 /var/atlassian/bamboo-home/xml-data/build-dir/SMACK-NIGHTLYSTABLE-JOB1/smack-integration-test/src/main/java/org/jivesoftware/smackx/omemo/OmemoMessageSendingTest.java:19: error: package junit.framework does not exist
10-Feb-2019 01:06:47 import static junit.framework.TestCase.assertEquals;
10-Feb-2019 01:06:47                              ^
10-Feb-2019 01:06:47 /var/atlassian/bamboo-home/xml-data/build-dir/SMACK-NIGHTLYSTABLE-JOB1/smack-integration-test/src/main/java/org/jivesoftware/smackx/omemo/OmemoMessageSendingTest.java:19: error: static import only from classes and interfaces
10-Feb-2019 01:06:47 import static junit.framework.TestCase.assertEquals;
10-Feb-2019 01:06:47 ^
10-Feb-2019 01:06:47 /var/atlassian/bamboo-home/xml-data/build-dir/SMACK-NIGHTLYSTABLE-JOB1/smack-integration-test/src/main/java/org/jivesoftware/smackx/omemo/OmemoMessageSendingTest.java:20: error: package junit.framework does not exist
10-Feb-2019 01:06:47 import static junit.framework.TestCase.assertNotSame;
10-Feb-2019 01:06:47                              ^
10-Feb-2019 01:06:47 /var/atlassian/bamboo-home/xml-data/build-dir/SMACK-NIGHTLYSTABLE-JOB1/smack-integration-test/src/main/java/org/jivesoftware/smackx/omemo/OmemoMessageSendingTest.java:20: error: static import only from classes and interfaces
10-Feb-2019 01:06:47 import static junit.framework.TestCase.assertNotSame;
10-Feb-2019 01:06:47 ^
10-Feb-2019 01:06:47 /var/atlassian/bamboo-home/xml-data/build-dir/SMACK-NIGHTLYSTABLE-JOB1/smack-integration-test/src/main/java/org/jivesoftware/smackx/omemo/OmemoIntegrationTestHelper.java:19: error: package junit.framework does not exist
10-Feb-2019 01:06:47 import static junit.framework.TestCase.assertEquals;
10-Feb-2019 01:06:47                              ^
10-Feb-2019 01:06:47 /var/atlassian/bamboo-home/xml-data/build-dir/SMACK-NIGHTLYSTABLE-JOB1/smack-integration-test/src/main/java/org/jivesoftware/smackx/omemo/OmemoIntegrationTestHelper.java:19: error: static import only from classes and interfaces
10-Feb-2019 01:06:47 import static junit.framework.TestCase.assertEquals;
10-Feb-2019 01:06:47 ^
10-Feb-2019 01:06:47 /var/atlassian/bamboo-home/xml-data/build-dir/SMACK-NIGHTLYSTABLE-JOB1/smack-integration-test/src/main/java/org/jivesoftware/smackx/omemo/OmemoIntegrationTestHelper.java:20: error: package junit.framework does not exist
10-Feb-2019 01:06:47 import static junit.framework.TestCase.assertNotNull;
10-Feb-2019 01:06:47                              ^
10-Feb-2019 01:06:47 /var/atlassian/bamboo-home/xml-data/build-dir/SMACK-NIGHTLYSTABLE-JOB1/smack-integration-test/src/main/java/org/jivesoftware/smackx/omemo/OmemoIntegrationTestHelper.java:20: error: static import only from classes and interfaces
10-Feb-2019 01:06:47 import static junit.framework.TestCase.assertNotNull;
10-Feb-2019 01:06:47 ^
10-Feb-2019 01:06:47 /var/atlassian/bamboo-home/xml-data/build-dir/SMACK-NIGHTLYSTABLE-JOB1/smack-integration-test/src/main/java/org/jivesoftware/smackx/omemo/OmemoIntegrationTestHelper.java:21: error: package junit.framework does not exist
10-Feb-2019 01:06:47 import static junit.framework.TestCase.assertTrue;
10-Feb-2019 01:06:47                              ^
10-Feb-2019 01:06:47 /var/atlassian/bamboo-home/xml-data/build-dir/SMACK-NIGHTLYSTABLE-JOB1/smack-integration-test/src/main/java/org/jivesoftware/smackx/omemo/OmemoIntegrationTestHelper.java:21: error: static import only from classes and interfaces
10-Feb-2019 01:06:47 import static junit.framework.TestCase.assertTrue;
10-Feb-2019 01:06:47 ^
10-Feb-2019 01:06:47 /var/atlassian/bamboo-home/xml-data/build-dir/SMACK-NIGHTLYSTABLE-JOB1/smack-integration-test/src/main/java/org/jivesoftware/smackx/omemo/OmemoMessageSendingTest.java:45: error: package junit.framework does not exist
10-Feb-2019 01:06:47 import junit.framework.TestCase;
10-Feb-2019 01:06:47                       ^
10-Feb-2019 01:06:47 /var/atlassian/bamboo-home/xml-data/build-dir/SMACK-NIGHTLYSTABLE-JOB1/smack-integration-test/src/main/java/org/jivesoftware/smackx/omemo/AbstractOmemoIntegrationTest.java:28: error: package org.junit does not exist
10-Feb-2019 01:06:47 import org.junit.AfterClass;
10-Feb-2019 01:06:47                 ^
10-Feb-2019 01:06:47 /var/atlassian/bamboo-home/xml-data/build-dir/SMACK-NIGHTLYSTABLE-JOB1/smack-integration-test/src/main/java/org/jivesoftware/smackx/omemo/AbstractOmemoIntegrationTest.java:29: error: package org.junit does not exist
10-Feb-2019 01:06:47 import org.junit.BeforeClass;
10-Feb-2019 01:06:47                 ^
10-Feb-2019 01:06:47 /var/atlassian/bamboo-home/xml-data/build-dir/SMACK-NIGHTLYSTABLE-JOB1/smack-integration-test/src/main/java/org/jivesoftware/smackx/omemo/OmemoInitializationTest.java:19: error: package junit.framework does not exist
10-Feb-2019 01:06:47 import static junit.framework.TestCase.assertNotNull;
10-Feb-2019 01:06:47                              ^
10-Feb-2019 01:06:47 /var/atlassian/bamboo-home/xml-data/build-dir/SMACK-NIGHTLYSTABLE-JOB1/smack-integration-test/src/main/java/org/jivesoftware/smackx/omemo/OmemoInitializationTest.java:19: error: static import only from classes and interfaces
10-Feb-2019 01:06:47 import static junit.framework.TestCase.assertNotNull;
10-Feb-2019 01:06:47 ^
10-Feb-2019 01:06:47 /var/atlassian/bamboo-home/xml-data/build-dir/SMACK-NIGHTLYSTABLE-JOB1/smack-integration-test/src/main/java/org/jivesoftware/smackx/omemo/OmemoInitializationTest.java:20: error: package junit.framework does not exist
10-Feb-2019 01:06:47 import static junit.framework.TestCase.assertTrue;
10-Feb-2019 01:06:47                              ^
10-Feb-2019 01:06:47 /var/atlassian/bamboo-home/xml-data/build-dir/SMACK-NIGHTLYSTABLE-JOB1/smack-integration-test/src/main/java/org/jivesoftware/smackx/omemo/OmemoInitializationTest.java:20: error: static import only from classes and interfaces
10-Feb-2019 01:06:47 import static junit.framework.TestCase.assertTrue;
10-Feb-2019 01:06:47 ^
10-Feb-2019 01:06:47 /var/atlassian/bamboo-home/xml-data/build-dir/SMACK-NIGHTLYSTABLE-JOB1/smack-integration-test/src/main/java/org/jivesoftware/smackx/omemo/OmemoStoreTest.java:19: error: package junit.framework does not exist
10-Feb-2019 01:06:47 import static junit.framework.TestCase.assertEquals;
10-Feb-2019 01:06:47                              ^
10-Feb-2019 01:06:47 /var/atlassian/bamboo-home/xml-data/build-dir/SMACK-NIGHTLYSTABLE-JOB1/smack-integration-test/src/main/java/org/jivesoftware/smackx/omemo/OmemoStoreTest.java:19: error: static import only from classes and interfaces
10-Feb-2019 01:06:47 import static junit.framework.TestCase.assertEquals;
10-Feb-2019 01:06:47 ^
10-Feb-2019 01:06:47 /var/atlassian/bamboo-home/xml-data/build-dir/SMACK-NIGHTLYSTABLE-JOB1/smack-integration-test/src/main/java/org/jivesoftware/smackx/omemo/OmemoStoreTest.java:20: error: package junit.framework does not exist
10-Feb-2019 01:06:47 import static junit.framework.TestCase.assertFalse;
10-Feb-2019 01:06:47                              ^
10-Feb-2019 01:06:47 /var/atlassian/bamboo-home/xml-data/build-dir/SMACK-NIGHTLYSTABLE-JOB1/smack-integration-test/src/main/java/org/jivesoftware/smackx/omemo/OmemoStoreTest.java:20: error: static import only from classes and interfaces
10-Feb-2019 01:06:47 import static junit.framework.TestCase.assertFalse;
10-Feb-2019 01:06:47 ^
10-Feb-2019 01:06:47 /var/atlassian/bamboo-home/xml-data/build-dir/SMACK-NIGHTLYSTABLE-JOB1/smack-integration-test/src/main/java/org/jivesoftware/smackx/omemo/OmemoStoreTest.java:21: error: package junit.framework does not exist
10-Feb-2019 01:06:47 import static junit.framework.TestCase.assertNotNull;
10-Feb-2019 01:06:47                              ^
10-Feb-2019 01:06:47 /var/atlassian/bamboo-home/xml-data/build-dir/SMACK-NIGHTLYSTABLE-JOB1/smack-integration-test/src/main/java/org/jivesoftware/smackx/omemo/OmemoStoreTest.java:21: error: static import only from classes and interfaces
10-Feb-2019 01:06:47 import static junit.framework.TestCase.assertNotNull;
10-Feb-2019 01:06:47 ^
10-Feb-2019 01:06:47 /var/atlassian/bamboo-home/xml-data/build-dir/SMACK-NIGHTLYSTABLE-JOB1/smack-integration-test/src/main/java/org/jivesoftware/smackx/omemo/OmemoStoreTest.java:22: error: package junit.framework does not exist
10-Feb-2019 01:06:47 import static junit.framework.TestCase.assertNotSame;
10-Feb-2019 01:06:47                              ^
10-Feb-2019 01:06:47 /var/atlassian/bamboo-home/xml-data/build-dir/SMACK-NIGHTLYSTABLE-JOB1/smack-integration-test/src/main/java/org/jivesoftware/smackx/omemo/OmemoStoreTest.java:22: error: static import only from classes and interfaces
10-Feb-2019 01:06:47 import static junit.framework.TestCase.assertNotSame;
10-Feb-2019 01:06:47 ^
10-Feb-2019 01:06:47 /var/atlassian/bamboo-home/xml-data/build-dir/SMACK-NIGHTLYSTABLE-JOB1/smack-integration-test/src/main/java/org/jivesoftware/smackx/omemo/OmemoStoreTest.java:23: error: package junit.framework does not exist
10-Feb-2019 01:06:47 import static junit.framework.TestCase.assertNull;
10-Feb-2019 01:06:47                              ^
10-Feb-2019 01:06:47 /var/atlassian/bamboo-home/xml-data/build-dir/SMACK-NIGHTLYSTABLE-JOB1/smack-integration-test/src/main/java/org/jivesoftware/smackx/omemo/OmemoStoreTest.java:23: error: static import only from classes and interfaces
10-Feb-2019 01:06:47 import static junit.framework.TestCase.assertNull;
10-Feb-2019 01:06:47 ^
10-Feb-2019 01:06:47 /var/atlassian/bamboo-home/xml-data/build-dir/SMACK-NIGHTLYSTABLE-JOB1/smack-integration-test/src/main/java/org/jivesoftware/smackx/omemo/OmemoStoreTest.java:24: error: package junit.framework does not exist
10-Feb-2019 01:06:47 import static junit.framework.TestCase.assertTrue;
10-Feb-2019 01:06:47                              ^
10-Feb-2019 01:06:47 /var/atlassian/bamboo-home/xml-data/build-dir/SMACK-NIGHTLYSTABLE-JOB1/smack-integration-test/src/main/java/org/jivesoftware/smackx/omemo/OmemoStoreTest.java:24: error: static import only from classes and interfaces
10-Feb-2019 01:06:47 import static junit.framework.TestCase.assertTrue;
10-Feb-2019 01:06:47 ^
10-Feb-2019 01:06:47 /var/atlassian/bamboo-home/xml-data/build-dir/SMACK-NIGHTLYSTABLE-JOB1/smack-integration-test/src/main/java/org/jivesoftware/smackx/omemo/OmemoSessionRenegotiationTest.java:19: error: package junit.framework does not exist
10-Feb-2019 01:06:47 import static junit.framework.TestCase.assertEquals;
10-Feb-2019 01:06:47                              ^
10-Feb-2019 01:06:47 /var/atlassian/bamboo-home/xml-data/build-dir/SMACK-NIGHTLYSTABLE-JOB1/smack-integration-test/src/main/java/org/jivesoftware/smackx/omemo/OmemoSessionRenegotiationTest.java:19: error: static import only from classes and interfaces
10-Feb-2019 01:06:47 import static junit.framework.TestCase.assertEquals;
10-Feb-2019 01:06:47 ^
10-Feb-2019 01:06:47 /var/atlassian/bamboo-home/xml-data/build-dir/SMACK-NIGHTLYSTABLE-JOB1/smack-integration-test/src/main/java/org/jivesoftware/smackx/omemo/OmemoSessionRenegotiationTest.java:20: error: package junit.framework does not exist
10-Feb-2019 01:06:47 import static junit.framework.TestCase.fail;
10-Feb-2019 01:06:47                              ^
10-Feb-2019 01:06:47 /var/atlassian/bamboo-home/xml-data/build-dir/SMACK-NIGHTLYSTABLE-JOB1/smack-integration-test/src/main/java/org/jivesoftware/smackx/omemo/OmemoSessionRenegotiationTest.java:20: error: static import only from classes and interfaces
10-Feb-2019 01:06:47 import static junit.framework.TestCase.fail;
10-Feb-2019 01:06:47 ^
10-Feb-2019 01:06:47 /var/atlassian/bamboo-home/xml-data/build-dir/SMACK-NIGHTLYSTABLE-JOB1/smack-integration-test/src/main/java/org/jivesoftware/smackx/omemo/OmemoKeyTransportTest.java:23: error: package org.junit does not exist
10-Feb-2019 01:06:47 import static org.junit.Assert.assertTrue;
10-Feb-2019 01:06:47                        ^
10-Feb-2019 01:06:47 /var/atlassian/bamboo-home/xml-data/build-dir/SMACK-NIGHTLYSTABLE-JOB1/smack-integration-test/src/main/java/org/jivesoftware/smackx/omemo/OmemoKeyTransportTest.java:23: error: static import only from classes and interfaces
10-Feb-2019 01:06:47 import static org.junit.Assert.assertTrue;
10-Feb-2019 01:06:47 ^
10-Feb-2019 01:06:47 /var/atlassian/bamboo-home/xml-data/build-dir/SMACK-NIGHTLYSTABLE-JOB1/smack-integration-test/src/main/java/org/jivesoftware/smackx/xdata/FormTest.java:20: error: package org.junit does not exist
10-Feb-2019 01:06:47 import static org.junit.Assert.assertEquals;
10-Feb-2019 01:06:47                        ^
10-Feb-2019 01:06:47 /var/atlassian/bamboo-home/xml-data/build-dir/SMACK-NIGHTLYSTABLE-JOB1/smack-integration-test/src/main/java/org/jivesoftware/smackx/xdata/FormTest.java:20: error: static import only from classes and interfaces
10-Feb-2019 01:06:47 import static org.junit.Assert.assertEquals;
10-Feb-2019 01:06:47 ^
10-Feb-2019 01:06:47 /var/atlassian/bamboo-home/xml-data/build-dir/SMACK-NIGHTLYSTABLE-JOB1/smack-integration-test/src/main/java/org/jivesoftware/smackx/xdata/FormTest.java:21: error: package org.junit does not exist
10-Feb-2019 01:06:47 import static org.junit.Assert.assertNotNull;
10-Feb-2019 01:06:47                        ^
10-Feb-2019 01:06:47 /var/atlassian/bamboo-home/xml-data/build-dir/SMACK-NIGHTLYSTABLE-JOB1/smack-integration-test/src/main/java/org/jivesoftware/smackx/xdata/FormTest.java:21: error: static import only from classes and interfaces
10-Feb-2019 01:06:47 import static org.junit.Assert.assertNotNull;
10-Feb-2019 01:06:47 ^
10-Feb-2019 01:06:47 /var/atlassian/bamboo-home/xml-data/build-dir/SMACK-NIGHTLYSTABLE-JOB1/smack-integration-test/src/main/java/org/jivesoftware/smackx/xdata/FormTest.java:22: error: package org.junit does not exist
10-Feb-2019 01:06:47 import static org.junit.Assert.fail;
10-Feb-2019 01:06:47                        ^
10-Feb-2019 01:06:47 /var/atlassian/bamboo-home/xml-data/build-dir/SMACK-NIGHTLYSTABLE-JOB1/smack-integration-test/src/main/java/org/jivesoftware/smackx/xdata/FormTest.java:22: error: static import only from classes and interfaces
10-Feb-2019 01:06:47 import static org.junit.Assert.fail;
10-Feb-2019 01:06:47 ^
10-Feb-2019 01:06:47 /var/atlassian/bamboo-home/xml-data/build-dir/SMACK-NIGHTLYSTABLE-JOB1/smack-integration-test/src/main/java/org/jivesoftware/smackx/httpfileupload/HttpFileUploadIntegrationTest.java:19: error: package org.junit does not exist
10-Feb-2019 01:06:47 import static org.junit.Assert.assertArrayEquals;
10-Feb-2019 01:06:47                        ^
10-Feb-2019 01:06:47 /var/atlassian/bamboo-home/xml-data/build-dir/SMACK-NIGHTLYSTABLE-JOB1/smack-integration-test/src/main/java/org/jivesoftware/smackx/httpfileupload/HttpFileUploadIntegrationTest.java:19: error: static import only from classes and interfaces
10-Feb-2019 01:06:47 import static org.junit.Assert.assertArrayEquals;
10-Feb-2019 01:06:47 ^
10-Feb-2019 01:06:47 /var/atlassian/bamboo-home/xml-data/build-dir/SMACK-NIGHTLYSTABLE-JOB1/smack-integration-test/src/main/java/org/jivesoftware/smackx/mam/MamIntegrationTest.java:19: error: package org.junit does not exist
10-Feb-2019 01:06:47 import static org.junit.Assert.assertEquals;
10-Feb-2019 01:06:47                        ^
10-Feb-2019 01:06:47 /var/atlassian/bamboo-home/xml-data/build-dir/SMACK-NIGHTLYSTABLE-JOB1/smack-integration-test/src/main/java/org/jivesoftware/smackx/mam/MamIntegrationTest.java:19: error: static import only from classes and interfaces
10-Feb-2019 01:06:47 import static org.junit.Assert.assertEquals;
10-Feb-2019 01:06:47 ^
10-Feb-2019 01:06:47 /var/atlassian/bamboo-home/xml-data/build-dir/SMACK-NIGHTLYSTABLE-JOB1/smack-integration-test/src/main/java/org/jivesoftware/smackx/mam/MamIntegrationTest.java:20: error: package org.junit does not exist
10-Feb-2019 01:06:47 import static org.junit.Assert.assertFalse;
10-Feb-2019 01:06:47                        ^
10-Feb-2019 01:06:47 /var/atlassian/bamboo-home/xml-data/build-dir/SMACK-NIGHTLYSTABLE-JOB1/smack-integration-test/src/main/java/org/jivesoftware/smackx/mam/MamIntegrationTest.java:20: error: static import only from classes and interfaces
10-Feb-2019 01:06:47 import static org.junit.Assert.assertFalse;
10-Feb-2019 01:06:47 ^
10-Feb-2019 01:06:47 /var/atlassian/bamboo-home/xml-data/build-dir/SMACK-NIGHTLYSTABLE-JOB1/smack-integration-test/src/main/java/org/jivesoftware/smackx/mam/MamIntegrationTest.java:21: error: package org.junit does not exist
10-Feb-2019 01:06:47 import static org.junit.Assert.assertTrue;
10-Feb-2019 01:06:47                        ^
10-Feb-2019 01:06:47 /var/atlassian/bamboo-home/xml-data/build-dir/SMACK-NIGHTLYSTABLE-JOB1/smack-integration-test/src/main/java/org/jivesoftware/smackx/mam/MamIntegrationTest.java:21: error: static import only from classes and interfaces
10-Feb-2019 01:06:47 import static org.junit.Assert.assertTrue;
10-Feb-2019 01:06:47 ^
10-Feb-2019 01:06:47 /var/atlassian/bamboo-home/xml-data/build-dir/SMACK-NIGHTLYSTABLE-JOB1/smack-integration-test/src/main/java/org/jivesoftware/smackx/caps/EntityCapsTest.java:19: error: package org.junit does not exist
10-Feb-2019 01:06:47 import static org.junit.Assert.assertEquals;
10-Feb-2019 01:06:47                        ^
10-Feb-2019 01:06:47 /var/atlassian/bamboo-home/xml-data/build-dir/SMACK-NIGHTLYSTABLE-JOB1/smack-integration-test/src/main/java/org/jivesoftware/smackx/caps/EntityCapsTest.java:19: error: static import only from classes and interfaces
10-Feb-2019 01:06:47 import static org.junit.Assert.assertEquals;
10-Feb-2019 01:06:47 ^
10-Feb-2019 01:06:47 /var/atlassian/bamboo-home/xml-data/build-dir/SMACK-NIGHTLYSTABLE-JOB1/smack-integration-test/src/main/java/org/jivesoftware/smackx/caps/EntityCapsTest.java:20: error: package org.junit does not exist
10-Feb-2019 01:06:47 import static org.junit.Assert.assertFalse;
10-Feb-2019 01:06:47                        ^
10-Feb-2019 01:06:47 /var/atlassian/bamboo-home/xml-data/build-dir/SMACK-NIGHTLYSTABLE-JOB1/smack-integration-test/src/main/java/org/jivesoftware/smackx/caps/EntityCapsTest.java:20: error: static import only from classes and interfaces
10-Feb-2019 01:06:47 import static org.junit.Assert.assertFalse;
10-Feb-2019 01:06:47 ^
10-Feb-2019 01:06:47 /var/atlassian/bamboo-home/xml-data/build-dir/SMACK-NIGHTLYSTABLE-JOB1/smack-integration-test/src/main/java/org/jivesoftware/smackx/caps/EntityCapsTest.java:21: error: package org.junit does not exist
10-Feb-2019 01:06:47 import static org.junit.Assert.assertNotNull;
10-Feb-2019 01:06:47                        ^
10-Feb-2019 01:06:47 /var/atlassian/bamboo-home/xml-data/build-dir/SMACK-NIGHTLYSTABLE-JOB1/smack-integration-test/src/main/java/org/jivesoftware/smackx/caps/EntityCapsTest.java:21: error: static import only from classes and interfaces
10-Feb-2019 01:06:47 import static org.junit.Assert.assertNotNull;
10-Feb-2019 01:06:47 ^
10-Feb-2019 01:06:47 /var/atlassian/bamboo-home/xml-data/build-dir/SMACK-NIGHTLYSTABLE-JOB1/smack-integration-test/src/main/java/org/jivesoftware/smackx/caps/EntityCapsTest.java:22: error: package org.junit does not exist
10-Feb-2019 01:06:47 import static org.junit.Assert.assertTrue;
10-Feb-2019 01:06:47                        ^
10-Feb-2019 01:06:47 /var/atlassian/bamboo-home/xml-data/build-dir/SMACK-NIGHTLYSTABLE-JOB1/smack-integration-test/src/main/java/org/jivesoftware/smackx/caps/EntityCapsTest.java:22: error: static import only from classes and interfaces
10-Feb-2019 01:06:47 import static org.junit.Assert.assertTrue;
10-Feb-2019 01:06:47 ^
10-Feb-2019 01:06:47 /var/atlassian/bamboo-home/xml-data/build-dir/SMACK-NIGHTLYSTABLE-JOB1/smack-integration-test/src/main/java/org/jivesoftware/smackx/caps/EntityCapsTest.java:51: error: package org.junit does not exist
10-Feb-2019 01:06:47 import org.junit.AfterClass;
10-Feb-2019 01:06:47                 ^
10-Feb-2019 01:06:47 /var/atlassian/bamboo-home/xml-data/build-dir/SMACK-NIGHTLYSTABLE-JOB1/smack-integration-test/src/main/java/org/jivesoftware/smackx/caps/EntityCapsTest.java:52: error: package org.junit does not exist
10-Feb-2019 01:06:47 import org.junit.BeforeClass;
10-Feb-2019 01:06:47                 ^
10-Feb-2019 01:06:47 /var/atlassian/bamboo-home/xml-data/build-dir/SMACK-NIGHTLYSTABLE-JOB1/smack-integration-test/src/main/java/org/jivesoftware/smackx/iqversion/VersionIntegrationTest.java:19: error: package org.junit does not exist
10-Feb-2019 01:06:47 import static org.junit.Assert.assertEquals;
10-Feb-2019 01:06:47                        ^
10-Feb-2019 01:06:47 /var/atlassian/bamboo-home/xml-data/build-dir/SMACK-NIGHTLYSTABLE-JOB1/smack-integration-test/src/main/java/org/jivesoftware/smackx/iqversion/VersionIntegrationTest.java:19: error: static import only from classes and interfaces
10-Feb-2019 01:06:47 import static org.junit.Assert.assertEquals;
10-Feb-2019 01:06:47 ^
10-Feb-2019 01:06:47 /var/atlassian/bamboo-home/xml-data/build-dir/SMACK-NIGHTLYSTABLE-JOB1/smack-integration-test/src/main/java/org/jivesoftware/smackx/iqversion/VersionIntegrationTest.java:20: error: package org.junit does not exist
10-Feb-2019 01:06:47 import static org.junit.Assert.assertTrue;
10-Feb-2019 01:06:47                        ^
10-Feb-2019 01:06:47 /var/atlassian/bamboo-home/xml-data/build-dir/SMACK-NIGHTLYSTABLE-JOB1/smack-integration-test/src/main/java/org/jivesoftware/smackx/iqversion/VersionIntegrationTest.java:20: error: static import only from classes and interfaces
10-Feb-2019 01:06:47 import static org.junit.Assert.assertTrue;
10-Feb-2019 01:06:47 ^
10-Feb-2019 01:06:47 /var/atlassian/bamboo-home/xml-data/build-dir/SMACK-NIGHTLYSTABLE-JOB1/smack-integration-test/src/main/java/org/jivesoftware/smack/StreamManagementTest.java:19: error: package org.junit does not exist
10-Feb-2019 01:06:47 import static org.junit.Assert.assertEquals;
10-Feb-2019 01:06:47                        ^
10-Feb-2019 01:06:47 /var/atlassian/bamboo-home/xml-data/build-dir/SMACK-NIGHTLYSTABLE-JOB1/smack-integration-test/src/main/java/org/jivesoftware/smack/StreamManagementTest.java:19: error: static import only from classes and interfaces
10-Feb-2019 01:06:47 import static org.junit.Assert.assertEquals;
10-Feb-2019 01:06:47 ^
10-Feb-2019 01:06:47 /var/atlassian/bamboo-home/xml-data/build-dir/SMACK-NIGHTLYSTABLE-JOB1/smack-integration-test/src/main/java/org/jivesoftware/smack/StreamManagementTest.java:20: error: package org.junit does not exist
10-Feb-2019 01:06:47 import static org.junit.Assert.assertNotNull;
10-Feb-2019 01:06:47                        ^
10-Feb-2019 01:06:47 /var/atlassian/bamboo-home/xml-data/build-dir/SMACK-NIGHTLYSTABLE-JOB1/smack-integration-test/src/main/java/org/jivesoftware/smack/StreamManagementTest.java:20: error: static import only from classes and interfaces
10-Feb-2019 01:06:47 import static org.junit.Assert.assertNotNull;
10-Feb-2019 01:06:47 ^
10-Feb-2019 01:06:47 /var/atlassian/bamboo-home/xml-data/build-dir/SMACK-NIGHTLYSTABLE-JOB1/smack-integration-test/src/main/java/org/jivesoftware/smack/LoginIntegrationTest.java:19: error: package org.junit does not exist
10-Feb-2019 01:06:47 import static org.junit.Assert.assertEquals;
10-Feb-2019 01:06:47                        ^
10-Feb-2019 01:06:47 /var/atlassian/bamboo-home/xml-data/build-dir/SMACK-NIGHTLYSTABLE-JOB1/smack-integration-test/src/main/java/org/jivesoftware/smack/LoginIntegrationTest.java:19: error: static import only from classes and interfaces
10-Feb-2019 01:06:47 import static org.junit.Assert.assertEquals;
10-Feb-2019 01:06:47 ^
10-Feb-2019 01:06:47 /var/atlassian/bamboo-home/xml-data/build-dir/SMACK-NIGHTLYSTABLE-JOB1/smack-integration-test/src/main/java/org/jivesoftware/smack/LoginIntegrationTest.java:20: error: package org.junit does not exist
10-Feb-2019 01:06:47 import static org.junit.Assert.fail;
10-Feb-2019 01:06:47                        ^
10-Feb-2019 01:06:47 /var/atlassian/bamboo-home/xml-data/build-dir/SMACK-NIGHTLYSTABLE-JOB1/smack-integration-test/src/main/java/org/jivesoftware/smack/LoginIntegrationTest.java:20: error: static import only from classes and interfaces
10-Feb-2019 01:06:47 import static org.junit.Assert.fail;
10-Feb-2019 01:06:47 ^
10-Feb-2019 01:06:47 /var/atlassian/bamboo-home/xml-data/build-dir/SMACK-NIGHTLYSTABLE-JOB1/smack-integration-test/src/main/java/org/jivesoftware/smack/ChatTest.java:22: error: package org.junit does not exist
10-Feb-2019 01:06:47 import static org.junit.Assert.assertEquals;
10-Feb-2019 01:06:47                        ^
10-Feb-2019 01:06:47 /var/atlassian/bamboo-home/xml-data/build-dir/SMACK-NIGHTLYSTABLE-JOB1/smack-integration-test/src/main/java/org/jivesoftware/smack/ChatTest.java:22: error: static import only from classes and interfaces
10-Feb-2019 01:06:47 import static org.junit.Assert.assertEquals;
10-Feb-2019 01:06:47 ^
10-Feb-2019 01:06:47 /var/atlassian/bamboo-home/xml-data/build-dir/SMACK-NIGHTLYSTABLE-JOB1/smack-integration-test/src/main/java/org/jivesoftware/smack/ChatTest.java:23: error: package org.junit does not exist
10-Feb-2019 01:06:47 import static org.junit.Assert.assertNotNull;
10-Feb-2019 01:06:47                        ^
10-Feb-2019 01:06:47 /var/atlassian/bamboo-home/xml-data/build-dir/SMACK-NIGHTLYSTABLE-JOB1/smack-integration-test/src/main/java/org/jivesoftware/smack/ChatTest.java:23: error: static import only from classes and interfaces
10-Feb-2019 01:06:47 import static org.junit.Assert.assertNotNull;
10-Feb-2019 01:06:47 ^
10-Feb-2019 01:06:47 /var/atlassian/bamboo-home/xml-data/build-dir/SMACK-NIGHTLYSTABLE-JOB1/smack-integration-test/src/main/java/org/jivesoftware/smack/ChatTest.java:24: error: package org.junit does not exist
10-Feb-2019 01:06:47 import static org.junit.Assert.assertTrue;
10-Feb-2019 01:06:47                        ^
10-Feb-2019 01:06:47 /var/atlassian/bamboo-home/xml-data/build-dir/SMACK-NIGHTLYSTABLE-JOB1/smack-integration-test/src/main/java/org/jivesoftware/smack/ChatTest.java:24: error: static import only from classes and interfaces
10-Feb-2019 01:06:47 import static org.junit.Assert.assertTrue;
10-Feb-2019 01:06:47 ^
10-Feb-2019 01:06:47 /var/atlassian/bamboo-home/xml-data/build-dir/SMACK-NIGHTLYSTABLE-JOB1/smack-integration-test/src/main/java/org/jivesoftware/smack/ChatTest.java:36: error: package org.junit does not exist
10-Feb-2019 01:06:47 import org.junit.AfterClass;
10-Feb-2019 01:06:47                 ^
10-Feb-2019 01:06:47 /var/atlassian/bamboo-home/xml-data/build-dir/SMACK-NIGHTLYSTABLE-JOB1/smack-integration-test/src/main/java/org/jivesoftware/smack/ChatTest.java:37: error: package org.junit does not exist
10-Feb-2019 01:06:47 import org.junit.BeforeClass;
10-Feb-2019 01:06:47                 ^
10-Feb-2019 01:06:47 100 errors
10-Feb-2019 01:06:47
10-Feb-2019 01:06:47 FAILURE: Build failed with an exception.
10-Feb-2019 01:06:47
10-Feb-2019 01:06:47 * What went wrong:
10-Feb-2019 01:06:47 Execution failed for task ':smack-integration-test:compileJava'.
10-Feb-2019 01:06:47 > Compilation failed with exit code 1; see the compiler error output for details.
10-Feb-2019 01:06:47
10-Feb-2019 01:06:47 * Try:
10-Feb-2019 01:06:47 Run with --info or --debug option to get more log output. Run with --scan to get full insights.
10-Feb-2019 01:06:47
10-Feb-2019 01:06:47 * Exception is:
10-Feb-2019 01:06:47 org.gradle.api.tasks.TaskExecutionException: Execution failed for task ':smack-integration-test:compileJava'.
10-Feb-2019 01:06:47         at org.gradle.api.internal.tasks.execution.ExecuteActionsTaskExecuter$2.accept(ExecuteActionsTaskExecuter.java:121)
10-Feb-2019 01:06:47         at org.gradle.api.internal.tasks.execution.ExecuteActionsTaskExecuter$2.accept(ExecuteActionsTaskExecuter.java:117)
10-Feb-2019 01:06:47         at org.gradle.internal.Try$Failure.ifSuccessfulOrElse(Try.java:184)
10-Feb-2019 01:06:47         at org.gradle.api.internal.tasks.execution.ExecuteActionsTaskExecuter.execute(ExecuteActionsTaskExecuter.java:110)
10-Feb-2019 01:06:47         at org.gradle.api.internal.tasks.execution.ResolveIncrementalChangesTaskExecuter.execute(ResolveIncrementalChangesTaskExecuter.java:84)
10-Feb-2019 01:06:47         at org.gradle.api.internal.tasks.execution.ResolveTaskOutputCachingStateExecuter.execute(ResolveTaskOutputCachingStateExecuter.java:91)
10-Feb-2019 01:06:47         at org.gradle.api.internal.tasks.execution.ResolveBeforeExecutionStateTaskExecuter.execute(ResolveBeforeExecutionStateTaskExecuter.java:74)
10-Feb-2019 01:06:47         at org.gradle.api.internal.tasks.execution.ValidatingTaskExecuter.execute(ValidatingTaskExecuter.java:58)
10-Feb-2019 01:06:47         at org.gradle.api.internal.tasks.execution.SkipEmptySourceFilesTaskExecuter.execute(SkipEmptySourceFilesTaskExecuter.java:109)
10-Feb-2019 01:06:47         at org.gradle.api.internal.tasks.execution.ResolveBeforeExecutionOutputsTaskExecuter.execute(ResolveBeforeExecutionOutputsTaskExecuter.java:67)
10-Feb-2019 01:06:47         at org.gradle.api.internal.tasks.execution.ResolveAfterPreviousExecutionStateTaskExecuter.execute(ResolveAfterPreviousExecutionStateTaskExecuter.java:46)
10-Feb-2019 01:06:47         at org.gradle.api.internal.tasks.execution.CleanupStaleOutputsExecuter.execute(CleanupStaleOutputsExecuter.java:93)
10-Feb-2019 01:06:47         at org.gradle.api.internal.tasks.execution.FinalizePropertiesTaskExecuter.execute(FinalizePropertiesTaskExecuter.java:45)
10-Feb-2019 01:06:47         at org.gradle.api.internal.tasks.execution.ResolveTaskExecutionModeExecuter.execute(ResolveTaskExecutionModeExecuter.java:94)
10-Feb-2019 01:06:47         at org.gradle.api.internal.tasks.execution.SkipTaskWithNoActionsExecuter.execute(SkipTaskWithNoActionsExecuter.java:57)
10-Feb-2019 01:06:47         at org.gradle.api.internal.tasks.execution.SkipOnlyIfTaskExecuter.execute(SkipOnlyIfTaskExecuter.java:56)
10-Feb-2019 01:06:47         at org.gradle.api.internal.tasks.execution.CatchExceptionTaskExecuter.execute(CatchExceptionTaskExecuter.java:36)
10-Feb-2019 01:06:47         at org.gradle.api.internal.tasks.execution.EventFiringTaskExecuter$1.executeTask(EventFiringTaskExecuter.java:63)
10-Feb-2019 01:06:47         at org.gradle.api.internal.tasks.execution.EventFiringTaskExecuter$1.call(EventFiringTaskExecuter.java:49)
10-Feb-2019 01:06:47         at org.gradle.api.internal.tasks.execution.EventFiringTaskExecuter$1.call(EventFiringTaskExecuter.java:46)
10-Feb-2019 01:06:47         at org.gradle.internal.operations.DefaultBuildOperationExecutor$CallableBuildOperationWorker.execute(DefaultBuildOperationExecutor.java:416)
10-Feb-2019 01:06:47         at org.gradle.internal.operations.DefaultBuildOperationExecutor$CallableBuildOperationWorker.execute(DefaultBuildOperationExecutor.java:406)
10-Feb-2019 01:06:47         at org.gradle.internal.operations.DefaultBuildOperationExecutor$1.execute(DefaultBuildOperationExecutor.java:165)
10-Feb-2019 01:06:47         at org.gradle.internal.operations.DefaultBuildOperationExecutor.execute(DefaultBuildOperationExecutor.java:250)
10-Feb-2019 01:06:47         at org.gradle.internal.operations.DefaultBuildOperationExecutor.execute(DefaultBuildOperationExecutor.java:158)
10-Feb-2019 01:06:47         at org.gradle.internal.operations.DefaultBuildOperationExecutor.call(DefaultBuildOperationExecutor.java:102)
10-Feb-2019 01:06:47         at org.gradle.internal.operations.DelegatingBuildOperationExecutor.call(DelegatingBuildOperationExecutor.java:36)
10-Feb-2019 01:06:47         at org.gradle.api.internal.tasks.execution.EventFiringTaskExecuter.execute(EventFiringTaskExecuter.java:46)
10-Feb-2019 01:06:47         at org.gradle.execution.plan.LocalTaskNodeExecutor.execute(LocalTaskNodeExecutor.java:43)
10-Feb-2019 01:06:47         at org.gradle.execution.taskgraph.DefaultTaskExecutionGraph$InvokeNodeExecutorsAction.execute(DefaultTaskExecutionGraph.java:355)
10-Feb-2019 01:06:47         at org.gradle.execution.taskgraph.DefaultTaskExecutionGraph$InvokeNodeExecutorsAction.execute(DefaultTaskExecutionGraph.java:343)
10-Feb-2019 01:06:47         at org.gradle.execution.taskgraph.DefaultTaskExecutionGraph$BuildOperationAwareExecutionAction.execute(DefaultTaskExecutionGraph.java:336)
10-Feb-2019 01:06:47         at org.gradle.execution.taskgraph.DefaultTaskExecutionGraph$BuildOperationAwareExecutionAction.execute(DefaultTaskExecutionGraph.java:322)
10-Feb-2019 01:06:47         at org.gradle.execution.plan.DefaultPlanExecutor$ExecutorWorker$1.execute(DefaultPlanExecutor.java:134)
10-Feb-2019 01:06:47         at org.gradle.execution.plan.DefaultPlanExecutor$ExecutorWorker$1.execute(DefaultPlanExecutor.java:129)
10-Feb-2019 01:06:47         at org.gradle.execution.plan.DefaultPlanExecutor$ExecutorWorker.execute(DefaultPlanExecutor.java:202)
10-Feb-2019 01:06:47         at org.gradle.execution.plan.DefaultPlanExecutor$ExecutorWorker.executeNextNode(DefaultPlanExecutor.java:193)
10-Feb-2019 01:06:47         at org.gradle.execution.plan.DefaultPlanExecutor$ExecutorWorker.run(DefaultPlanExecutor.java:129)
10-Feb-2019 01:06:47         at org.gradle.internal.concurrent.ExecutorPolicy$CatchAndRecordFailures.onExecute(ExecutorPolicy.java:63)
10-Feb-2019 01:06:47         at org.gradle.internal.concurrent.ManagedExecutorImpl$1.run(ManagedExecutorImpl.java:46)
10-Feb-2019 01:06:47         at org.gradle.internal.concurrent.ThreadFactoryImpl$ManagedThreadRunnable.run(ThreadFactoryImpl.java:55)
10-Feb-2019 01:06:47 Caused by: org.gradle.api.internal.tasks.compile.CompilationFailedException: Compilation failed with exit code 1; see the compiler error output for details.
10-Feb-2019 01:06:47         at net.ltgt.gradle.errorprone.ErrorProneCompiler.execute(ErrorProneCompiler.java:74)
10-Feb-2019 01:06:47         at net.ltgt.gradle.errorprone.ErrorProneCompiler.execute(ErrorProneCompiler.java:23)
10-Feb-2019 01:06:47         at org.gradle.api.internal.tasks.compile.NormalizingJavaCompiler.delegateAndHandleErrors(NormalizingJavaCompiler.java:100)
10-Feb-2019 01:06:47         at org.gradle.api.internal.tasks.compile.NormalizingJavaCompiler.execute(NormalizingJavaCompiler.java:52)
10-Feb-2019 01:06:47         at org.gradle.api.internal.tasks.compile.NormalizingJavaCompiler.execute(NormalizingJavaCompiler.java:38)
10-Feb-2019 01:06:47         at org.gradle.api.internal.tasks.compile.CleaningJavaCompilerSupport.execute(CleaningJavaCompilerSupport.java:39)
10-Feb-2019 01:06:47         at org.gradle.api.internal.tasks.compile.incremental.IncrementalCompilerFactory$2.execute(IncrementalCompilerFactory.java:110)
10-Feb-2019 01:06:47         at org.gradle.api.internal.tasks.compile.incremental.IncrementalCompilerFactory$2.execute(IncrementalCompilerFactory.java:106)
10-Feb-2019 01:06:47         at org.gradle.api.internal.tasks.compile.incremental.IncrementalResultStoringCompiler.execute(IncrementalResultStoringCompiler.java:59)
10-Feb-2019 01:06:47         at org.gradle.api.internal.tasks.compile.incremental.IncrementalResultStoringCompiler.execute(IncrementalResultStoringCompiler.java:43)
10-Feb-2019 01:06:47         at org.gradle.api.internal.tasks.compile.CompileJavaBuildOperationReportingCompiler$2.call(CompileJavaBuildOperationReportingCompiler.java:59)
10-Feb-2019 01:06:47         at org.gradle.api.internal.tasks.compile.CompileJavaBuildOperationReportingCompiler$2.call(CompileJavaBuildOperationReportingCompiler.java:51)
10-Feb-2019 01:06:47         at org.gradle.internal.operations.DefaultBuildOperationExecutor$CallableBuildOperationWorker.execute(DefaultBuildOperationExecutor.java:416)
10-Feb-2019 01:06:47         at org.gradle.internal.operations.DefaultBuildOperationExecutor$CallableBuildOperationWorker.execute(DefaultBuildOperationExecutor.java:406)
10-Feb-2019 01:06:47         at org.gradle.internal.operations.DefaultBuildOperationExecutor$1.execute(DefaultBuildOperationExecutor.java:165)
10-Feb-2019 01:06:47         at org.gradle.internal.operations.DefaultBuildOperationExecutor.execute(DefaultBuildOperationExecutor.java:250)
10-Feb-2019 01:06:47         at org.gradle.internal.operations.DefaultBuildOperationExecutor.execute(DefaultBuildOperationExecutor.java:158)
10-Feb-2019 01:06:47         at org.gradle.internal.operations.DefaultBuildOperationExecutor.call(DefaultBuildOperationExecutor.java:102)
10-Feb-2019 01:06:47         at org.gradle.internal.operations.DelegatingBuildOperationExecutor.call(DelegatingBuildOperationExecutor.java:36)
10-Feb-2019 01:06:47         at org.gradle.api.internal.tasks.compile.CompileJavaBuildOperationReportingCompiler.execute(CompileJavaBuildOperationReportingCompiler.java:51)
10-Feb-2019 01:06:47         at org.gradle.api.tasks.compile.JavaCompile.performCompilation(JavaCompile.java:154)
10-Feb-2019 01:06:47         at org.gradle.api.tasks.compile.JavaCompile.compile(JavaCompile.java:122)
10-Feb-2019 01:06:47         at org.gradle.internal.reflect.JavaMethod.invoke(JavaMethod.java:103)
10-Feb-2019 01:06:47         at org.gradle.api.internal.project.taskfactory.IncrementalTaskAction.doExecute(IncrementalTaskAction.java:73)
10-Feb-2019 01:06:47         at org.gradle.api.internal.project.taskfactory.StandardTaskAction.execute(StandardTaskAction.java:41)
10-Feb-2019 01:06:47         at org.gradle.api.internal.project.taskfactory.StandardTaskAction.execute(StandardTaskAction.java:28)
10-Feb-2019 01:06:47         at org.gradle.api.internal.tasks.execution.ExecuteActionsTaskExecuter$4.run(ExecuteActionsTaskExecuter.java:338)
10-Feb-2019 01:06:47         at org.gradle.internal.operations.DefaultBuildOperationExecutor$RunnableBuildOperationWorker.execute(DefaultBuildOperationExecutor.java:402)
10-Feb-2019 01:06:47         at org.gradle.internal.operations.DefaultBuildOperationExecutor$RunnableBuildOperationWorker.execute(DefaultBuildOperationExecutor.java:394)
10-Feb-2019 01:06:47         at org.gradle.internal.operations.DefaultBuildOperationExecutor$1.execute(DefaultBuildOperationExecutor.java:165)
10-Feb-2019 01:06:47         at org.gradle.internal.operations.DefaultBuildOperationExecutor.execute(DefaultBuildOperationExecutor.java:250)
10-Feb-2019 01:06:47         at org.gradle.internal.operations.DefaultBuildOperationExecutor.execute(DefaultBuildOperationExecutor.java:158)
10-Feb-2019 01:06:47         at org.gradle.internal.operations.DefaultBuildOperationExecutor.run(DefaultBuildOperationExecutor.java:92)
10-Feb-2019 01:06:47         at org.gradle.internal.operations.DelegatingBuildOperationExecutor.run(DelegatingBuildOperationExecutor.java:31)
10-Feb-2019 01:06:47         at org.gradle.api.internal.tasks.execution.ExecuteActionsTaskExecuter.executeAction(ExecuteActionsTaskExecuter.java:327)
10-Feb-2019 01:06:47         at org.gradle.api.internal.tasks.execution.ExecuteActionsTaskExecuter.executeActions(ExecuteActionsTaskExecuter.java:312)
10-Feb-2019 01:06:47         at org.gradle.api.internal.tasks.execution.ExecuteActionsTaskExecuter.access$200(ExecuteActionsTaskExecuter.java:75)
10-Feb-2019 01:06:47         at org.gradle.api.internal.tasks.execution.ExecuteActionsTaskExecuter$TaskExecution.execute(ExecuteActionsTaskExecuter.java:158)
10-Feb-2019 01:06:47         at org.gradle.internal.execution.impl.steps.ExecuteStep.execute(ExecuteStep.java:46)
10-Feb-2019 01:06:47         at org.gradle.internal.execution.impl.steps.CancelExecutionStep.execute(CancelExecutionStep.java:34)
10-Feb-2019 01:06:47         at org.gradle.internal.execution.impl.steps.TimeoutStep.executeWithoutTimeout(TimeoutStep.java:69)
10-Feb-2019 01:06:47         at org.gradle.internal.execution.impl.steps.TimeoutStep.execute(TimeoutStep.java:49)
10-Feb-2019 01:06:47         at org.gradle.internal.execution.impl.steps.CatchExceptionStep.execute(CatchExceptionStep.java:34)
10-Feb-2019 01:06:47         at org.gradle.internal.execution.impl.steps.CreateOutputsStep.execute(CreateOutputsStep.java:49)
10-Feb-2019 01:06:47         at org.gradle.internal.execution.impl.steps.SnapshotOutputStep.execute(SnapshotOutputStep.java:42)
10-Feb-2019 01:06:47         at org.gradle.internal.execution.impl.steps.SnapshotOutputStep.execute(SnapshotOutputStep.java:28)
10-Feb-2019 01:06:47         at org.gradle.internal.execution.impl.steps.CacheStep.executeWithoutCache(CacheStep.java:133)
10-Feb-2019 01:06:47         at org.gradle.internal.execution.impl.steps.CacheStep.lambda$execute$5(CacheStep.java:83)
10-Feb-2019 01:06:47         at org.gradle.internal.execution.impl.steps.CacheStep.execute(CacheStep.java:82)
10-Feb-2019 01:06:47         at org.gradle.internal.execution.impl.steps.CacheStep.execute(CacheStep.java:37)
10-Feb-2019 01:06:47         at org.gradle.internal.execution.impl.steps.PrepareCachingStep.execute(PrepareCachingStep.java:33)
10-Feb-2019 01:06:47         at org.gradle.internal.execution.impl.steps.StoreSnapshotsStep.execute(StoreSnapshotsStep.java:38)
10-Feb-2019 01:06:47         at org.gradle.internal.execution.impl.steps.StoreSnapshotsStep.execute(StoreSnapshotsStep.java:23)
10-Feb-2019 01:06:47         at org.gradle.internal.execution.impl.steps.SkipUpToDateStep.executeBecause(SkipUpToDateStep.java:95)
10-Feb-2019 01:06:47         at org.gradle.internal.execution.impl.steps.SkipUpToDateStep.lambda$execute$1(SkipUpToDateStep.java:90)
10-Feb-2019 01:06:47         at org.gradle.internal.execution.impl.steps.SkipUpToDateStep.execute(SkipUpToDateStep.java:90)
10-Feb-2019 01:06:47         at org.gradle.internal.execution.impl.steps.SkipUpToDateStep.execute(SkipUpToDateStep.java:36)
10-Feb-2019 01:06:47         at org.gradle.internal.execution.impl.DefaultWorkExecutor.execute(DefaultWorkExecutor.java:34)
10-Feb-2019 01:06:47         at org.gradle.api.internal.tasks.execution.ExecuteActionsTaskExecuter.execute(ExecuteActionsTaskExecuter.java:109)
10-Feb-2019 01:06:47         ... 37 more
10-Feb-2019 01:06:47
10-Feb-2019 01:06:47
10-Feb-2019 01:06:47 * Get more help at https://help.gradle.org
10-Feb-2019 01:06:47
10-Feb-2019 01:06:47 BUILD FAILED in 2m 18s
10-Feb-2019 01:06:47 Failing task since return code of [/opt/gradle/bin/gradle --stacktrace check distributionZip] was 1 while expected 0
10-Feb-2019 01:06:47 Finished task 'Run unit tests and create distribution Zip' with result: Failed
10-Feb-2019 01:06:47 Running post build plugin 'NCover Results Collector'
10-Feb-2019 01:06:47 Running post build plugin 'Artifact Copier'
10-Feb-2019 01:06:47 Publishing an artifact: Project binary files
10-Feb-2019 01:06:52 Finished publishing of artifact Non required shared artifact: [Project binary files], pattern: [*.zip] anchored at: [build/distributions/] in 5.443 s
10-Feb-2019 01:06:52 Running post build plugin 'npm Cache Cleanup'
10-Feb-2019 01:06:52 Running post build plugin 'Clover Results Collector'
10-Feb-2019 01:06:52 Running post build plugin 'Docker Container Cleanup'
10-Feb-2019 01:06:52 Finalising the build...
10-Feb-2019 01:06:52 Stopping timer.
10-Feb-2019 01:06:52 Build SMACK-NIGHTLYSTABLE-JOB1-148 completed.
10-Feb-2019 01:06:52 Running on server: post build plugin 'NCover Results Collector'
10-Feb-2019 01:06:52 Running on server: post build plugin 'Build Hanging Detection Configuration'
10-Feb-2019 01:06:52 Running on server: post build plugin 'Clover Delta Calculator'
10-Feb-2019 01:06:52 Running on server: post build plugin 'Maven Dependencies Postprocessor'
10-Feb-2019 01:06:52 All post build plugins have finished
10-Feb-2019 01:06:52 Generating build results summary...
10-Feb-2019 01:06:52 Saving build results to disk...
10-Feb-2019 01:06:52 Logging substituted variables...
10-Feb-2019 01:06:52 Indexing build results...
10-Feb-2019 01:06:52 Finished building SMACK-NIGHTLYSTABLE-JOB1-148.