Builds Spark (minus the Install4j distributables) after every change to the code.

Logs

The following logs have been generated by the jobs in this plan.
  • Expand all
  • Collapse all
Job Logs
Collapse Maven build Build Stage Download or View
26-Aug-2018 21:13:57 [INFO] Transfer Guard ..................................... SKIPPED
26-Aug-2018 21:13:57 [INFO] Translator Plugin .................................. SKIPPED
26-Aug-2018 21:13:57 [INFO] Spark Distribution ................................. SKIPPED
26-Aug-2018 21:13:57 [INFO] ------------------------------------------------------------------------
26-Aug-2018 21:13:57 [INFO] BUILD FAILURE
26-Aug-2018 21:13:57 [INFO] ------------------------------------------------------------------------
26-Aug-2018 21:13:57 [INFO] Total time: 14.019 s
26-Aug-2018 21:13:57 [INFO] Finished at: 2018-08-26T21:13:57+00:00
26-Aug-2018 21:13:57 [INFO] Final Memory: 31M/166M
26-Aug-2018 21:13:57 [INFO] ------------------------------------------------------------------------
26-Aug-2018 21:13:57 [ERROR] Failed to execute goal org.apache.maven.plugins:maven-compiler-plugin:3.5.1:compile (default-compile) on project spark-core: Compilation failure
26-Aug-2018 21:13:57 [ERROR] /home/bamboo/bamboo-agent-home/xml-data/build-dir/SPARK-CI-JOB1/core/src/main/java/org/jivesoftware/sparkimpl/certificates/InBandCertificateChainDialog.java:[151,30] cannot find symbol
26-Aug-2018 21:13:57 [ERROR] symbol:   variable CertInfoButton
26-Aug-2018 21:13:57 [ERROR] location: class org.jivesoftware.sparkimpl.certificates.InBandCertificateChainDialog
26-Aug-2018 21:13:57 [ERROR] -> [Help 1]
26-Aug-2018 21:13:57 [ERROR]
26-Aug-2018 21:13:57 [ERROR] To see the full stack trace of the errors, re-run Maven with the -e switch.
26-Aug-2018 21:13:57 [ERROR] Re-run Maven using the -X switch to enable full debug logging.
26-Aug-2018 21:13:57 [ERROR]
26-Aug-2018 21:13:57 [ERROR] For more information about the errors and possible solutions, please read the following articles:
26-Aug-2018 21:13:57 [ERROR] [Help 1] http://cwiki.apache.org/confluence/display/MAVEN/MojoFailureException
26-Aug-2018 21:13:57 [ERROR]
26-Aug-2018 21:13:57 [ERROR] After correcting the problems, you can resume the build with the command
26-Aug-2018 21:13:57 [ERROR]   mvn <goals> -rf :spark-core
26-Aug-2018 21:14:14 Unable to publish artifact [Distribution Base]: