Builds Spark (minus the Install4j distributables) after every change to the code.

Build: #80 failed Code changes detected

Logs

The following logs have been generated by the jobs in this plan.
  • Expand all
  • Collapse all
Job Logs
Collapse Maven build Build Stage Download or View
05-Oct-2017 13:49:53 [INFO] Downloaded: https://repo.maven.apache.org/maven2/org/codehaus/plexus/plexus-compiler-manager/2.2/plexus-compiler-manager-2.2.jar (5 KB at 103.6 KB/sec)
05-Oct-2017 13:49:53 [INFO] Changes detected - recompiling the module!
05-Oct-2017 13:49:53 [INFO] Compiling 2 source files to /var/atlassian/bamboo-home/xml-data/build-dir/SPARK-CI-JOB1/target/classes
05-Oct-2017 13:49:54 [INFO] -------------------------------------------------------------
05-Oct-2017 13:49:54 [ERROR] COMPILATION ERROR :
05-Oct-2017 13:49:54 [INFO] -------------------------------------------------------------
05-Oct-2017 13:49:54 [ERROR] /var/atlassian/bamboo-home/xml-data/build-dir/SPARK-CI-JOB1/src/main/java/com/cripto/criptida/App.java:[33,17] ';' expected
05-Oct-2017 13:49:54 [INFO] 1 error
05-Oct-2017 13:49:54 [INFO] -------------------------------------------------------------
05-Oct-2017 13:49:54 [INFO] ------------------------------------------------------------------------
05-Oct-2017 13:49:54 [INFO] BUILD FAILURE
05-Oct-2017 13:49:54 [INFO] ------------------------------------------------------------------------
05-Oct-2017 13:49:54 [INFO] Total time: 2.366 s
05-Oct-2017 13:49:54 [INFO] Finished at: 2017-10-05T13:49:54+00:00
05-Oct-2017 13:49:54 [INFO] Final Memory: 16M/158M
05-Oct-2017 13:49:54 [INFO] ------------------------------------------------------------------------
05-Oct-2017 13:49:54 [ERROR] Failed to execute goal org.apache.maven.plugins:maven-compiler-plugin:3.1:compile (default-compile) on project criptida: Compilation failure
05-Oct-2017 13:49:54 [ERROR] /var/atlassian/bamboo-home/xml-data/build-dir/SPARK-CI-JOB1/src/main/java/com/cripto/criptida/App.java:[33,17] ';' expected
05-Oct-2017 13:49:54 [ERROR] -> [Help 1]
05-Oct-2017 13:49:54 [ERROR]
05-Oct-2017 13:49:54 [ERROR] To see the full stack trace of the errors, re-run Maven with the -e switch.
05-Oct-2017 13:49:54 [ERROR] Re-run Maven using the -X switch to enable full debug logging.
05-Oct-2017 13:49:54 [ERROR]
05-Oct-2017 13:49:54 [ERROR] For more information about the errors and possible solutions, please read the following articles:
05-Oct-2017 13:49:54 [ERROR] [Help 1] http://cwiki.apache.org/confluence/display/MAVEN/MojoFailureException