Builds Spark (minus the Install4j distributables) after every change to the code.

Build: #127 failed

Job: Maven build failed

Stages & jobs

  1. Build Stage

Build log

The build generated 137 lines of output. Download or view full build log

26-Aug-2018 21:13:39 Build Spark - Continuous Integration - Maven build #127 (SPARK-CI-JOB1-127) started building on agent ip-172-31-16-33.eu-central-1.compute.internal
26-Aug-2018 21:13:39 Remote agent on host ip-172-31-16-33.eu-central-1.compute.internal
26-Aug-2018 21:13:39 Build working directory is /home/bamboo/bamboo-agent-home/xml-data/build-dir/SPARK-CI-JOB1
26-Aug-2018 21:13:39 Executing build Spark - Continuous Integration - Maven build #127 (SPARK-CI-JOB1-127)
26-Aug-2018 21:13:39 Starting task 'Checkout Default Repository' of type 'com.atlassian.bamboo.plugins.vcs:task.vcs.checkout'
26-Aug-2018 21:13:39 Checking out into /home/bamboo/bamboo-agent-home/xml-data/build-dir/SPARK-CI-JOB1
26-Aug-2018 21:13:39 Updating source code to revision: b18c64ada1193a2b41c79e7c2fdac43c855399e4
26-Aug-2018 21:13:40 Fetching 'refs/heads/master' from 'https://github.com/igniterealtime/Spark.git'. Will try to do a shallow fetch.
26-Aug-2018 21:13:41 From https://github.com/igniterealtime/Spark
26-Aug-2018 21:13:41 + f9e1a78...b18c64a master     -> master  (forced update)
26-Aug-2018 21:13:41 Checking out revision b18c64ada1193a2b41c79e7c2fdac43c855399e4.
26-Aug-2018 21:13:41 Already on 'master'
26-Aug-2018 21:13:41 Updated source code to revision: b18c64ada1193a2b41c79e7c2fdac43c855399e4
26-Aug-2018 21:13:41 Finished task 'Checkout Default Repository' with result: Success
26-Aug-2018 21:13:41 Running pre-build action: VCS Version Collector
26-Aug-2018 21:13:41 Starting task 'Build' of type 'com.atlassian.bamboo.plugins.maven:task.builder.mvn3'
26-Aug-2018 21:13:41
Beginning to execute external process for build 'Spark - Continuous Integration - Maven build #127 (SPARK-CI-JOB1-127)'
... running command line:
/usr/share/maven/bin/mvn --batch-mode -Djava.io.tmpdir=/tmp/SPARK-CI-JOB1 clean package
... in: /home/bamboo/bamboo-agent-home/xml-data/build-dir/SPARK-CI-JOB1
... using extra environment variables:
bamboo_planRepository_1_branch=master
bamboo_planRepository_1_branchDisplayName=master
bamboo_repository_revision_number=b18c64ada1193a2b41c79e7c2fdac43c855399e4
MAVEN2_HOME=/usr/share/maven
bamboo_resultsUrl=https://bamboo.igniterealtime.org/browse/SPARK-CI-JOB1-127
bamboo_build_working_directory=/home/bamboo/bamboo-agent-home/xml-data/build-dir/SPARK-CI-JOB1
bamboo_planRepository_1_name=Spark (master)
bamboo_buildKey=SPARK-CI-JOB1
bamboo_shortPlanName=Continuous Integration
bamboo_planRepository_name=Spark (master)
bamboo_buildNumber=127
bamboo_capability_system_jdk_JDK_1_8_0_131=/usr/lib/jvm/java-8-oracle
bamboo_shortJobName=Maven build
bamboo_buildResultsUrl=https://bamboo.igniterealtime.org/browse/SPARK-CI-JOB1-127
bamboo_capability_system_builder_command_dpkg_buildpackage=/usr/bin/dpkg-buildpackage
bamboo_planRepository_repositoryUrl=https://github.com/igniterealtime/Spark.git
bamboo_agentId=44924929
bamboo_planName=Spark - Continuous Integration
bamboo_shortPlanKey=CI
bamboo_shortJobKey=JOB1
bamboo_repository_39256082_git_repositoryUrl=https://github.com/igniterealtime/Spark.git
bamboo_planRepository_revision=b18c64ada1193a2b41c79e7c2fdac43c855399e4
bamboo_buildTimeStamp=2018-08-26T21:13:32.405Z
bamboo_repository_previous_revision_number=f9e1a78526814517d3f0314cabaab600535b9d7c
bamboo_planRepository_previousRevision=f9e1a78526814517d3f0314cabaab600535b9d7c
bamboo_repository_39256082_branch_name=master
M2_HOME=/usr/share/maven
bamboo_repository_git_branch=master
bamboo_buildResultKey=SPARK-CI-JOB1-127
bamboo_repository_branch_name=master
bamboo_buildPlanName=Spark - Continuous Integration - Maven build
bamboo_repository_39256082_git_branch=master
bamboo_repository_39256082_revision_number=b18c64ada1193a2b41c79e7c2fdac43c855399e4
bamboo_capability_system_builder_command_fakeroot=/usr/bin/fakeroot
bamboo_planRepository_1_revision=b18c64ada1193a2b41c79e7c2fdac43c855399e4
bamboo_repository_name=Spark (master)
bamboo_repository_39256082_git_username=
JAVA_HOME=/usr/lib/jvm/java-8-oracle
bamboo_buildFailed=false
bamboo_repository_39256082_previous_revision_number=f9e1a78526814517d3f0314cabaab600535b9d7c
bamboo_planRepository_branch=master
bamboo_agentWorkingDirectory=/home/bamboo/bamboo-agent-home/xml-data/build-dir
bamboo_capability_system_git_executable=/usr/bin/git
bamboo_repository_git_username=
bamboo_planRepository_1_previousRevision=f9e1a78526814517d3f0314cabaab600535b9d7c
bamboo_planRepository_branchDisplayName=master
bamboo_planRepository_1_type=gitv2
bamboo_planRepository_branchName=master
bamboo_capability_system_builder_mvn3_Maven=/usr/share/maven
bamboo_capability_system_jdk_JDK=/usr/lib/jvm/java-8-oracle
bamboo_plan_storageTag=plan-37978118
bamboo_hg_cache_directory=/home/bamboo/bamboo-agent-home/xml-data/build-dir/_hg-repositories-cache
bamboo_planRepository_1_username=
bamboo_planRepository_type=gitv2
bamboo_git_cache_directory=/home/bamboo/bamboo-agent-home/xml-data/build-dir/_git-repositories-cache
bamboo_repository_git_repositoryUrl=https://github.com/igniterealtime/Spark.git
useMavenReturnCode=false
bamboo_repository_39256082_name=Spark (master)
bamboo_capability_system_builder_ant_Ant=/usr/share/ant
bamboo_capability_system_builder_mvn3_Maven_3=/usr/share/maven
bamboo_tmp_directory=/home/bamboo/bamboo-agent-home/temp
bamboo_working_directory=/home/bamboo/bamboo-agent-home/xml-data/build-dir/SPARK-CI-JOB1
bamboo_planKey=SPARK-CI
bamboo_planRepository_1_repositoryUrl=https://github.com/igniterealtime/Spark.git
bamboo_planRepository_username=
bamboo_capability_system_jdk_JDK_1_8=/usr/lib/jvm/java-8-oracle
bamboo_planRepository_1_branchName=master
PATH=/usr/lib/jvm/java-8-oracle/bin:/bin:/usr/local/sbin:/usr/local/bin:/usr/sbin:/usr/bin:/sbin:/bin
26-Aug-2018 21:13:43 [INFO] Scanning for projects...
26-Aug-2018 21:13:44 [INFO] ------------------------------------------------------------------------
26-Aug-2018 21:13:44 [INFO] Reactor Build Order:
26-Aug-2018 21:13:44 [INFO]
26-Aug-2018 21:13:44 [INFO] Spark (parent)
26-Aug-2018 21:13:44 [INFO] Spark Core
26-Aug-2018 21:13:44 [INFO] Spark Emoticons
26-Aug-2018 21:13:44 [INFO] Spark Plugin Assembly Descriptor
26-Aug-2018 21:13:44 [INFO] Apple Plugin
26-Aug-2018 21:13:44 [INFO] Fastpath
26-Aug-2018 21:13:44 [INFO] Http File Upload Plugin
26-Aug-2018 21:13:44 [INFO] Window Flashing Plugin
26-Aug-2018 21:13:44 [INFO] Growl
26-Aug-2018 21:13:44 [INFO] Meetings Plugin
26-Aug-2018 21:13:44 [INFO] Reversi
26-Aug-2018 21:13:44 [INFO] Roar!!!
26-Aug-2018 21:13:44 [INFO] TicTacToe
26-Aug-2018 21:13:44 [INFO] Transfer Guard
26-Aug-2018 21:13:44 [INFO] Translator Plugin
26-Aug-2018 21:13:44 [INFO] Spark Distribution
26-Aug-2018 21:13:44 [INFO]                                                                         
26-Aug-2018 21:13:44 [INFO] ------------------------------------------------------------------------
26-Aug-2018 21:13:44 [INFO] Building Spark (parent) 2.9.0-SNAPSHOT
26-Aug-2018 21:13:44 [INFO] ------------------------------------------------------------------------
26-Aug-2018 21:13:44 [INFO]
26-Aug-2018 21:13:44 [INFO] --- maven-clean-plugin:2.5:clean (default-clean) @ parent ---
26-Aug-2018 21:13:44 [INFO]
26-Aug-2018 21:13:44 [INFO] --- native2ascii-maven-plugin:1.0-beta-1:native2ascii (native2ascii) @ parent ---
26-Aug-2018 21:13:44 [INFO]                                                                         
26-Aug-2018 21:13:44 [INFO] ------------------------------------------------------------------------
26-Aug-2018 21:13:44 [INFO] Building Spark Core 2.9.0-SNAPSHOT
26-Aug-2018 21:13:44 [INFO] ------------------------------------------------------------------------
26-Aug-2018 21:13:45 [INFO]
26-Aug-2018 21:13:45 [INFO] --- maven-clean-plugin:2.5:clean (default-clean) @ spark-core ---
26-Aug-2018 21:13:45 [INFO] Deleting /home/bamboo/bamboo-agent-home/xml-data/build-dir/SPARK-CI-JOB1/core/target
26-Aug-2018 21:13:45 [INFO]
26-Aug-2018 21:13:45 [INFO] --- maven-resources-plugin:2.6:resources (default-resources) @ spark-core ---
26-Aug-2018 21:13:45 [INFO] Using 'UTF-8' encoding to copy filtered resources.
26-Aug-2018 21:13:45 [INFO] Copying 697 resources
26-Aug-2018 21:13:46 [INFO]
26-Aug-2018 21:13:46 [INFO] --- maven-compiler-plugin:3.5.1:compile (default-compile) @ spark-core ---
26-Aug-2018 21:13:47 [INFO] Changes detected - recompiling the module!
26-Aug-2018 21:13:47 [INFO] Compiling 388 source files to /home/bamboo/bamboo-agent-home/xml-data/build-dir/SPARK-CI-JOB1/core/target/classes
26-Aug-2018 21:13:57 [INFO] /home/bamboo/bamboo-agent-home/xml-data/build-dir/SPARK-CI-JOB1/core/src/main/java/org/jivesoftware/spark/ui/ChatRoom.java: Some input files use or override a deprecated API.
26-Aug-2018 21:13:57 [INFO] /home/bamboo/bamboo-agent-home/xml-data/build-dir/SPARK-CI-JOB1/core/src/main/java/org/jivesoftware/spark/ui/ChatRoom.java: Recompile with -Xlint:deprecation for details.
26-Aug-2018 21:13:57 [INFO] /home/bamboo/bamboo-agent-home/xml-data/build-dir/SPARK-CI-JOB1/core/src/main/java/org/jivesoftware/spark/ui/conferences/GroupChatParticipantList.java: Some input files use unchecked or unsafe operations.
26-Aug-2018 21:13:57 [INFO] /home/bamboo/bamboo-agent-home/xml-data/build-dir/SPARK-CI-JOB1/core/src/main/java/org/jivesoftware/spark/ui/conferences/GroupChatParticipantList.java: Recompile with -Xlint:unchecked for details.
26-Aug-2018 21:13:57 [INFO] -------------------------------------------------------------
26-Aug-2018 21:13:57 [ERROR] COMPILATION ERROR :
26-Aug-2018 21:13:57 [INFO] -------------------------------------------------------------
26-Aug-2018 21:13:57 [ERROR] /home/bamboo/bamboo-agent-home/xml-data/build-dir/SPARK-CI-JOB1/core/src/main/java/org/jivesoftware/sparkimpl/certificates/InBandCertificateChainDialog.java:[151,30] cannot find symbol
26-Aug-2018 21:13:57   symbol:   variable CertInfoButton
26-Aug-2018 21:13:57   location: class org.jivesoftware.sparkimpl.certificates.InBandCertificateChainDialog
26-Aug-2018 21:13:57 [INFO] 1 error
26-Aug-2018 21:13:57 [INFO] -------------------------------------------------------------
26-Aug-2018 21:13:57 [INFO] ------------------------------------------------------------------------
26-Aug-2018 21:13:57 [INFO] Reactor Summary:
26-Aug-2018 21:13:57 [INFO]
26-Aug-2018 21:13:57 [INFO] Spark (parent) ..................................... SUCCESS [  0.394 s]
26-Aug-2018 21:13:57 [INFO] Spark Core ......................................... FAILURE [ 13.058 s]
26-Aug-2018 21:13:57 [INFO] Spark Emoticons .................................... SKIPPED
26-Aug-2018 21:13:57 [INFO] Spark Plugin Assembly Descriptor ................... SKIPPED
26-Aug-2018 21:13:57 [INFO] Apple Plugin ....................................... SKIPPED
26-Aug-2018 21:13:57 [INFO] Fastpath ........................................... SKIPPED
26-Aug-2018 21:13:57 [INFO] Http File Upload Plugin ............................ SKIPPED
26-Aug-2018 21:13:57 [INFO] Window Flashing Plugin ............................. SKIPPED
26-Aug-2018 21:13:57 [INFO] Growl .............................................. SKIPPED
26-Aug-2018 21:13:57 [INFO] Meetings Plugin .................................... SKIPPED
26-Aug-2018 21:13:57 [INFO] Reversi ............................................ SKIPPED
26-Aug-2018 21:13:57 [INFO] Roar!!! ............................................ SKIPPED
26-Aug-2018 21:13:57 [INFO] TicTacToe .......................................... SKIPPED
26-Aug-2018 21:13:57 [INFO] Transfer Guard ..................................... SKIPPED
26-Aug-2018 21:13:57 [INFO] Translator Plugin .................................. SKIPPED
26-Aug-2018 21:13:57 [INFO] Spark Distribution ................................. SKIPPED
26-Aug-2018 21:13:57 [INFO] ------------------------------------------------------------------------
26-Aug-2018 21:13:57 [INFO] BUILD FAILURE
26-Aug-2018 21:13:57 [INFO] ------------------------------------------------------------------------
26-Aug-2018 21:13:57 [INFO] Total time: 14.019 s
26-Aug-2018 21:13:57 [INFO] Finished at: 2018-08-26T21:13:57+00:00
26-Aug-2018 21:13:57 [INFO] Final Memory: 31M/166M
26-Aug-2018 21:13:57 [INFO] ------------------------------------------------------------------------
26-Aug-2018 21:13:57 [ERROR] Failed to execute goal org.apache.maven.plugins:maven-compiler-plugin:3.5.1:compile (default-compile) on project spark-core: Compilation failure
26-Aug-2018 21:13:57 [ERROR] /home/bamboo/bamboo-agent-home/xml-data/build-dir/SPARK-CI-JOB1/core/src/main/java/org/jivesoftware/sparkimpl/certificates/InBandCertificateChainDialog.java:[151,30] cannot find symbol
26-Aug-2018 21:13:57 [ERROR] symbol:   variable CertInfoButton
26-Aug-2018 21:13:57 [ERROR] location: class org.jivesoftware.sparkimpl.certificates.InBandCertificateChainDialog
26-Aug-2018 21:13:57 [ERROR] -> [Help 1]
26-Aug-2018 21:13:57 [ERROR]
26-Aug-2018 21:13:57 [ERROR] To see the full stack trace of the errors, re-run Maven with the -e switch.
26-Aug-2018 21:13:57 [ERROR] Re-run Maven using the -X switch to enable full debug logging.
26-Aug-2018 21:13:57 [ERROR]
26-Aug-2018 21:13:57 [ERROR] For more information about the errors and possible solutions, please read the following articles:
26-Aug-2018 21:13:57 [ERROR] [Help 1] http://cwiki.apache.org/confluence/display/MAVEN/MojoFailureException
26-Aug-2018 21:13:57 [ERROR]
26-Aug-2018 21:13:57 [ERROR] After correcting the problems, you can resume the build with the command
26-Aug-2018 21:13:57 [ERROR]   mvn <goals> -rf :spark-core
26-Aug-2018 21:13:57 Failing task since return code of [/usr/share/maven/bin/mvn --batch-mode -Djava.io.tmpdir=/tmp/SPARK-CI-JOB1 clean package] was 1 while expected 0
26-Aug-2018 21:13:57 Parsing test results under /home/bamboo/bamboo-agent-home/xml-data/build-dir/SPARK-CI-JOB1...
26-Aug-2018 21:13:58 File /home/bamboo/bamboo-agent-home/xml-data/build-dir/SPARK-CI-JOB1/plugins/translator/target/surefire-reports/TEST-com.jivesoftware.spark.translator.TestTranslator.xml was ignored because it was modified (2018-08-26 19:26:15.000) before task started (2018-08-26 21:13:39.844)
26-Aug-2018 21:13:58 Finished task 'Build' with result: Failed
26-Aug-2018 21:13:58 Running post build plugin 'Docker Container Cleanup'
26-Aug-2018 21:13:58 Running post build plugin 'NCover Results Collector'
26-Aug-2018 21:13:58 Running post build plugin 'Clover Results Collector'
26-Aug-2018 21:13:58 Running post build plugin 'npm Cache Cleanup'
26-Aug-2018 21:13:58 Running post build plugin 'Artifact Copier'
26-Aug-2018 21:13:58 Publishing an artifact: Distribution Base
26-Aug-2018 21:14:14 Unable to publish artifact [Distribution Base]:
26-Aug-2018 21:14:14 The artifact hasn't been successfully published after 16.62 s
26-Aug-2018 21:14:14 Finalising the build...
26-Aug-2018 21:14:14 Stopping timer.
26-Aug-2018 21:14:14 Build SPARK-CI-JOB1-127 completed.
26-Aug-2018 21:14:07 Running on server: post build plugin 'NCover Results Collector'
26-Aug-2018 21:14:07 Running on server: post build plugin 'Build Hanging Detection Configuration'
26-Aug-2018 21:14:07 Running on server: post build plugin 'Clover Delta Calculator'
26-Aug-2018 21:14:07 Running on server: post build plugin 'Maven Dependencies Postprocessor'
26-Aug-2018 21:14:07 All post build plugins have finished
26-Aug-2018 21:14:07 Generating build results summary...
26-Aug-2018 21:14:07 Saving build results to disk...
26-Aug-2018 21:14:07 Logging substituted variables...
26-Aug-2018 21:14:07 Indexing build results...
26-Aug-2018 21:14:07 Finished building SPARK-CI-JOB1-127.