Builds Spark (minus the Install4j distributables) after every change to the code.

Build: #80 failed

Job: Maven build failed

Stages & jobs

  1. Build Stage

Build log

The build generated 142 lines of output. Download or view full build log

05-Oct-2017 13:49:49 Build Spark - Continuous Integration - Maven build #80 (SPARK-CI-JOB1-80) started building on agent Default Agent
05-Oct-2017 13:49:49
05-Oct-2017 13:49:49 Build working directory is /var/atlassian/bamboo-home/xml-data/build-dir/SPARK-CI-JOB1
05-Oct-2017 13:49:49 Executing build Spark - Continuous Integration - Maven build #80 (SPARK-CI-JOB1-80)
05-Oct-2017 13:49:49 Starting task 'Checkout Default Repository' of type 'com.atlassian.bamboo.plugins.vcs:task.vcs.checkout'
05-Oct-2017 13:49:49 Updating source code to revision: 11aa71dc9e55d23328eee0522bd36e2aeae931bf
05-Oct-2017 13:49:49 Fetching 'refs/heads/master' from 'https://github.com/igniterealtime/Spark.git'.
05-Oct-2017 13:49:50 Checking out revision 11aa71dc9e55d23328eee0522bd36e2aeae931bf.
05-Oct-2017 13:49:50 error: refs/remotes/origin/SPARK-1791_Maven does not point to a valid object!
05-Oct-2017 13:49:50 error: refs/remotes/origin/SPARK-1791_Maven does not point to a valid object!
05-Oct-2017 13:49:50 error: refs/remotes/origin/SPARK-1791_Maven does not point to a valid object!
05-Oct-2017 13:49:50 error: refs/remotes/origin/SPARK-1791_Maven does not point to a valid object!
05-Oct-2017 13:49:50 From file:///var/atlassian/bamboo-home/xml-data/build-dir/_git-repositories-cache/e19b14775748b74b49d780be451baff5e1a486d7
05-Oct-2017 13:49:50 + e42a5e0f...11aa71dc master     -> origin/master  (forced update)
05-Oct-2017 13:49:50 error: refs/remotes/origin/SPARK-1791_Maven does not point to a valid object!
05-Oct-2017 13:49:50 Already on 'master'
05-Oct-2017 13:49:50 Your branch and 'origin/master' have diverged,
05-Oct-2017 13:49:50 and have 3136 and 1 different commits each, respectively.
05-Oct-2017 13:49:50   (use "git pull" to merge the remote branch into yours)
05-Oct-2017 13:49:50 HEAD is now at 11aa71dc Initial login screen
05-Oct-2017 13:49:50 Updated source code to revision: 11aa71dc9e55d23328eee0522bd36e2aeae931bf
05-Oct-2017 13:49:50 Finished task 'Checkout Default Repository' with result: Success
05-Oct-2017 13:49:50 Running pre-build action: VCS Version Collector
05-Oct-2017 13:49:50 Starting task 'Build' of type 'com.atlassian.bamboo.plugins.maven:task.builder.mvn3'
05-Oct-2017 13:49:50
Beginning to execute external process for build 'Spark - Continuous Integration - Maven build #80 (SPARK-CI-JOB1-80)'
... running command line:
/opt/maven/bin/mvn --batch-mode -Djava.io.tmpdir=/opt/atlassian/bamboo/temp/SPARK-CI-JOB1 clean package
... in: /var/atlassian/bamboo-home/xml-data/build-dir/SPARK-CI-JOB1
... using extra environment variables:
bamboo_planRepository_1_branch=master
bamboo_capability_system_builder_mvn3_Maven_3_3_9=/opt/apache-maven-3.3.9
bamboo_planRepository_1_branchDisplayName=master
bamboo_repository_revision_number=11aa71dc9e55d23328eee0522bd36e2aeae931bf
MAVEN2_HOME=/opt/maven
bamboo_capability_daily_xfer=
bamboo_resultsUrl=https://bamboo.igniterealtime.org/browse/SPARK-CI-JOB1-80
bamboo_planRepository_1_name=Spark (master)
bamboo_capability_system_builder_command_Gradle=/opt/gradle/bin/gradle
bamboo_build_working_directory=/var/atlassian/bamboo-home/xml-data/build-dir/SPARK-CI-JOB1
bamboo_buildKey=SPARK-CI-JOB1
bamboo_shortPlanName=Continuous Integration
bamboo_planRepository_name=Spark (master)
bamboo_capability_system_jdk_JDK_1_6_0_20=/opt/java/sdk/Sun/jdk1.6.0_20
bamboo_buildNumber=80
bamboo_shortJobName=Maven build
bamboo_buildResultsUrl=https://bamboo.igniterealtime.org/browse/SPARK-CI-JOB1-80
bamboo_planRepository_repositoryUrl=https://github.com/igniterealtime/Spark.git
bamboo_capability_system_builder_command_Gradle__Faketime_=/opt/gradle-faketime
bamboo_agentId=131073
bamboo_planName=Spark - Continuous Integration
bamboo_shortPlanKey=CI
bamboo_shortJobKey=JOB1
bamboo_repository_39256082_git_repositoryUrl=https://github.com/igniterealtime/Spark.git
bamboo_planRepository_revision=11aa71dc9e55d23328eee0522bd36e2aeae931bf
bamboo_repository_previous_revision_number=e42a5e0f2335f89f4dc698df31355263209037c3
bamboo_buildTimeStamp=2017-10-05T13:49:49.577Z
bamboo_planRepository_previousRevision=e42a5e0f2335f89f4dc698df31355263209037c3
bamboo_capability_system_builder_mvn2_Maven_2=/opt/maven/apache-maven-2.2.1
bamboo_capability_rpm=
bamboo_capability_system_builder_ant_Ant_1_9_4=/opt/apache-ant-1.9.4
bamboo_repository_39256082_branch_name=master
M2_HOME=/opt/maven
bamboo_buildResultKey=SPARK-CI-JOB1-80
bamboo_repository_git_branch=master
bamboo_repository_branch_name=master
bamboo_buildPlanName=Spark - Continuous Integration - Maven build
bamboo_capability_Install4j=6.0.4
bamboo_repository_39256082_revision_number=11aa71dc9e55d23328eee0522bd36e2aeae931bf
bamboo_repository_39256082_git_branch=master
bamboo_planRepository_1_revision=11aa71dc9e55d23328eee0522bd36e2aeae931bf
bamboo_capability_system_builder_ant_Ant_1_7_1=/opt/apache-ant-1.7.1
bamboo_repository_name=Spark (master)
bamboo_repository_39256082_git_username=
JAVA_HOME=/opt/java/sdk/current
bamboo_capability_system_builder_mvn2_Maven_2_2_1=/opt/maven/apache-maven-2.2.1
bamboo_buildFailed=false
bamboo_repository_39256082_previous_revision_number=e42a5e0f2335f89f4dc698df31355263209037c3
bamboo_planRepository_branch=master
bamboo_capability_system_builder_command_Bash=/bin/bash
bamboo_capability_system_jdk_JDK_1_7_0_51=/opt/java/sdk/1.7
bamboo_agentWorkingDirectory=/var/atlassian/bamboo-home/xml-data/build-dir
bamboo_capability_system_git_executable=/usr/bin/git
bamboo_planRepository_1_previousRevision=e42a5e0f2335f89f4dc698df31355263209037c3
bamboo_repository_git_username=
bamboo_planRepository_branchDisplayName=master
bamboo_planRepository_1_type=gitv2
bamboo_planRepository_branchName=master
bamboo_capability_flex_sdk=4.6
bamboo_capability_system_builder_mvn3_Maven=/opt/maven
bamboo_capability_system_jdk_JDK=/opt/java/sdk/current
bamboo_capability_android=
bamboo_plan_storageTag=plan-37978118
bamboo_planRepository_type=gitv2
bamboo_planRepository_1_username=
bamboo_repository_git_repositoryUrl=https://github.com/igniterealtime/Spark.git
useMavenReturnCode=false
bamboo_repository_39256082_name=Spark (master)
bamboo_capability_system_builder_ant_Ant=/opt/apache-ant-1.9.7
bamboo_working_directory=/var/atlassian/bamboo-home/xml-data/build-dir/SPARK-CI-JOB1
bamboo_planKey=SPARK-CI
bamboo_capability_faketime=
bamboo_planRepository_1_repositoryUrl=https://github.com/igniterealtime/Spark.git
bamboo_planRepository_username=
bamboo_capability_system_jdk_JDK_1_8=/opt/java/sdk/current
bamboo_capability_system_builder_ant_Ant_1_8_1=/opt/apache-ant-1.8.1
bamboo_capability_system_jdk_JDK_1_6=/opt/java/sdk/1.6
bamboo_capability_system_builder_ant_Ant_1_6_5=/opt/apache-ant-1.6.5
bamboo_capability_system_jdk_JDK_1_7=/opt/java/sdk/1.7
bamboo_planRepository_1_branchName=master
PATH=/opt/java/sdk/current/bin:/usr/local/bin:/bin:/usr/bin:/usr/local/sbin:/usr/sbin:/sbin:/opt/android-sdk-linux/tools:/opt/gradle/bin:/home/bamboo/install4j.6.0.4/bin/:/home/bamboo/.local/bin:/home/bamboo/bin
05-Oct-2017 13:49:51 [INFO] Scanning for projects...
05-Oct-2017 13:49:51 [INFO]                                                                         
05-Oct-2017 13:49:51 [INFO] ------------------------------------------------------------------------
05-Oct-2017 13:49:51 [INFO] Building criptida 0.0.1-SNAPSHOT
05-Oct-2017 13:49:51 [INFO] ------------------------------------------------------------------------
05-Oct-2017 13:49:52 [INFO] Downloading: https://repo.maven.apache.org/maven2/org/apache/maven/plugins/maven-compiler-plugin/3.1/maven-compiler-plugin-3.1.pom
05-Oct-2017 13:49:52 [INFO] Downloaded: https://repo.maven.apache.org/maven2/org/apache/maven/plugins/maven-compiler-plugin/3.1/maven-compiler-plugin-3.1.pom (10 KB at 34.3 KB/sec)
05-Oct-2017 13:49:52 [INFO] Downloading: https://repo.maven.apache.org/maven2/org/apache/maven/plugins/maven-plugins/24/maven-plugins-24.pom
05-Oct-2017 13:49:52 [INFO] Downloaded: https://repo.maven.apache.org/maven2/org/apache/maven/plugins/maven-plugins/24/maven-plugins-24.pom (11 KB at 753.8 KB/sec)
05-Oct-2017 13:49:52 [INFO] Downloading: https://repo.maven.apache.org/maven2/org/apache/maven/plugins/maven-compiler-plugin/3.1/maven-compiler-plugin-3.1.jar
05-Oct-2017 13:49:52 [INFO] Downloaded: https://repo.maven.apache.org/maven2/org/apache/maven/plugins/maven-compiler-plugin/3.1/maven-compiler-plugin-3.1.jar (42 KB at 2097.1 KB/sec)
05-Oct-2017 13:49:52 [INFO] Downloading: https://repo.maven.apache.org/maven2/org/igniterealtime/smack/smack-core/4.2.1/smack-core-4.2.1.pom
05-Oct-2017 13:49:52 [INFO] Downloaded: https://repo.maven.apache.org/maven2/org/igniterealtime/smack/smack-core/4.2.1/smack-core-4.2.1.pom (4 KB at 34.6 KB/sec)
05-Oct-2017 13:49:52 [INFO] Downloading: https://repo.maven.apache.org/maven2/org/jxmpp/jxmpp-core/0.5.0/jxmpp-core-0.5.0.pom
05-Oct-2017 13:49:52 [INFO] Downloaded: https://repo.maven.apache.org/maven2/org/jxmpp/jxmpp-core/0.5.0/jxmpp-core-0.5.0.pom (2 KB at 143.3 KB/sec)
05-Oct-2017 13:49:52 [INFO] Downloading: https://repo.maven.apache.org/maven2/org/jxmpp/jxmpp-util-cache/0.5.0/jxmpp-util-cache-0.5.0.pom
05-Oct-2017 13:49:52 [INFO] Downloaded: https://repo.maven.apache.org/maven2/org/jxmpp/jxmpp-util-cache/0.5.0/jxmpp-util-cache-0.5.0.pom (2 KB at 145.3 KB/sec)
05-Oct-2017 13:49:52 [INFO] Downloading: https://repo.maven.apache.org/maven2/org/jxmpp/jxmpp-jid/0.5.0/jxmpp-jid-0.5.0.pom
05-Oct-2017 13:49:52 [INFO] Downloaded: https://repo.maven.apache.org/maven2/org/jxmpp/jxmpp-jid/0.5.0/jxmpp-jid-0.5.0.pom (3 KB at 156.2 KB/sec)
05-Oct-2017 13:49:52 [INFO] Downloading: https://repo.maven.apache.org/maven2/org/igniterealtime/smack/smack-im/4.2.1/smack-im-4.2.1.pom
05-Oct-2017 13:49:52 [INFO] Downloaded: https://repo.maven.apache.org/maven2/org/igniterealtime/smack/smack-im/4.2.1/smack-im-4.2.1.pom (3 KB at 153.0 KB/sec)
05-Oct-2017 13:49:52 [INFO] Downloading: https://repo.maven.apache.org/maven2/org/igniterealtime/smack/smack-tcp/4.2.1/smack-tcp-4.2.1.pom
05-Oct-2017 13:49:52 [INFO] Downloaded: https://repo.maven.apache.org/maven2/org/igniterealtime/smack/smack-tcp/4.2.1/smack-tcp-4.2.1.pom (2 KB at 82.0 KB/sec)
05-Oct-2017 13:49:52 [INFO] Downloading: https://repo.maven.apache.org/maven2/org/igniterealtime/smack/smack-core/4.2.1/smack-core-4.2.1.jar
05-Oct-2017 13:49:52 [INFO] Downloading: https://repo.maven.apache.org/maven2/org/jxmpp/jxmpp-core/0.5.0/jxmpp-core-0.5.0.jar
05-Oct-2017 13:49:52 [INFO] Downloading: https://repo.maven.apache.org/maven2/org/jxmpp/jxmpp-util-cache/0.5.0/jxmpp-util-cache-0.5.0.jar
05-Oct-2017 13:49:52 [INFO] Downloading: https://repo.maven.apache.org/maven2/org/jxmpp/jxmpp-jid/0.5.0/jxmpp-jid-0.5.0.jar
05-Oct-2017 13:49:52 [INFO] Downloading: https://repo.maven.apache.org/maven2/org/igniterealtime/smack/smack-im/4.2.1/smack-im-4.2.1.jar
05-Oct-2017 13:49:52 [INFO] Downloaded: https://repo.maven.apache.org/maven2/org/jxmpp/jxmpp-core/0.5.0/jxmpp-core-0.5.0.jar (25 KB at 1232.9 KB/sec)
05-Oct-2017 13:49:52 [INFO] Downloading: https://repo.maven.apache.org/maven2/org/igniterealtime/smack/smack-tcp/4.2.1/smack-tcp-4.2.1.jar
05-Oct-2017 13:49:52 [INFO] Downloaded: https://repo.maven.apache.org/maven2/org/jxmpp/jxmpp-util-cache/0.5.0/jxmpp-util-cache-0.5.0.jar (8 KB at 65.9 KB/sec)
05-Oct-2017 13:49:52 [INFO] Downloaded: https://repo.maven.apache.org/maven2/org/jxmpp/jxmpp-jid/0.5.0/jxmpp-jid-0.5.0.jar (24 KB at 174.3 KB/sec)
05-Oct-2017 13:49:53 [INFO] Downloaded: https://repo.maven.apache.org/maven2/org/igniterealtime/smack/smack-tcp/4.2.1/smack-tcp-4.2.1.jar (59 KB at 362.1 KB/sec)
05-Oct-2017 13:49:53 [INFO] Downloaded: https://repo.maven.apache.org/maven2/org/igniterealtime/smack/smack-im/4.2.1/smack-im-4.2.1.jar (70 KB at 406.8 KB/sec)
05-Oct-2017 13:49:53 [INFO] Downloaded: https://repo.maven.apache.org/maven2/org/igniterealtime/smack/smack-core/4.2.1/smack-core-4.2.1.jar (348 KB at 1976.4 KB/sec)
05-Oct-2017 13:49:53 [INFO]
05-Oct-2017 13:49:53 [INFO] --- maven-clean-plugin:2.5:clean (default-clean) @ criptida ---
05-Oct-2017 13:49:53 [INFO] Deleting /var/atlassian/bamboo-home/xml-data/build-dir/SPARK-CI-JOB1/target
05-Oct-2017 13:49:53 [INFO]
05-Oct-2017 13:49:53 [INFO] --- maven-resources-plugin:2.6:resources (default-resources) @ criptida ---
05-Oct-2017 13:49:53 [INFO] Using 'UTF-8' encoding to copy filtered resources.
05-Oct-2017 13:49:53 [INFO] skip non existing resourceDirectory /var/atlassian/bamboo-home/xml-data/build-dir/SPARK-CI-JOB1/src/main/resources
05-Oct-2017 13:49:53 [INFO]
05-Oct-2017 13:49:53 [INFO] --- maven-compiler-plugin:3.1:compile (default-compile) @ criptida ---
05-Oct-2017 13:49:53 [INFO] Downloading: https://repo.maven.apache.org/maven2/org/apache/maven/maven-toolchain/1.0/maven-toolchain-1.0.pom
05-Oct-2017 13:49:53 [INFO] Downloaded: https://repo.maven.apache.org/maven2/org/apache/maven/maven-toolchain/1.0/maven-toolchain-1.0.pom (4 KB at 196.1 KB/sec)
05-Oct-2017 13:49:53 [INFO] Downloading: https://repo.maven.apache.org/maven2/org/codehaus/plexus/plexus-compiler-api/2.2/plexus-compiler-api-2.2.pom
05-Oct-2017 13:49:53 [INFO] Downloaded: https://repo.maven.apache.org/maven2/org/codehaus/plexus/plexus-compiler-api/2.2/plexus-compiler-api-2.2.pom (865 B at 65.0 KB/sec)
05-Oct-2017 13:49:53 [INFO] Downloading: https://repo.maven.apache.org/maven2/org/codehaus/plexus/plexus-compiler/2.2/plexus-compiler-2.2.pom
05-Oct-2017 13:49:53 [INFO] Downloaded: https://repo.maven.apache.org/maven2/org/codehaus/plexus/plexus-compiler/2.2/plexus-compiler-2.2.pom (4 KB at 441.2 KB/sec)
05-Oct-2017 13:49:53 [INFO] Downloading: https://repo.maven.apache.org/maven2/org/codehaus/plexus/plexus-compiler-manager/2.2/plexus-compiler-manager-2.2.pom
05-Oct-2017 13:49:53 [INFO] Downloaded: https://repo.maven.apache.org/maven2/org/codehaus/plexus/plexus-compiler-manager/2.2/plexus-compiler-manager-2.2.pom (690 B at 74.9 KB/sec)
05-Oct-2017 13:49:53 [INFO] Downloading: https://repo.maven.apache.org/maven2/org/codehaus/plexus/plexus-compiler-javac/2.2/plexus-compiler-javac-2.2.pom
05-Oct-2017 13:49:53 [INFO] Downloaded: https://repo.maven.apache.org/maven2/org/codehaus/plexus/plexus-compiler-javac/2.2/plexus-compiler-javac-2.2.pom (769 B at 57.8 KB/sec)
05-Oct-2017 13:49:53 [INFO] Downloading: https://repo.maven.apache.org/maven2/org/codehaus/plexus/plexus-compilers/2.2/plexus-compilers-2.2.pom
05-Oct-2017 13:49:53 [INFO] Downloaded: https://repo.maven.apache.org/maven2/org/codehaus/plexus/plexus-compilers/2.2/plexus-compilers-2.2.pom (2 KB at 134.7 KB/sec)
05-Oct-2017 13:49:53 [INFO] Downloading: https://repo.maven.apache.org/maven2/org/codehaus/plexus/plexus-utils/1.5.1/plexus-utils-1.5.1.jar
05-Oct-2017 13:49:53 [INFO] Downloading: https://repo.maven.apache.org/maven2/org/apache/maven/maven-toolchain/1.0/maven-toolchain-1.0.jar
05-Oct-2017 13:49:53 [INFO] Downloading: https://repo.maven.apache.org/maven2/org/apache/maven/shared/maven-shared-utils/0.1/maven-shared-utils-0.1.jar
05-Oct-2017 13:49:53 [INFO] Downloading: https://repo.maven.apache.org/maven2/org/codehaus/plexus/plexus-compiler-api/2.2/plexus-compiler-api-2.2.jar
05-Oct-2017 13:49:53 [INFO] Downloading: https://repo.maven.apache.org/maven2/org/codehaus/plexus/plexus-compiler-manager/2.2/plexus-compiler-manager-2.2.jar
05-Oct-2017 13:49:53 [INFO] Downloaded: https://repo.maven.apache.org/maven2/org/apache/maven/maven-toolchain/1.0/maven-toolchain-1.0.jar (33 KB at 1108.3 KB/sec)
05-Oct-2017 13:49:53 [INFO] Downloading: https://repo.maven.apache.org/maven2/org/codehaus/plexus/plexus-compiler-javac/2.2/plexus-compiler-javac-2.2.jar
05-Oct-2017 13:49:53 [INFO] Downloaded: https://repo.maven.apache.org/maven2/org/codehaus/plexus/plexus-compiler-api/2.2/plexus-compiler-api-2.2.jar (25 KB at 677.9 KB/sec)
05-Oct-2017 13:49:53 [INFO] Downloaded: https://repo.maven.apache.org/maven2/org/codehaus/plexus/plexus-utils/1.5.1/plexus-utils-1.5.1.jar (206 KB at 4676.0 KB/sec)
05-Oct-2017 13:49:53 [INFO] Downloaded: https://repo.maven.apache.org/maven2/org/codehaus/plexus/plexus-compiler-javac/2.2/plexus-compiler-javac-2.2.jar (19 KB at 500.7 KB/sec)
05-Oct-2017 13:49:53 [INFO] Downloaded: https://repo.maven.apache.org/maven2/org/apache/maven/shared/maven-shared-utils/0.1/maven-shared-utils-0.1.jar (151 KB at 3509.2 KB/sec)
05-Oct-2017 13:49:53 [INFO] Downloaded: https://repo.maven.apache.org/maven2/org/codehaus/plexus/plexus-compiler-manager/2.2/plexus-compiler-manager-2.2.jar (5 KB at 103.6 KB/sec)
05-Oct-2017 13:49:53 [INFO] Changes detected - recompiling the module!
05-Oct-2017 13:49:53 [INFO] Compiling 2 source files to /var/atlassian/bamboo-home/xml-data/build-dir/SPARK-CI-JOB1/target/classes
05-Oct-2017 13:49:54 [INFO] -------------------------------------------------------------
05-Oct-2017 13:49:54 [ERROR] COMPILATION ERROR :
05-Oct-2017 13:49:54 [INFO] -------------------------------------------------------------
05-Oct-2017 13:49:54 [ERROR] /var/atlassian/bamboo-home/xml-data/build-dir/SPARK-CI-JOB1/src/main/java/com/cripto/criptida/App.java:[33,17] ';' expected
05-Oct-2017 13:49:54 [INFO] 1 error
05-Oct-2017 13:49:54 [INFO] -------------------------------------------------------------
05-Oct-2017 13:49:54 [INFO] ------------------------------------------------------------------------
05-Oct-2017 13:49:54 [INFO] BUILD FAILURE
05-Oct-2017 13:49:54 [INFO] ------------------------------------------------------------------------
05-Oct-2017 13:49:54 [INFO] Total time: 2.366 s
05-Oct-2017 13:49:54 [INFO] Finished at: 2017-10-05T13:49:54+00:00
05-Oct-2017 13:49:54 [INFO] Final Memory: 16M/158M
05-Oct-2017 13:49:54 [INFO] ------------------------------------------------------------------------
05-Oct-2017 13:49:54 [ERROR] Failed to execute goal org.apache.maven.plugins:maven-compiler-plugin:3.1:compile (default-compile) on project criptida: Compilation failure
05-Oct-2017 13:49:54 [ERROR] /var/atlassian/bamboo-home/xml-data/build-dir/SPARK-CI-JOB1/src/main/java/com/cripto/criptida/App.java:[33,17] ';' expected
05-Oct-2017 13:49:54 [ERROR] -> [Help 1]
05-Oct-2017 13:49:54 [ERROR]
05-Oct-2017 13:49:54 [ERROR] To see the full stack trace of the errors, re-run Maven with the -e switch.
05-Oct-2017 13:49:54 [ERROR] Re-run Maven using the -X switch to enable full debug logging.
05-Oct-2017 13:49:54 [ERROR]
05-Oct-2017 13:49:54 [ERROR] For more information about the errors and possible solutions, please read the following articles:
05-Oct-2017 13:49:54 [ERROR] [Help 1] http://cwiki.apache.org/confluence/display/MAVEN/MojoFailureException
05-Oct-2017 13:49:54 Failing task since return code of [/opt/maven/bin/mvn --batch-mode -Djava.io.tmpdir=/opt/atlassian/bamboo/temp/SPARK-CI-JOB1 clean package] was 1 while expected 0
05-Oct-2017 13:49:54 Parsing test results under /var/atlassian/bamboo-home/xml-data/build-dir/SPARK-CI-JOB1...
05-Oct-2017 13:49:54 File /var/atlassian/bamboo-home/xml-data/build-dir/SPARK-CI-JOB1/core/target/surefire-reports/TEST-org.jivesoftware.spark.plugin.PluginDependencyTest.xml was ignored because it was modified (2017-09-28 13:32:02.000) before task started (2017-10-05 13:49:49.686)
05-Oct-2017 13:49:54 File /var/atlassian/bamboo-home/xml-data/build-dir/SPARK-CI-JOB1/plugins/translator/target/surefire-reports/TEST-com.jivesoftware.spark.translator.TestTranslator.xml was ignored because it was modified (2017-09-28 13:32:11.000) before task started (2017-10-05 13:49:49.686)
05-Oct-2017 13:49:54 Finished task 'Build' with result: Failed
05-Oct-2017 13:49:54 Running post build plugin 'NCover Results Collector'
05-Oct-2017 13:49:54 Running post build plugin 'Artifact Copier'
05-Oct-2017 13:49:54 Publishing an artifact: Distribution Base
05-Oct-2017 13:49:56 Finished publishing of artifact Shared artifact: [Distribution Base], pattern: [**/*] anchored at: [distribution/target/distribution-base] in 2.435 s
05-Oct-2017 13:49:56 Running post build plugin 'npm Cache Cleanup'
05-Oct-2017 13:49:56 Running post build plugin 'Clover Results Collector'
05-Oct-2017 13:49:56 Running post build plugin 'Docker Container Cleanup'
05-Oct-2017 13:49:56 Finalising the build...
05-Oct-2017 13:49:56 Stopping timer.
05-Oct-2017 13:49:56 Build SPARK-CI-JOB1-80 completed.
05-Oct-2017 13:49:56 Running on server: post build plugin 'NCover Results Collector'
05-Oct-2017 13:49:56 Running on server: post build plugin 'Build Hanging Detection Configuration'
05-Oct-2017 13:49:56 Running on server: post build plugin 'Clover Delta Calculator'
05-Oct-2017 13:49:56 Running on server: post build plugin 'Maven Dependencies Postprocessor'
05-Oct-2017 13:49:56 All post build plugins have finished
05-Oct-2017 13:49:56 Generating build results summary...
05-Oct-2017 13:49:56 Saving build results to disk...
05-Oct-2017 13:49:56 Logging substituted variables...
05-Oct-2017 13:49:57 Indexing build results...
05-Oct-2017 13:49:57 Finished building SPARK-CI-JOB1-80.