Builds the Spark Install4j distributables once every day.

Build: #1622 failed Manual run by wroot

Stages & jobs

  1. Build Stage

  2. Post Build

Logs

The following logs have been generated by the jobs in this plan.
  • Expand all
  • Collapse all
Job Logs
Collapse Maven build Build Stage Download or View
24-Dec-2020 10:15:43 [INFO] Window Flashing Plugin 1.3 ......................... SKIPPED
24-Dec-2020 10:15:43 [INFO] Growl 2.4 .......................................... SKIPPED
24-Dec-2020 10:15:43 [INFO] Pade Meetings Plugin 0.0.8 ......................... SKIPPED
24-Dec-2020 10:15:43 [INFO] Reversi 1.6 ........................................ SKIPPED
24-Dec-2020 10:15:43 [INFO] Roar!!! 0.6 ........................................ SKIPPED
24-Dec-2020 10:15:43 [INFO] TicTacToe 0.3 ...................................... SKIPPED
24-Dec-2020 10:15:43 [INFO] Transfer Guard 1.2 ................................. SKIPPED
24-Dec-2020 10:15:43 [INFO] Translator Plugin 1.7 .............................. SKIPPED
24-Dec-2020 10:15:43 [INFO] Spark Distribution 2.9.5-SNAPSHOT .................. SKIPPED
24-Dec-2020 10:15:43 [INFO] ------------------------------------------------------------------------
24-Dec-2020 10:15:43 [INFO] BUILD FAILURE
24-Dec-2020 10:15:43 [INFO] ------------------------------------------------------------------------
24-Dec-2020 10:15:43 [INFO] Total time:  9.747 s
24-Dec-2020 10:15:43 [INFO] Finished at: 2020-12-24T10:15:43Z
24-Dec-2020 10:15:43 [INFO] ------------------------------------------------------------------------
24-Dec-2020 10:15:43 [ERROR] Failed to execute goal on project spark-core: Could not resolve dependencies for project org.igniterealtime.spark:spark-core:jar:2.9.5-SNAPSHOT: The following artifacts could not be resolved: org.igniterealtime.smack:smack-java7:jar:4.4.0, org.igniterealtime.smack:smack-compression-jzlib:jar:4.4.0: Could not find artifact org.igniterealtime.smack:smack-java7:jar:4.4.0 in maven-snapshots-repo (https://oss.sonatype.org/content/repositories/snapshots) -> [Help 1]
24-Dec-2020 10:15:43 [ERROR]
24-Dec-2020 10:15:43 [ERROR] To see the full stack trace of the errors, re-run Maven with the -e switch.
24-Dec-2020 10:15:43 [ERROR] Re-run Maven using the -X switch to enable full debug logging.
24-Dec-2020 10:15:43 [ERROR]
24-Dec-2020 10:15:43 [ERROR] For more information about the errors and possible solutions, please read the following articles:
24-Dec-2020 10:15:43 [ERROR] [Help 1] http://cwiki.apache.org/confluence/display/MAVEN/DependencyResolutionException
24-Dec-2020 10:15:43 [ERROR]
24-Dec-2020 10:15:43 [ERROR] After correcting the problems, you can resume the build with the command
24-Dec-2020 10:15:43 [ERROR]   mvn <goals> -rf :spark-core