Nightly Distribution of the master branch

Stages & jobs

  1. Default Stage

  2. Deploy

Logs

The following logs have been generated by the jobs in this plan.
  • Expand all
  • Collapse all
Job Logs
Collapse Default Job Default Stage Download or View
21-Dec-2021 01:03:56         at org.gradle.execution.plan.DefaultPlanExecutor$ExecutorWorker.lambda$run$0(DefaultPlanExecutor.java:127)
21-Dec-2021 01:03:56         at org.gradle.execution.plan.DefaultPlanExecutor$ExecutorWorker.execute(DefaultPlanExecutor.java:191)
21-Dec-2021 01:03:56         at org.gradle.execution.plan.DefaultPlanExecutor$ExecutorWorker.executeNextNode(DefaultPlanExecutor.java:182)
21-Dec-2021 01:03:56         at org.gradle.execution.plan.DefaultPlanExecutor$ExecutorWorker.run(DefaultPlanExecutor.java:124)
21-Dec-2021 01:03:56         at org.gradle.internal.concurrent.ExecutorPolicy$CatchAndRecordFailures.onExecute(ExecutorPolicy.java:64)
21-Dec-2021 01:03:56         at org.gradle.internal.concurrent.ManagedExecutorImpl$1.run(ManagedExecutorImpl.java:48)
21-Dec-2021 01:03:56         at org.gradle.internal.concurrent.ThreadFactoryImpl$ManagedThreadRunnable.run(ThreadFactoryImpl.java:56)
21-Dec-2021 01:03:56 Caused by: org.gradle.process.internal.ExecException: Process 'command '/usr/lib/jvm/java-11-amazon-corretto.x86_64/bin/javadoc'' finished with non-zero exit value 1
21-Dec-2021 01:03:56         at org.gradle.process.internal.DefaultExecHandle$ExecResultImpl.assertNormalExitValue(DefaultExecHandle.java:417)
21-Dec-2021 01:03:56         at org.gradle.process.internal.DefaultExecAction.execute(DefaultExecAction.java:38)
21-Dec-2021 01:03:56         at org.gradle.api.tasks.javadoc.internal.JavadocGenerator.execute(JavadocGenerator.java:53)
21-Dec-2021 01:03:56         ... 97 more
21-Dec-2021 01:03:56
21-Dec-2021 01:03:56
21-Dec-2021 01:03:56 * Get more help at https://help.gradle.org
21-Dec-2021 01:03:56
21-Dec-2021 01:03:56 > Task :javadocAll FAILED
21-Dec-2021 01:03:56
21-Dec-2021 01:03:56 Deprecated Gradle features were used in this build, making it incompatible with Gradle 7.0.
21-Dec-2021 01:03:56 Use '--warning-mode all' to show the individual deprecation warnings.
21-Dec-2021 01:03:56 See https://docs.gradle.org/6.4.1/userguide/command_line_interface.html#sec:command_line_warnings
21-Dec-2021 01:03:56 148 actionable tasks: 148 executed
21-Dec-2021 01:03:56
21-Dec-2021 01:03:56 BUILD FAILED in 3m 51s
21-Dec-2021 01:03:57 Unable to publish artifact [Project binary files]: the source directory /var/atlassian/bamboo-home/local-working-dir/SMACK-NIGHTLY-JOB1/build/distributions does not exist.