Nightly Distribution of the master branch

Build: #1856 failed

Job: Default Job failed

Stages & jobs

  1. Default Stage

  2. Deploy

Build log

The build generated 690 lines of output. Download or view full build log.

03-Mar-2022 01:03:44 Build Smack - Nightly Binary Distribution Build - Default Job #1856 (SMACK-NIGHTLY-JOB1-1856) started building on agent Default Agent, bamboo version: 8.1.1
03-Mar-2022 01:03:44
03-Mar-2022 01:03:44 Build working directory is /var/atlassian/bamboo-home/local-working-dir/SMACK-NIGHTLY-JOB1
03-Mar-2022 01:03:44 Executing build Smack - Nightly Binary Distribution Build - Default Job #1856 (SMACK-NIGHTLY-JOB1-1856)
03-Mar-2022 01:03:44 Starting task 'Checkout Default Repository' of type 'com.atlassian.bamboo.plugins.vcs:task.vcs.checkout'
03-Mar-2022 01:03:44 Checking out into /var/atlassian/bamboo-home/local-working-dir/SMACK-NIGHTLY-JOB1
03-Mar-2022 01:03:44 Updating source code to revision: 01cd0507b6ca1473a3ec3d30bd56dfbd6bb19e55
03-Mar-2022 01:03:44 Fetching 'refs/heads/master' from 'https://github.com/igniterealtime/Smack.git'.
03-Mar-2022 01:03:45 Checking out revision 01cd0507b6ca1473a3ec3d30bd56dfbd6bb19e55.
03-Mar-2022 01:03:45 error: object directory /var/atlassian/bamboo-home/xml-data/build-dir/_git-repositories-cache/47a8451c7dd41a75aeccbfabacda90372f436d0d/.git/objects does not exist; check .git/objects/info/alternates
03-Mar-2022 01:03:45 error: object directory /var/atlassian/bamboo-home/xml-data/build-dir/_git-repositories-cache/47a8451c7dd41a75aeccbfabacda90372f436d0d/.git/objects does not exist; check .git/objects/info/alternates
03-Mar-2022 01:03:45 error: object directory /var/atlassian/bamboo-home/xml-data/build-dir/_git-repositories-cache/47a8451c7dd41a75aeccbfabacda90372f436d0d/.git/objects does not exist; check .git/objects/info/alternates
03-Mar-2022 01:03:45 From file:///var/atlassian/bamboo-home/local-working-dir/_git-repositories-cache/47a8451c7dd41a75aeccbfabacda90372f436d0d
03-Mar-2022 01:03:45    a15110694..01cd0507b  master     -> origin/master
03-Mar-2022 01:03:45    4d026d8ae..cccf3ce5f  4.4        -> origin/4.4
03-Mar-2022 01:03:45 * [new tag]             4.4.5      -> 4.4.5
03-Mar-2022 01:03:45 error: object directory /var/atlassian/bamboo-home/xml-data/build-dir/_git-repositories-cache/47a8451c7dd41a75aeccbfabacda90372f436d0d/.git/objects does not exist; check .git/objects/info/alternates
03-Mar-2022 01:03:45 error: object directory /var/atlassian/bamboo-home/xml-data/build-dir/_git-repositories-cache/47a8451c7dd41a75aeccbfabacda90372f436d0d/.git/objects does not exist; check .git/objects/info/alternates
03-Mar-2022 01:03:45 Already on 'master'
03-Mar-2022 01:03:45 Your branch is behind 'origin/master' by 5 commits, and can be fast-forwarded.
03-Mar-2022 01:03:45   (use "git pull" to update your local branch)
03-Mar-2022 01:03:45 error: object directory /var/atlassian/bamboo-home/xml-data/build-dir/_git-repositories-cache/47a8451c7dd41a75aeccbfabacda90372f436d0d/.git/objects does not exist; check .git/objects/info/alternates
03-Mar-2022 01:03:45 HEAD is now at 01cd0507b Smack 4.5.0-alpha2-SNAPSHOT
03-Mar-2022 01:03:45 Updated source code to revision: 01cd0507b6ca1473a3ec3d30bd56dfbd6bb19e55
03-Mar-2022 01:03:45 Finished task 'Checkout Default Repository' with result: Success
03-Mar-2022 01:03:45 Running pre-build action: VCS Version Collector
03-Mar-2022 01:03:45 Running pre-build action: Build Log Labeller Pre Build Action
03-Mar-2022 01:03:45 Skipping execution of task 'gradle' as it is disabled
03-Mar-2022 01:03:45 Starting task 'Gradle' of type 'com.atlassian.bamboo.plugins.scripttask:task.builder.command'
03-Mar-2022 01:03:45
Beginning to execute external process for build 'Smack - Nightly Binary Distribution Build - Default Job #1856 (SMACK-NIGHTLY-JOB1-1856)'
... running command line:
/opt/gradle/bin/gradle --stacktrace clean distributionZip javadocAll jacocoRootReport
... in: /var/atlassian/bamboo-home/local-working-dir/SMACK-NIGHTLY-JOB1
03-Mar-2022 01:03:45 NOTE: Picked up JDK_JAVA_OPTIONS:  --add-opens=java.base/java.lang=ALL-UNNAMED --add-opens=java.base/java.io=ALL-UNNAMED --add-opens=java.base/java.util=ALL-UNNAMED --add-opens=java.base/java.util.concurrent=ALL-UNNAMED --add-opens=java.rmi/sun.rmi.transport=ALL-UNNAMED
03-Mar-2022 01:03:45 OpenJDK 64-Bit Server VM warning: Ignoring option MaxPermSize; support was removed in 8.0
03-Mar-2022 01:03:46 Starting a Gradle Daemon (subsequent builds will be faster)
03-Mar-2022 01:04:02 > Task :clean
03-Mar-2022 01:04:02 > Task :smack-android:clean
03-Mar-2022 01:04:02 > Task :smack-android-extensions:clean
03-Mar-2022 01:04:03 > Task :smack-bosh:clean
03-Mar-2022 01:04:03 > Task :smack-core:clean
03-Mar-2022 01:04:03 > Task :smack-debug:clean
03-Mar-2022 01:04:03 > Task :smack-debug-slf4j:clean
03-Mar-2022 01:04:03 > Task :smack-experimental:clean
03-Mar-2022 01:04:03 > Task :smack-extensions:clean
03-Mar-2022 01:04:03 > Task :smack-im:clean
03-Mar-2022 01:04:03 > Task :smack-integration-test:clean
03-Mar-2022 01:04:03 > Task :smack-java8:clean
03-Mar-2022 01:04:03 > Task :smack-java8-full:cleanGenerateFiles
03-Mar-2022 01:04:03 > Task :smack-java8-full:clean
03-Mar-2022 01:04:04 > Task :smack-jingle-old:clean
03-Mar-2022 01:04:04 > Task :smack-legacy:clean
03-Mar-2022 01:04:04 > Task :smack-omemo:clean
03-Mar-2022 01:04:04 > Task :smack-omemo-signal:clean
03-Mar-2022 01:04:04 > Task :smack-omemo-signal-integration-test:clean
03-Mar-2022 01:04:04 > Task :smack-openpgp:clean
03-Mar-2022 01:04:04 > Task :smack-repl:clean
03-Mar-2022 01:04:04 > Task :smack-resolver-dnsjava:clean
03-Mar-2022 01:04:04 > Task :smack-resolver-javax:clean
03-Mar-2022 01:04:04 > Task :smack-resolver-minidns:clean
03-Mar-2022 01:04:04 > Task :smack-resolver-minidns-dox:clean
03-Mar-2022 01:04:04 > Task :smack-sasl-javax:clean
03-Mar-2022 01:04:04 > Task :smack-sasl-provided:clean
03-Mar-2022 01:04:04 > Task :smack-streammanagement:clean
03-Mar-2022 01:04:04 > Task :smack-tcp:clean
03-Mar-2022 01:04:04 > Task :smack-websocket:clean
03-Mar-2022 01:04:04 > Task :smack-websocket-java11:clean
03-Mar-2022 01:04:04 > Task :smack-websocket-okhttp:clean
03-Mar-2022 01:04:04 > Task :smack-xmlparser:clean
03-Mar-2022 01:04:04 > Task :smack-xmlparser-stax:clean
03-Mar-2022 01:04:04 > Task :smack-xmlparser-xpp3:clean
03-Mar-2022 01:04:04 > Task :smack-core:createVersionResource
03-Mar-2022 01:04:06 > Task :smack-xmlparser:compileJava
03-Mar-2022 01:04:06 > Task :smack-xmlparser:processResources NO-SOURCE
03-Mar-2022 01:04:06 > Task :smack-xmlparser:classes
03-Mar-2022 01:04:07 > Task :smack-xmlparser:jar
03-Mar-2022 01:04:21 > Task :smack-core:compileJava
03-Mar-2022 01:04:21 > Task :smack-core:processResources
03-Mar-2022 01:04:21 > Task :smack-core:classes
03-Mar-2022 01:04:23 > Task :smack-core:jar
03-Mar-2022 01:04:26 > Task :smack-im:compileJava
03-Mar-2022 01:04:26 > Task :smack-im:processResources
03-Mar-2022 01:04:26 > Task :smack-im:classes
03-Mar-2022 01:04:26 > Task :smack-im:jar
03-Mar-2022 01:04:41 > Task :smack-extensions:compileJava
03-Mar-2022 01:04:41 > Task :smack-extensions:processResources
03-Mar-2022 01:04:41 > Task :smack-extensions:classes
03-Mar-2022 01:04:41 > Task :smack-extensions:jar
03-Mar-2022 01:04:50 > Task :smack-experimental:compileJava
03-Mar-2022 01:04:50 > Task :smack-experimental:processResources
03-Mar-2022 01:04:50 > Task :smack-experimental:classes
03-Mar-2022 01:04:51 > Task :smack-experimental:jar
03-Mar-2022 01:04:54 > Task :smack-openpgp:compileJava
03-Mar-2022 01:04:54 > Task :smack-openpgp:processResources
03-Mar-2022 01:04:54 > Task :smack-openpgp:classes
03-Mar-2022 01:04:54 > Task :smack-openpgp:jar
03-Mar-2022 01:04:55 > Task :smack-resolver-minidns:compileJava
03-Mar-2022 01:04:55 > Task :smack-resolver-minidns:processResources NO-SOURCE
03-Mar-2022 01:04:55 > Task :smack-resolver-minidns:classes
03-Mar-2022 01:04:55 > Task :smack-resolver-minidns:jar
03-Mar-2022 01:04:56 > Task :smack-sasl-provided:compileJava
03-Mar-2022 01:04:56 > Task :smack-sasl-provided:processResources NO-SOURCE
03-Mar-2022 01:04:56 > Task :smack-sasl-provided:classes
03-Mar-2022 01:04:56 > Task :smack-sasl-provided:jar
03-Mar-2022 01:04:57 > Task :smack-xmlparser-xpp3:compileJava
03-Mar-2022 01:04:58 > Task :smack-xmlparser-xpp3:processResources
03-Mar-2022 01:04:58 > Task :smack-xmlparser-xpp3:classes
03-Mar-2022 01:04:58 > Task :smack-xmlparser-xpp3:jar
03-Mar-2022 01:04:59 > Task :smack-android:compileJava
03-Mar-2022 01:04:59 > Task :smack-android:processResources NO-SOURCE
03-Mar-2022 01:04:59 > Task :smack-android:classes
03-Mar-2022 01:04:59 > Task :smack-android:jar
03-Mar-2022 01:04:59 > Task :smack-android:copyJavadocDocFiles NO-SOURCE
03-Mar-2022 01:05:01 > Task :smack-android:javadoc
03-Mar-2022 01:05:03 > Task :smack-android-extensions:compileJava
03-Mar-2022 01:05:03 > Task :smack-android-extensions:processResources NO-SOURCE
03-Mar-2022 01:05:03 > Task :smack-android-extensions:classes
03-Mar-2022 01:05:03 > Task :smack-android-extensions:copyJavadocDocFiles NO-SOURCE
03-Mar-2022 01:05:04 > Task :smack-android-extensions:javadoc
03-Mar-2022 01:05:06 > Task :smack-bosh:compileJava
03-Mar-2022 01:05:06 > Task :smack-bosh:processResources NO-SOURCE
03-Mar-2022 01:05:06 > Task :smack-bosh:classes
03-Mar-2022 01:05:06 > Task :smack-bosh:jar
03-Mar-2022 01:05:06 > Task :smack-bosh:copyJavadocDocFiles NO-SOURCE
03-Mar-2022 01:05:07 > Task :smack-bosh:javadoc
03-Mar-2022 01:05:07 > Task :smack-core:copyJavadocDocFiles NO-SOURCE
03-Mar-2022 01:05:14 > Task :smack-core:javadoc
03-Mar-2022 01:05:17 > Task :smack-debug:compileJava
03-Mar-2022 01:05:17 > Task :smack-debug:processResources
03-Mar-2022 01:05:17 > Task :smack-debug:classes
03-Mar-2022 01:05:17 > Task :smack-debug:jar
03-Mar-2022 01:05:17 > Task :smack-debug:copyJavadocDocFiles NO-SOURCE
03-Mar-2022 01:05:20 > Task :smack-debug:javadoc
03-Mar-2022 01:05:21 > Task :smack-debug-slf4j:compileJava
03-Mar-2022 01:05:21 > Task :smack-debug-slf4j:processResources NO-SOURCE
03-Mar-2022 01:05:21 > Task :smack-debug-slf4j:classes
03-Mar-2022 01:05:21 > Task :smack-debug-slf4j:copyJavadocDocFiles NO-SOURCE
03-Mar-2022 01:05:22 > Task :smack-debug-slf4j:javadoc
03-Mar-2022 01:05:22 > Task :smack-experimental:copyJavadocDocFiles NO-SOURCE
03-Mar-2022 01:05:28 > Task :smack-experimental:javadoc
03-Mar-2022 01:05:28 > Task :smack-extensions:copyJavadocDocFiles NO-SOURCE
03-Mar-2022 01:05:36 > Task :smack-extensions:javadoc
03-Mar-2022 01:05:36 > Task :smack-im:copyJavadocDocFiles NO-SOURCE
03-Mar-2022 01:05:39 > Task :smack-im:javadoc
03-Mar-2022 01:05:40 > Task :smack-resolver-javax:compileJava
03-Mar-2022 01:05:40 > Task :smack-resolver-javax:processResources NO-SOURCE
03-Mar-2022 01:05:40 > Task :smack-resolver-javax:classes
03-Mar-2022 01:05:40 > Task :smack-resolver-javax:jar
03-Mar-2022 01:05:41 > Task :smack-sasl-javax:compileJava
03-Mar-2022 01:05:41 > Task :smack-sasl-javax:processResources NO-SOURCE
03-Mar-2022 01:05:41 > Task :smack-sasl-javax:classes
03-Mar-2022 01:05:41 > Task :smack-sasl-javax:jar
03-Mar-2022 01:05:42 > Task :smack-xmlparser-stax:compileJava
03-Mar-2022 01:05:42 > Task :smack-xmlparser-stax:processResources
03-Mar-2022 01:05:42 > Task :smack-xmlparser-stax:classes
03-Mar-2022 01:05:42 > Task :smack-xmlparser-stax:jar
03-Mar-2022 01:05:43 > Task :smack-java8:compileJava
03-Mar-2022 01:05:43 > Task :smack-java8:processResources NO-SOURCE
03-Mar-2022 01:05:43 > Task :smack-java8:classes
03-Mar-2022 01:05:43 > Task :smack-java8:jar
03-Mar-2022 01:05:48 > Task :smack-legacy:compileJava
03-Mar-2022 01:05:48 > Task :smack-legacy:processResources
03-Mar-2022 01:05:48 > Task :smack-legacy:classes
03-Mar-2022 01:05:48 > Task :smack-legacy:jar
03-Mar-2022 01:05:53 > Task :smack-omemo:compileJava
03-Mar-2022 01:05:53 > Task :smack-omemo:processResources
03-Mar-2022 01:05:53 > Task :smack-omemo:classes
03-Mar-2022 01:05:53 > Task :smack-omemo:jar
03-Mar-2022 01:05:54 > Task :smack-resolver-minidns-dox:compileJava
03-Mar-2022 01:05:54 > Task :smack-resolver-minidns-dox:processResources NO-SOURCE
03-Mar-2022 01:05:54 > Task :smack-resolver-minidns-dox:classes
03-Mar-2022 01:05:54 > Task :smack-resolver-minidns-dox:jar
03-Mar-2022 01:05:55 > Task :smack-streammanagement:compileJava
03-Mar-2022 01:05:55 > Task :smack-streammanagement:processResources NO-SOURCE
03-Mar-2022 01:05:55 > Task :smack-streammanagement:classes
03-Mar-2022 01:05:55 > Task :smack-streammanagement:jar
03-Mar-2022 01:05:58 > Task :smack-tcp:compileJava
03-Mar-2022 01:05:58 > Task :smack-tcp:processResources
03-Mar-2022 01:05:58 > Task :smack-tcp:classes
03-Mar-2022 01:05:58 > Task :smack-tcp:jar
03-Mar-2022 01:06:00 > Task :smack-websocket:compileJava
03-Mar-2022 01:06:00 > Task :smack-websocket:processResources NO-SOURCE
03-Mar-2022 01:06:00 > Task :smack-websocket:classes
03-Mar-2022 01:06:00 > Task :smack-websocket:jar
03-Mar-2022 01:06:01 > Task :smack-websocket-okhttp:compileJava
03-Mar-2022 01:06:01 > Task :smack-websocket-okhttp:processResources
03-Mar-2022 01:06:01 > Task :smack-websocket-okhttp:classes
03-Mar-2022 01:06:01 > Task :smack-websocket-okhttp:jar
03-Mar-2022 01:06:02 > Task :smack-java8-full:compileJava
03-Mar-2022 01:06:02 > Task :smack-java8-full:processResources NO-SOURCE
03-Mar-2022 01:06:02 > Task :smack-java8-full:classes
03-Mar-2022 01:06:02 > Task :smack-java8-full:jar
03-Mar-2022 01:06:03 > Task :smack-resolver-dnsjava:compileJava
03-Mar-2022 01:06:03 > Task :smack-resolver-dnsjava:processResources NO-SOURCE
03-Mar-2022 01:06:03 > Task :smack-resolver-dnsjava:classes
03-Mar-2022 01:06:03 > Task :smack-resolver-dnsjava:jar
03-Mar-2022 01:06:04 > Task :smack-websocket-java11:compileJava
03-Mar-2022 01:06:04 > Task :smack-websocket-java11:processResources
03-Mar-2022 01:06:04 > Task :smack-websocket-java11:classes
03-Mar-2022 01:06:04 > Task :smack-websocket-java11:jar
03-Mar-2022 01:06:10 > Task :smack-integration-test:compileJava
03-Mar-2022 01:06:10 > Task :smack-integration-test:processResources NO-SOURCE
03-Mar-2022 01:06:10 > Task :smack-integration-test:classes
03-Mar-2022 01:06:10 > Task :smack-integration-test:jar
03-Mar-2022 01:06:10 > Task :smack-integration-test:copyJavadocDocFiles NO-SOURCE
03-Mar-2022 01:06:14 > Task :smack-integration-test:javadoc
03-Mar-2022 01:06:14 > Task :smack-java8:copyJavadocDocFiles NO-SOURCE
03-Mar-2022 01:06:14 > Task :smack-java8:javadoc SKIPPED
03-Mar-2022 01:06:15
03-Mar-2022 01:06:15 > Task :smack-java8-full:generateModularXmppClientToServerConnectionStateGraph
03-Mar-2022 01:06:15 NOTE: Picked up JDK_JAVA_OPTIONS:  --add-opens=java.base/java.lang=ALL-UNNAMED --add-opens=java.base/java.io=ALL-UNNAMED --add-opens=java.base/java.util=ALL-UNNAMED --add-opens=java.base/java.util.concurrent=ALL-UNNAMED --add-opens=java.rmi/sun.rmi.transport=ALL-UNNAMED
03-Mar-2022 01:06:15
03-Mar-2022 01:06:15 > Task :smack-java8-full:convertModularXmppClientToServerConnectionStateGraphDotToPng
03-Mar-2022 01:06:15 > Task :smack-java8-full:copyJavadocDocFiles
03-Mar-2022 01:06:18 > Task :smack-java8-full:javadoc
03-Mar-2022 01:06:23 > Task :smack-jingle-old:compileJava
03-Mar-2022 01:06:23 > Task :smack-jingle-old:processResources NO-SOURCE
03-Mar-2022 01:06:23 > Task :smack-jingle-old:classes
03-Mar-2022 01:06:23 > Task :smack-jingle-old:copyJavadocDocFiles NO-SOURCE
03-Mar-2022 01:06:27 > Task :smack-jingle-old:javadoc
03-Mar-2022 01:06:27 > Task :smack-legacy:copyJavadocDocFiles NO-SOURCE
03-Mar-2022 01:06:32 > Task :smack-legacy:javadoc
03-Mar-2022 01:06:32 > Task :smack-omemo:copyJavadocDocFiles NO-SOURCE
03-Mar-2022 01:06:35 > Task :smack-omemo:javadoc
03-Mar-2022 01:06:37 > Task :smack-omemo-signal:compileJava
03-Mar-2022 01:06:37 > Task :smack-omemo-signal:processResources NO-SOURCE
03-Mar-2022 01:06:37 > Task :smack-omemo-signal:classes
03-Mar-2022 01:06:37 > Task :smack-omemo-signal:jar
03-Mar-2022 01:06:37 > Task :smack-omemo-signal:copyJavadocDocFiles NO-SOURCE
03-Mar-2022 01:06:40 > Task :smack-omemo-signal:javadoc
03-Mar-2022 01:06:41 > Task :smack-omemo-signal-integration-test:compileJava
03-Mar-2022 01:06:41 > Task :smack-omemo-signal-integration-test:processResources NO-SOURCE
03-Mar-2022 01:06:41 > Task :smack-omemo-signal-integration-test:classes
03-Mar-2022 01:06:41 > Task :smack-omemo-signal-integration-test:copyJavadocDocFiles NO-SOURCE
03-Mar-2022 01:06:43 > Task :smack-omemo-signal-integration-test:javadoc
03-Mar-2022 01:06:43 > Task :smack-openpgp:copyJavadocDocFiles NO-SOURCE
03-Mar-2022 01:06:46 > Task :smack-openpgp:javadoc
03-Mar-2022 01:06:49 > Task :smack-repl:compileJava
03-Mar-2022 01:06:51
03-Mar-2022 01:06:51 > Task :smack-repl:compileScala
03-Mar-2022 01:06:51 NOTE: Picked up JDK_JAVA_OPTIONS:  --add-opens=java.base/java.lang=ALL-UNNAMED --add-opens=java.base/java.io=ALL-UNNAMED --add-opens=java.base/java.util=ALL-UNNAMED --add-opens=java.base/java.util.concurrent=ALL-UNNAMED --add-opens=java.rmi/sun.rmi.transport=ALL-UNNAMED
03-Mar-2022 01:06:57
03-Mar-2022 01:06:57 > Task :smack-repl:processResources NO-SOURCE
03-Mar-2022 01:06:57 > Task :smack-repl:classes
03-Mar-2022 01:06:57 > Task :smack-repl:copyJavadocDocFiles NO-SOURCE
03-Mar-2022 01:06:59 > Task :smack-repl:javadoc
03-Mar-2022 01:06:59 > Task :smack-resolver-dnsjava:copyJavadocDocFiles NO-SOURCE
03-Mar-2022 01:07:01 > Task :smack-resolver-dnsjava:javadoc
03-Mar-2022 01:07:01 > Task :smack-resolver-javax:copyJavadocDocFiles NO-SOURCE
03-Mar-2022 01:07:02 > Task :smack-resolver-javax:javadoc
03-Mar-2022 01:07:02 > Task :smack-resolver-minidns:copyJavadocDocFiles NO-SOURCE
03-Mar-2022 01:07:04 > Task :smack-resolver-minidns:javadoc
03-Mar-2022 01:07:04 > Task :smack-resolver-minidns-dox:copyJavadocDocFiles NO-SOURCE
03-Mar-2022 01:07:05 > Task :smack-resolver-minidns-dox:javadoc
03-Mar-2022 01:07:05 > Task :smack-sasl-javax:copyJavadocDocFiles NO-SOURCE
03-Mar-2022 01:07:08 > Task :smack-sasl-javax:javadoc
03-Mar-2022 01:07:08 > Task :smack-sasl-provided:copyJavadocDocFiles NO-SOURCE
03-Mar-2022 01:07:10 > Task :smack-sasl-provided:javadoc
03-Mar-2022 01:07:10 > Task :smack-streammanagement:copyJavadocDocFiles NO-SOURCE
03-Mar-2022 01:07:12 > Task :smack-streammanagement:javadoc
03-Mar-2022 01:07:12 > Task :smack-tcp:copyJavadocDocFiles
03-Mar-2022 01:07:14 > Task :smack-tcp:javadoc
03-Mar-2022 01:07:14 > Task :smack-websocket:copyJavadocDocFiles NO-SOURCE
03-Mar-2022 01:07:16 > Task :smack-websocket:javadoc
03-Mar-2022 01:07:16 > Task :smack-websocket-java11:copyJavadocDocFiles NO-SOURCE
03-Mar-2022 01:07:18 > Task :smack-websocket-java11:javadoc
03-Mar-2022 01:07:18 > Task :smack-websocket-okhttp:copyJavadocDocFiles NO-SOURCE
03-Mar-2022 01:07:20 > Task :smack-websocket-okhttp:javadoc
03-Mar-2022 01:07:20 > Task :smack-xmlparser:copyJavadocDocFiles NO-SOURCE
03-Mar-2022 01:07:21 > Task :smack-xmlparser:javadoc
03-Mar-2022 01:07:21 > Task :smack-xmlparser-stax:copyJavadocDocFiles NO-SOURCE
03-Mar-2022 01:07:23 > Task :smack-xmlparser-stax:javadoc
03-Mar-2022 01:07:23 > Task :smack-xmlparser-xpp3:copyJavadocDocFiles NO-SOURCE
03-Mar-2022 01:07:24 > Task :smack-xmlparser-xpp3:javadoc
03-Mar-2022 01:07:50 > Task :javadocAll
03-Mar-2022 01:07:50 > Task :prepareReleasedocs
03-Mar-2022 01:07:50 > Task :smack-android:assemble
03-Mar-2022 01:07:50 > Task :smack-android:animalsnifferMain UP-TO-DATE
03-Mar-2022 01:07:52 > Task :smack-android:checkstyleMain
03-Mar-2022 01:07:52 > Task :smack-android:compileTestFixturesJava NO-SOURCE
03-Mar-2022 01:07:52 > Task :smack-android:compileTestJava NO-SOURCE
03-Mar-2022 01:07:52 > Task :smack-android:processTestResources NO-SOURCE
03-Mar-2022 01:07:52 > Task :smack-android:testClasses UP-TO-DATE
03-Mar-2022 01:07:52 > Task :smack-android:checkstyleTest NO-SOURCE
03-Mar-2022 01:07:52 > Task :smack-android:processTestFixturesResources NO-SOURCE
03-Mar-2022 01:07:52 > Task :smack-android:testFixturesClasses UP-TO-DATE
03-Mar-2022 01:07:52 > Task :smack-android:checkstyleTestFixtures NO-SOURCE
03-Mar-2022 01:07:52 > Task :smack-android:clirr
03-Mar-2022 01:07:52 > Task :smack-android:testFixturesJar
03-Mar-2022 01:07:52 > Task :smack-android:test NO-SOURCE
03-Mar-2022 01:07:52 > Task :smack-android:check
03-Mar-2022 01:07:52 > Task :smack-android:build
03-Mar-2022 01:07:52 > Task :smack-android-extensions:jar
03-Mar-2022 01:07:52 > Task :smack-android-extensions:assemble
03-Mar-2022 01:07:52 > Task :smack-android-extensions:animalsnifferMain UP-TO-DATE
03-Mar-2022 01:07:53 > Task :smack-android-extensions:checkstyleMain
03-Mar-2022 01:07:53 > Task :smack-android-extensions:compileTestFixturesJava NO-SOURCE
03-Mar-2022 01:07:53 > Task :smack-android-extensions:compileTestJava NO-SOURCE
03-Mar-2022 01:07:53 > Task :smack-android-extensions:processTestResources NO-SOURCE
03-Mar-2022 01:07:53 > Task :smack-android-extensions:testClasses UP-TO-DATE
03-Mar-2022 01:07:53 > Task :smack-android-extensions:checkstyleTest NO-SOURCE
03-Mar-2022 01:07:53 > Task :smack-android-extensions:processTestFixturesResources NO-SOURCE
03-Mar-2022 01:07:53 > Task :smack-android-extensions:testFixturesClasses UP-TO-DATE
03-Mar-2022 01:07:53 > Task :smack-android-extensions:checkstyleTestFixtures NO-SOURCE
03-Mar-2022 01:07:53 > Task :smack-android-extensions:clirr
03-Mar-2022 01:07:53 > Task :smack-android-extensions:testFixturesJar
03-Mar-2022 01:07:53 > Task :smack-android-extensions:test NO-SOURCE
03-Mar-2022 01:07:53 > Task :smack-android-extensions:check
03-Mar-2022 01:07:53 > Task :smack-android-extensions:build
03-Mar-2022 01:07:53 > Task :smack-bosh:assemble
03-Mar-2022 01:07:53 > Task :smack-bosh:animalsnifferMain UP-TO-DATE
03-Mar-2022 01:07:53 > Task :smack-bosh:checkstyleMain
03-Mar-2022 01:07:53 > Task :smack-bosh:compileTestFixturesJava NO-SOURCE
03-Mar-2022 01:07:53 > Task :smack-bosh:compileTestJava NO-SOURCE
03-Mar-2022 01:07:53 > Task :smack-bosh:processTestResources NO-SOURCE
03-Mar-2022 01:07:53 > Task :smack-bosh:testClasses UP-TO-DATE
03-Mar-2022 01:07:53 > Task :smack-bosh:checkstyleTest NO-SOURCE
03-Mar-2022 01:07:53 > Task :smack-bosh:processTestFixturesResources NO-SOURCE
03-Mar-2022 01:07:53 > Task :smack-bosh:testFixturesClasses UP-TO-DATE
03-Mar-2022 01:07:53 > Task :smack-bosh:checkstyleTestFixtures NO-SOURCE
03-Mar-2022 01:07:53 > Task :smack-bosh:clirr
03-Mar-2022 01:07:53 > Task :smack-bosh:testFixturesJar
03-Mar-2022 01:07:53 > Task :smack-bosh:test NO-SOURCE
03-Mar-2022 01:07:53 > Task :smack-bosh:check
03-Mar-2022 01:07:53 > Task :smack-bosh:build
03-Mar-2022 01:07:53 > Task :smack-core:assemble
03-Mar-2022 01:07:54 > Task :smack-core:animalsnifferMain
03-Mar-2022 01:07:58
03-Mar-2022 01:07:58 FAILURE: Build failed with an exception.
03-Mar-2022 01:07:58
03-Mar-2022 01:07:58 * What went wrong:
03-Mar-2022 01:07:58 Execution failed for task ':smack-core:compileTestFixturesJava'.
03-Mar-2022 01:07:58 > Could not resolve all files for configuration ':smack-core:testFixturesCompileClasspath'.
03-Mar-2022 01:07:58    > Could not find jxmpp-jid-1.0.3-tests.jar (org.jxmpp:jxmpp-jid:1.0.3).
03-Mar-2022 01:07:58      Searched in the following locations:
03-Mar-2022 01:07:58          file:/home/bamboo/.m2/repository/org/jxmpp/jxmpp-jid/1.0.3/jxmpp-jid-1.0.3-tests.jar
03-Mar-2022 01:07:58
03-Mar-2022 01:07:58 * Try:
03-Mar-2022 01:07:58 Run with --info or --debug option to get more log output. Run with --scan to get full insights.
03-Mar-2022 01:07:58
03-Mar-2022 01:07:58 * Exception is:
03-Mar-2022 01:07:58 > Task :smack-core:checkstyleMain
03-Mar-2022 01:07:58 > Task :smack-core:compileTestFixturesJava FAILED
03-Mar-2022 01:07:58 org.gradle.api.tasks.TaskExecutionException: Execution failed for task ':smack-core:compileTestFixturesJava'.
03-Mar-2022 01:07:58         at org.gradle.api.internal.tasks.execution.CatchExceptionTaskExecuter.execute(CatchExceptionTaskExecuter.java:38)
03-Mar-2022 01:07:58         at org.gradle.api.internal.tasks.execution.EventFiringTaskExecuter$1.executeTask(EventFiringTaskExecuter.java:77)
03-Mar-2022 01:07:58         at org.gradle.api.internal.tasks.execution.EventFiringTaskExecuter$1.call(EventFiringTaskExecuter.java:55)
03-Mar-2022 01:07:58         at org.gradle.api.internal.tasks.execution.EventFiringTaskExecuter$1.call(EventFiringTaskExecuter.java:52)
03-Mar-2022 01:07:58         at org.gradle.internal.operations.DefaultBuildOperationExecutor$CallableBuildOperationWorker.execute(DefaultBuildOperationExecutor.java:416)
03-Mar-2022 01:07:58         at org.gradle.internal.operations.DefaultBuildOperationExecutor$CallableBuildOperationWorker.execute(DefaultBuildOperationExecutor.java:406)
03-Mar-2022 01:07:58         at org.gradle.internal.operations.DefaultBuildOperationExecutor$1.execute(DefaultBuildOperationExecutor.java:165)
03-Mar-2022 01:07:58         at org.gradle.internal.operations.DefaultBuildOperationExecutor.execute(DefaultBuildOperationExecutor.java:250)
03-Mar-2022 01:07:58         at org.gradle.internal.operations.DefaultBuildOperationExecutor.execute(DefaultBuildOperationExecutor.java:158)
03-Mar-2022 01:07:58         at org.gradle.internal.operations.DefaultBuildOperationExecutor.call(DefaultBuildOperationExecutor.java:102)
03-Mar-2022 01:07:58         at org.gradle.internal.operations.DelegatingBuildOperationExecutor.call(DelegatingBuildOperationExecutor.java:36)
03-Mar-2022 01:07:58         at org.gradle.api.internal.tasks.execution.EventFiringTaskExecuter.execute(EventFiringTaskExecuter.java:52)
03-Mar-2022 01:07:58         at org.gradle.execution.plan.LocalTaskNodeExecutor.execute(LocalTaskNodeExecutor.java:41)
03-Mar-2022 01:07:58         at org.gradle.execution.taskgraph.DefaultTaskExecutionGraph$InvokeNodeExecutorsAction.execute(DefaultTaskExecutionGraph.java:370)
03-Mar-2022 01:07:58         at org.gradle.execution.taskgraph.DefaultTaskExecutionGraph$InvokeNodeExecutorsAction.execute(DefaultTaskExecutionGraph.java:357)
03-Mar-2022 01:07:58         at org.gradle.execution.taskgraph.DefaultTaskExecutionGraph$BuildOperationAwareExecutionAction.execute(DefaultTaskExecutionGraph.java:350)
03-Mar-2022 01:07:58         at org.gradle.execution.taskgraph.DefaultTaskExecutionGraph$BuildOperationAwareExecutionAction.execute(DefaultTaskExecutionGraph.java:336)
03-Mar-2022 01:07:58         at org.gradle.execution.plan.DefaultPlanExecutor$ExecutorWorker.lambda$run$0(DefaultPlanExecutor.java:127)
03-Mar-2022 01:07:58         at org.gradle.execution.plan.DefaultPlanExecutor$ExecutorWorker.execute(DefaultPlanExecutor.java:191)
03-Mar-2022 01:07:58         at org.gradle.execution.plan.DefaultPlanExecutor$ExecutorWorker.executeNextNode(DefaultPlanExecutor.java:182)
03-Mar-2022 01:07:58         at org.gradle.execution.plan.DefaultPlanExecutor$ExecutorWorker.run(DefaultPlanExecutor.java:124)
03-Mar-2022 01:07:58         at org.gradle.execution.plan.DefaultPlanExecutor.process(DefaultPlanExecutor.java:72)
03-Mar-2022 01:07:58         at org.gradle.execution.taskgraph.DefaultTaskExecutionGraph.executeWithServices(DefaultTaskExecutionGraph.java:187)
03-Mar-2022 01:07:58         at org.gradle.execution.taskgraph.DefaultTaskExecutionGraph.execute(DefaultTaskExecutionGraph.java:180)
03-Mar-2022 01:07:58         at org.gradle.execution.SelectedTaskExecutionAction.execute(SelectedTaskExecutionAction.java:39)
03-Mar-2022 01:07:58         at org.gradle.execution.DefaultBuildWorkExecutor.execute(DefaultBuildWorkExecutor.java:40)
03-Mar-2022 01:07:58         at org.gradle.execution.DefaultBuildWorkExecutor.access$000(DefaultBuildWorkExecutor.java:24)
03-Mar-2022 01:07:58         at org.gradle.execution.DefaultBuildWorkExecutor$1.proceed(DefaultBuildWorkExecutor.java:48)
03-Mar-2022 01:07:58         at org.gradle.execution.DryRunBuildExecutionAction.execute(DryRunBuildExecutionAction.java:49)
03-Mar-2022 01:07:58         at org.gradle.execution.DefaultBuildWorkExecutor.execute(DefaultBuildWorkExecutor.java:40)
03-Mar-2022 01:07:58         at org.gradle.execution.DefaultBuildWorkExecutor.execute(DefaultBuildWorkExecutor.java:33)
03-Mar-2022 01:07:58         at org.gradle.execution.IncludedBuildLifecycleBuildWorkExecutor.execute(IncludedBuildLifecycleBuildWorkExecutor.java:36)
03-Mar-2022 01:07:58         at org.gradle.execution.DeprecateUndefinedBuildWorkExecutor.execute(DeprecateUndefinedBuildWorkExecutor.java:42)
03-Mar-2022 01:07:58         at org.gradle.execution.BuildOperationFiringBuildWorkerExecutor$ExecuteTasks.run(BuildOperationFiringBuildWorkerExecutor.java:57)
03-Mar-2022 01:07:58         at org.gradle.internal.operations.DefaultBuildOperationExecutor$RunnableBuildOperationWorker.execute(DefaultBuildOperationExecutor.java:402)
03-Mar-2022 01:07:58         at org.gradle.internal.operations.DefaultBuildOperationExecutor$RunnableBuildOperationWorker.execute(DefaultBuildOperationExecutor.java:394)
03-Mar-2022 01:07:58         at org.gradle.internal.operations.DefaultBuildOperationExecutor$1.execute(DefaultBuildOperationExecutor.java:165)
03-Mar-2022 01:07:58         at org.gradle.internal.operations.DefaultBuildOperationExecutor.execute(DefaultBuildOperationExecutor.java:250)
03-Mar-2022 01:07:58         at org.gradle.internal.operations.DefaultBuildOperationExecutor.execute(DefaultBuildOperationExecutor.java:158)
03-Mar-2022 01:07:58         at org.gradle.internal.operations.DefaultBuildOperationExecutor.run(DefaultBuildOperationExecutor.java:92)
03-Mar-2022 01:07:58         at org.gradle.internal.operations.DelegatingBuildOperationExecutor.run(DelegatingBuildOperationExecutor.java:31)
03-Mar-2022 01:07:58         at org.gradle.execution.BuildOperationFiringBuildWorkerExecutor.execute(BuildOperationFiringBuildWorkerExecutor.java:42)
03-Mar-2022 01:07:58         at org.gradle.initialization.DefaultGradleLauncher.runWork(DefaultGradleLauncher.java:255)
03-Mar-2022 01:07:58         at org.gradle.initialization.DefaultGradleLauncher.doClassicBuildStages(DefaultGradleLauncher.java:164)
03-Mar-2022 01:07:58         at org.gradle.initialization.DefaultGradleLauncher.doBuildStages(DefaultGradleLauncher.java:140)
03-Mar-2022 01:07:58         at org.gradle.initialization.DefaultGradleLauncher.executeTasks(DefaultGradleLauncher.java:120)
03-Mar-2022 01:07:58         at org.gradle.internal.invocation.GradleBuildController$1.create(GradleBuildController.java:74)
03-Mar-2022 01:07:58         at org.gradle.internal.invocation.GradleBuildController$1.create(GradleBuildController.java:67)
03-Mar-2022 01:07:58         at org.gradle.internal.work.DefaultWorkerLeaseService.withLocks(DefaultWorkerLeaseService.java:189)
03-Mar-2022 01:07:58         at org.gradle.internal.work.StopShieldingWorkerLeaseService.withLocks(StopShieldingWorkerLeaseService.java:40)
03-Mar-2022 01:07:58         at org.gradle.internal.invocation.GradleBuildController.doBuild(GradleBuildController.java:67)
03-Mar-2022 01:07:58         at org.gradle.internal.invocation.GradleBuildController.run(GradleBuildController.java:56)
03-Mar-2022 01:07:58         at org.gradle.tooling.internal.provider.ExecuteBuildActionRunner.run(ExecuteBuildActionRunner.java:31)
03-Mar-2022 01:07:58         at org.gradle.launcher.exec.ChainingBuildActionRunner.run(ChainingBuildActionRunner.java:35)
03-Mar-2022 01:07:58         at org.gradle.launcher.exec.BuildOutcomeReportingBuildActionRunner.run(BuildOutcomeReportingBuildActionRunner.java:63)
03-Mar-2022 01:07:58         at org.gradle.tooling.internal.provider.ValidatingBuildActionRunner.run(ValidatingBuildActionRunner.java:32)
03-Mar-2022 01:07:58         at org.gradle.launcher.exec.BuildCompletionNotifyingBuildActionRunner.run(BuildCompletionNotifyingBuildActionRunner.java:39)
03-Mar-2022 01:07:58         at org.gradle.launcher.exec.RunAsBuildOperationBuildActionRunner$3.call(RunAsBuildOperationBuildActionRunner.java:51)
03-Mar-2022 01:07:58         at org.gradle.launcher.exec.RunAsBuildOperationBuildActionRunner$3.call(RunAsBuildOperationBuildActionRunner.java:45)
03-Mar-2022 01:07:58         at org.gradle.internal.operations.DefaultBuildOperationExecutor$CallableBuildOperationWorker.execute(DefaultBuildOperationExecutor.java:416)
03-Mar-2022 01:07:58         at org.gradle.internal.operations.DefaultBuildOperationExecutor$CallableBuildOperationWorker.execute(DefaultBuildOperationExecutor.java:406)
03-Mar-2022 01:07:58         at org.gradle.internal.operations.DefaultBuildOperationExecutor$1.execute(DefaultBuildOperationExecutor.java:165)
03-Mar-2022 01:07:58         at org.gradle.internal.operations.DefaultBuildOperationExecutor.execute(DefaultBuildOperationExecutor.java:250)
03-Mar-2022 01:07:58         at org.gradle.internal.operations.DefaultBuildOperationExecutor.execute(DefaultBuildOperationExecutor.java:158)
03-Mar-2022 01:07:58         at org.gradle.internal.operations.DefaultBuildOperationExecutor.call(DefaultBuildOperationExecutor.java:102)
03-Mar-2022 01:07:58         at org.gradle.internal.operations.DelegatingBuildOperationExecutor.call(DelegatingBuildOperationExecutor.java:36)
03-Mar-2022 01:07:58         at org.gradle.launcher.exec.RunAsBuildOperationBuildActionRunner.run(RunAsBuildOperationBuildActionRunner.java:45)
03-Mar-2022 01:07:58         at org.gradle.launcher.exec.InProcessBuildActionExecuter$1.transform(InProcessBuildActionExecuter.java:50)
03-Mar-2022 01:07:58         at org.gradle.launcher.exec.InProcessBuildActionExecuter$1.transform(InProcessBuildActionExecuter.java:47)
03-Mar-2022 01:07:58         at org.gradle.composite.internal.DefaultRootBuildState.run(DefaultRootBuildState.java:80)
03-Mar-2022 01:07:58         at org.gradle.launcher.exec.InProcessBuildActionExecuter.execute(InProcessBuildActionExecuter.java:47)
03-Mar-2022 01:07:58         at org.gradle.launcher.exec.InProcessBuildActionExecuter.execute(InProcessBuildActionExecuter.java:31)
03-Mar-2022 01:07:58         at org.gradle.launcher.exec.BuildTreeScopeBuildActionExecuter.execute(BuildTreeScopeBuildActionExecuter.java:42)
03-Mar-2022 01:07:58         at org.gradle.launcher.exec.BuildTreeScopeBuildActionExecuter.execute(BuildTreeScopeBuildActionExecuter.java:28)
03-Mar-2022 01:07:58         at org.gradle.tooling.internal.provider.ContinuousBuildActionExecuter.execute(ContinuousBuildActionExecuter.java:87)
03-Mar-2022 01:07:58         at org.gradle.tooling.internal.provider.ContinuousBuildActionExecuter.execute(ContinuousBuildActionExecuter.java:55)
03-Mar-2022 01:07:58         at org.gradle.tooling.internal.provider.SubscribableBuildActionExecuter.execute(SubscribableBuildActionExecuter.java:60)
03-Mar-2022 01:07:58         at org.gradle.tooling.internal.provider.SubscribableBuildActionExecuter.execute(SubscribableBuildActionExecuter.java:38)
03-Mar-2022 01:07:58         at org.gradle.tooling.internal.provider.SessionScopeBuildActionExecuter.execute(SessionScopeBuildActionExecuter.java:68)
03-Mar-2022 01:07:58         at org.gradle.tooling.internal.provider.SessionScopeBuildActionExecuter.execute(SessionScopeBuildActionExecuter.java:38)
03-Mar-2022 01:07:58         at org.gradle.tooling.internal.provider.GradleThreadBuildActionExecuter.execute(GradleThreadBuildActionExecuter.java:37)
03-Mar-2022 01:07:58         at org.gradle.tooling.internal.provider.GradleThreadBuildActionExecuter.execute(GradleThreadBuildActionExecuter.java:26)
03-Mar-2022 01:07:58         at org.gradle.tooling.internal.provider.ParallelismConfigurationBuildActionExecuter.execute(ParallelismConfigurationBuildActionExecuter.java:43)
03-Mar-2022 01:07:58         at org.gradle.tooling.internal.provider.ParallelismConfigurationBuildActionExecuter.execute(ParallelismConfigurationBuildActionExecuter.java:29)
03-Mar-2022 01:07:58         at org.gradle.tooling.internal.provider.StartParamsValidatingActionExecuter.execute(StartParamsValidatingActionExecuter.java:60)
03-Mar-2022 01:07:58         at org.gradle.tooling.internal.provider.StartParamsValidatingActionExecuter.execute(StartParamsValidatingActionExecuter.java:32)
03-Mar-2022 01:07:58         at org.gradle.tooling.internal.provider.SessionFailureReportingActionExecuter.execute(SessionFailureReportingActionExecuter.java:55)
03-Mar-2022 01:07:58         at org.gradle.tooling.internal.provider.SessionFailureReportingActionExecuter.execute(SessionFailureReportingActionExecuter.java:41)
03-Mar-2022 01:07:58         at org.gradle.tooling.internal.provider.SetupLoggingActionExecuter.execute(SetupLoggingActionExecuter.java:48)
03-Mar-2022 01:07:58         at org.gradle.tooling.internal.provider.SetupLoggingActionExecuter.execute(SetupLoggingActionExecuter.java:32)
03-Mar-2022 01:07:58         at org.gradle.launcher.daemon.server.exec.ExecuteBuild.doBuild(ExecuteBuild.java:68)
03-Mar-2022 01:07:58         at org.gradle.launcher.daemon.server.exec.BuildCommandOnly.execute(BuildCommandOnly.java:37)
03-Mar-2022 01:07:58         at org.gradle.launcher.daemon.server.api.DaemonCommandExecution.proceed(DaemonCommandExecution.java:104)
03-Mar-2022 01:07:58         at org.gradle.launcher.daemon.server.exec.WatchForDisconnection.execute(WatchForDisconnection.java:39)
03-Mar-2022 01:07:58         at org.gradle.launcher.daemon.server.api.DaemonCommandExecution.proceed(DaemonCommandExecution.java:104)
03-Mar-2022 01:07:58         at org.gradle.launcher.daemon.server.exec.ResetDeprecationLogger.execute(ResetDeprecationLogger.java:29)
03-Mar-2022 01:07:58         at org.gradle.launcher.daemon.server.api.DaemonCommandExecution.proceed(DaemonCommandExecution.java:104)
03-Mar-2022 01:07:58         at org.gradle.launcher.daemon.server.exec.RequestStopIfSingleUsedDaemon.execute(RequestStopIfSingleUsedDaemon.java:35)
03-Mar-2022 01:07:58         at org.gradle.launcher.daemon.server.api.DaemonCommandExecution.proceed(DaemonCommandExecution.java:104)
03-Mar-2022 01:07:58         at org.gradle.launcher.daemon.server.exec.ForwardClientInput$2.create(ForwardClientInput.java:78)
03-Mar-2022 01:07:58         at org.gradle.launcher.daemon.server.exec.ForwardClientInput$2.create(ForwardClientInput.java:75)
03-Mar-2022 01:07:58         at org.gradle.util.Swapper.swap(Swapper.java:38)
03-Mar-2022 01:07:58         at org.gradle.launcher.daemon.server.exec.ForwardClientInput.execute(ForwardClientInput.java:75)
03-Mar-2022 01:07:58         at org.gradle.launcher.daemon.server.api.DaemonCommandExecution.proceed(DaemonCommandExecution.java:104)
03-Mar-2022 01:07:58         at org.gradle.launcher.daemon.server.exec.LogAndCheckHealth.execute(LogAndCheckHealth.java:55)
03-Mar-2022 01:07:58         at org.gradle.launcher.daemon.server.api.DaemonCommandExecution.proceed(DaemonCommandExecution.java:104)
03-Mar-2022 01:07:58         at org.gradle.launcher.daemon.server.exec.LogToClient.doBuild(LogToClient.java:63)
03-Mar-2022 01:07:58         at org.gradle.launcher.daemon.server.exec.BuildCommandOnly.execute(BuildCommandOnly.java:37)
03-Mar-2022 01:07:58         at org.gradle.launcher.daemon.server.api.DaemonCommandExecution.proceed(DaemonCommandExecution.java:104)
03-Mar-2022 01:07:58         at org.gradle.launcher.daemon.server.exec.EstablishBuildEnvironment.doBuild(EstablishBuildEnvironment.java:82)
03-Mar-2022 01:07:58         at org.gradle.launcher.daemon.server.exec.BuildCommandOnly.execute(BuildCommandOnly.java:37)
03-Mar-2022 01:07:58         at org.gradle.launcher.daemon.server.api.DaemonCommandExecution.proceed(DaemonCommandExecution.java:104)
03-Mar-2022 01:07:58         at org.gradle.launcher.daemon.server.exec.StartBuildOrRespondWithBusy$1.run(StartBuildOrRespondWithBusy.java:52)
03-Mar-2022 01:07:58         at org.gradle.launcher.daemon.server.DaemonStateCoordinator$1.run(DaemonStateCoordinator.java:297)
03-Mar-2022 01:07:58         at org.gradle.internal.concurrent.ExecutorPolicy$CatchAndRecordFailures.onExecute(ExecutorPolicy.java:64)
03-Mar-2022 01:07:58         at org.gradle.internal.concurrent.ManagedExecutorImpl$1.run(ManagedExecutorImpl.java:48)
03-Mar-2022 01:07:58         at org.gradle.internal.concurrent.ThreadFactoryImpl$ManagedThreadRunnable.run(ThreadFactoryImpl.java:56)
03-Mar-2022 01:07:58 Caused by: org.gradle.api.internal.artifacts.ivyservice.DefaultLenientConfiguration$ArtifactResolveException: Could not resolve all files for configuration ':smack-core:testFixturesCompileClasspath'.
03-Mar-2022 01:07:58         at org.gradle.api.internal.artifacts.configurations.DefaultConfiguration.rethrowFailure(DefaultConfiguration.java:1265)
03-Mar-2022 01:07:58         at org.gradle.api.internal.artifacts.configurations.DefaultConfiguration.access$1800(DefaultConfiguration.java:141)
03-Mar-2022 01:07:58         at org.gradle.api.internal.artifacts.configurations.DefaultConfiguration$ConfigurationFileCollection.visitContents(DefaultConfiguration.java:1242)
03-Mar-2022 01:07:58         at org.gradle.api.internal.artifacts.configurations.DefaultConfiguration$ConfigurationFileCollection.visitContents(DefaultConfiguration.java:1235)
03-Mar-2022 01:07:58         at org.gradle.api.internal.artifacts.configurations.DefaultConfiguration.visitContents(DefaultConfiguration.java:489)
03-Mar-2022 01:07:58         at org.gradle.api.internal.file.AbstractFileCollection.visitStructure(AbstractFileCollection.java:265)
03-Mar-2022 01:07:58         at org.gradle.api.internal.file.CompositeFileCollection.visitContents(CompositeFileCollection.java:152)
03-Mar-2022 01:07:58         at org.gradle.api.internal.file.AbstractFileCollection.visitStructure(AbstractFileCollection.java:265)
03-Mar-2022 01:07:58         at org.gradle.internal.fingerprint.impl.DefaultFileCollectionSnapshotter.snapshot(DefaultFileCollectionSnapshotter.java:50)
03-Mar-2022 01:07:58         at org.gradle.internal.fingerprint.impl.AbstractFileCollectionFingerprinter.fingerprint(AbstractFileCollectionFingerprinter.java:47)
03-Mar-2022 01:07:58         at org.gradle.api.internal.tasks.execution.ExecuteActionsTaskExecuter$TaskExecution.lambda$visitInputFileProperties$1(ExecuteActionsTaskExecuter.java:326)
03-Mar-2022 01:07:58         at org.gradle.internal.execution.steps.CaptureStateBeforeExecutionStep.lambda$fingerprintInputFiles$3(CaptureStateBeforeExecutionStep.java:192)
03-Mar-2022 01:07:58         at org.gradle.api.internal.tasks.execution.ExecuteActionsTaskExecuter$TaskExecution.visitInputFileProperties(ExecuteActionsTaskExecuter.java:324)
03-Mar-2022 01:07:58         at org.gradle.internal.execution.steps.CaptureStateBeforeExecutionStep.fingerprintInputFiles(CaptureStateBeforeExecutionStep.java:188)
03-Mar-2022 01:07:58         at org.gradle.internal.execution.steps.CaptureStateBeforeExecutionStep.captureExecutionState(CaptureStateBeforeExecutionStep.java:150)
03-Mar-2022 01:07:58         at org.gradle.internal.execution.steps.CaptureStateBeforeExecutionStep.lambda$captureExecutionStateOp$1(CaptureStateBeforeExecutionStep.java:104)
03-Mar-2022 01:07:58         at org.gradle.internal.execution.steps.BuildOperationStep$1.call(BuildOperationStep.java:40)
03-Mar-2022 01:07:58         at org.gradle.internal.operations.DefaultBuildOperationExecutor$CallableBuildOperationWorker.execute(DefaultBuildOperationExecutor.java:416)
03-Mar-2022 01:07:58         at org.gradle.internal.operations.DefaultBuildOperationExecutor$CallableBuildOperationWorker.execute(DefaultBuildOperationExecutor.java:406)
03-Mar-2022 01:07:58         at org.gradle.internal.operations.DefaultBuildOperationExecutor$1.execute(DefaultBuildOperationExecutor.java:165)
03-Mar-2022 01:07:58         at org.gradle.internal.operations.DefaultBuildOperationExecutor.execute(DefaultBuildOperationExecutor.java:250)
03-Mar-2022 01:07:58         at org.gradle.internal.operations.DefaultBuildOperationExecutor.execute(DefaultBuildOperationExecutor.java:158)
03-Mar-2022 01:07:58         at org.gradle.internal.operations.DefaultBuildOperationExecutor.call(DefaultBuildOperationExecutor.java:102)
03-Mar-2022 01:07:58         at org.gradle.internal.operations.DelegatingBuildOperationExecutor.call(DelegatingBuildOperationExecutor.java:36)
03-Mar-2022 01:07:58         at org.gradle.internal.execution.steps.BuildOperationStep.operation(BuildOperationStep.java:37)
03-Mar-2022 01:07:58         at org.gradle.internal.execution.steps.CaptureStateBeforeExecutionStep.captureExecutionStateOp(CaptureStateBeforeExecutionStep.java:103)
03-Mar-2022 01:07:58         at org.gradle.internal.execution.steps.CaptureStateBeforeExecutionStep.lambda$execute$0(CaptureStateBeforeExecutionStep.java:78)
03-Mar-2022 01:07:58         at org.gradle.internal.execution.steps.CaptureStateBeforeExecutionStep.execute(CaptureStateBeforeExecutionStep.java:78)
03-Mar-2022 01:07:58         at org.gradle.internal.execution.steps.CaptureStateBeforeExecutionStep.execute(CaptureStateBeforeExecutionStep.java:53)
03-Mar-2022 01:07:58         at org.gradle.internal.execution.steps.ValidateStep.execute(ValidateStep.java:74)
03-Mar-2022 01:07:58         at org.gradle.internal.execution.steps.SkipEmptyWorkStep.lambda$execute$2(SkipEmptyWorkStep.java:78)
03-Mar-2022 01:07:58         at org.gradle.internal.execution.steps.SkipEmptyWorkStep.execute(SkipEmptyWorkStep.java:78)
03-Mar-2022 01:07:58         at org.gradle.internal.execution.steps.SkipEmptyWorkStep.execute(SkipEmptyWorkStep.java:34)
03-Mar-2022 01:07:58         at org.gradle.internal.execution.steps.legacy.MarkSnapshottingInputsStartedStep.execute(MarkSnapshottingInputsStartedStep.java:39)
03-Mar-2022 01:07:58         at org.gradle.internal.execution.steps.LoadExecutionStateStep.execute(LoadExecutionStateStep.java:40)
03-Mar-2022 01:07:58         at org.gradle.internal.execution.steps.LoadExecutionStateStep.execute(LoadExecutionStateStep.java:28)
03-Mar-2022 01:07:58         at org.gradle.internal.execution.impl.DefaultWorkExecutor.execute(DefaultWorkExecutor.java:33)
03-Mar-2022 01:07:58         at org.gradle.api.internal.tasks.execution.ExecuteActionsTaskExecuter.executeIfValid(ExecuteActionsTaskExecuter.java:194)
03-Mar-2022 01:07:58         at org.gradle.api.internal.tasks.execution.ExecuteActionsTaskExecuter.execute(ExecuteActionsTaskExecuter.java:186)
03-Mar-2022 01:07:58         at org.gradle.api.internal.tasks.execution.CleanupStaleOutputsExecuter.execute(CleanupStaleOutputsExecuter.java:114)
03-Mar-2022 01:07:58         at org.gradle.api.internal.tasks.execution.FinalizePropertiesTaskExecuter.execute(FinalizePropertiesTaskExecuter.java:46)
03-Mar-2022 01:07:58         at org.gradle.api.internal.tasks.execution.ResolveTaskExecutionModeExecuter.execute(ResolveTaskExecutionModeExecuter.java:62)
03-Mar-2022 01:07:58         at org.gradle.api.internal.tasks.execution.SkipTaskWithNoActionsExecuter.execute(SkipTaskWithNoActionsExecuter.java:57)
03-Mar-2022 01:07:58         at org.gradle.api.internal.tasks.execution.SkipOnlyIfTaskExecuter.execute(SkipOnlyIfTaskExecuter.java:56)
03-Mar-2022 01:07:58         at org.gradle.api.internal.tasks.execution.CatchExceptionTaskExecuter.execute(CatchExceptionTaskExecuter.java:36)
03-Mar-2022 01:07:58         at org.gradle.api.internal.tasks.execution.EventFiringTaskExecuter$1.executeTask(EventFiringTaskExecuter.java:77)
03-Mar-2022 01:07:58         at org.gradle.api.internal.tasks.execution.EventFiringTaskExecuter$1.call(EventFiringTaskExecuter.java:55)
03-Mar-2022 01:07:58         at org.gradle.api.internal.tasks.execution.EventFiringTaskExecuter$1.call(EventFiringTaskExecuter.java:52)
03-Mar-2022 01:07:58         at org.gradle.internal.operations.DefaultBuildOperationExecutor$CallableBuildOperationWorker.execute(DefaultBuildOperationExecutor.java:416)
03-Mar-2022 01:07:58         at org.gradle.internal.operations.DefaultBuildOperationExecutor$CallableBuildOperationWorker.execute(DefaultBuildOperationExecutor.java:406)
03-Mar-2022 01:07:58         at org.gradle.internal.operations.DefaultBuildOperationExecutor$1.execute(DefaultBuildOperationExecutor.java:165)
03-Mar-2022 01:07:58         at org.gradle.internal.operations.DefaultBuildOperationExecutor.execute(DefaultBuildOperationExecutor.java:250)
03-Mar-2022 01:07:58         at org.gradle.internal.operations.DefaultBuildOperationExecutor.execute(DefaultBuildOperationExecutor.java:158)
03-Mar-2022 01:07:58         at org.gradle.internal.operations.DefaultBuildOperationExecutor.call(DefaultBuildOperationExecutor.java:102)
03-Mar-2022 01:07:58         at org.gradle.internal.operations.DelegatingBuildOperationExecutor.call(DelegatingBuildOperationExecutor.java:36)
03-Mar-2022 01:07:58         at org.gradle.api.internal.tasks.execution.EventFiringTaskExecuter.execute(EventFiringTaskExecuter.java:52)
03-Mar-2022 01:07:58         at org.gradle.execution.plan.LocalTaskNodeExecutor.execute(LocalTaskNodeExecutor.java:41)
03-Mar-2022 01:07:58         at org.gradle.execution.taskgraph.DefaultTaskExecutionGraph$InvokeNodeExecutorsAction.execute(DefaultTaskExecutionGraph.java:370)
03-Mar-2022 01:07:58         at org.gradle.execution.taskgraph.DefaultTaskExecutionGraph$InvokeNodeExecutorsAction.execute(DefaultTaskExecutionGraph.java:357)
03-Mar-2022 01:07:58         at org.gradle.execution.taskgraph.DefaultTaskExecutionGraph$BuildOperationAwareExecutionAction.execute(DefaultTaskExecutionGraph.java:350)
03-Mar-2022 01:07:58         at org.gradle.execution.taskgraph.DefaultTaskExecutionGraph$BuildOperationAwareExecutionAction.execute(DefaultTaskExecutionGraph.java:336)
03-Mar-2022 01:07:58         at org.gradle.execution.plan.DefaultPlanExecutor$ExecutorWorker.lambda$run$0(DefaultPlanExecutor.java:127)
03-Mar-2022 01:07:58         at org.gradle.execution.plan.DefaultPlanExecutor$ExecutorWorker.execute(DefaultPlanExecutor.java:191)
03-Mar-2022 01:07:58         at org.gradle.execution.plan.DefaultPlanExecutor$ExecutorWorker.executeNextNode(DefaultPlanExecutor.java:182)
03-Mar-2022 01:07:58         at org.gradle.execution.plan.DefaultPlanExecutor$ExecutorWorker.run(DefaultPlanExecutor.java:124)
03-Mar-2022 01:07:58         at org.gradle.execution.plan.DefaultPlanExecutor.process(DefaultPlanExecutor.java:72)
03-Mar-2022 01:07:58         at org.gradle.execution.taskgraph.DefaultTaskExecutionGraph.executeWithServices(DefaultTaskExecutionGraph.java:187)
03-Mar-2022 01:07:58         at org.gradle.execution.taskgraph.DefaultTaskExecutionGraph.execute(DefaultTaskExecutionGraph.java:180)
03-Mar-2022 01:07:58         at org.gradle.execution.SelectedTaskExecutionAction.execute(SelectedTaskExecutionAction.java:39)
03-Mar-2022 01:07:58         at org.gradle.execution.DefaultBuildWorkExecutor.execute(DefaultBuildWorkExecutor.java:40)
03-Mar-2022 01:07:58         at org.gradle.execution.DefaultBuildWorkExecutor.access$000(DefaultBuildWorkExecutor.java:24)
03-Mar-2022 01:07:58         at org.gradle.execution.DefaultBuildWorkExecutor$1.proceed(DefaultBuildWorkExecutor.java:48)
03-Mar-2022 01:07:58         at org.gradle.execution.DryRunBuildExecutionAction.execute(DryRunBuildExecutionAction.java:49)
03-Mar-2022 01:07:58         at org.gradle.execution.DefaultBuildWorkExecutor.execute(DefaultBuildWorkExecutor.java:40)
03-Mar-2022 01:07:58         at org.gradle.execution.DefaultBuildWorkExecutor.execute(DefaultBuildWorkExecutor.java:33)
03-Mar-2022 01:07:58         at org.gradle.execution.IncludedBuildLifecycleBuildWorkExecutor.execute(IncludedBuildLifecycleBuildWorkExecutor.java:36)
03-Mar-2022 01:07:58         at org.gradle.execution.DeprecateUndefinedBuildWorkExecutor.execute(DeprecateUndefinedBuildWorkExecutor.java:42)
03-Mar-2022 01:07:58         at org.gradle.execution.BuildOperationFiringBuildWorkerExecutor$ExecuteTasks.run(BuildOperationFiringBuildWorkerExecutor.java:57)
03-Mar-2022 01:07:58         at org.gradle.internal.operations.DefaultBuildOperationExecutor$RunnableBuildOperationWorker.execute(DefaultBuildOperationExecutor.java:402)
03-Mar-2022 01:07:58         at org.gradle.internal.operations.DefaultBuildOperationExecutor$RunnableBuildOperationWorker.execute(DefaultBuildOperationExecutor.java:394)
03-Mar-2022 01:07:58         at org.gradle.internal.operations.DefaultBuildOperationExecutor$1.execute(DefaultBuildOperationExecutor.java:165)
03-Mar-2022 01:07:58         at org.gradle.internal.operations.DefaultBuildOperationExecutor.execute(DefaultBuildOperationExecutor.java:250)
03-Mar-2022 01:07:58         at org.gradle.internal.operations.DefaultBuildOperationExecutor.execute(DefaultBuildOperationExecutor.java:158)
03-Mar-2022 01:07:58         at org.gradle.internal.operations.DefaultBuildOperationExecutor.run(DefaultBuildOperationExecutor.java:92)
03-Mar-2022 01:07:58         at org.gradle.internal.operations.DelegatingBuildOperationExecutor.run(DelegatingBuildOperationExecutor.java:31)
03-Mar-2022 01:07:58         at org.gradle.execution.BuildOperationFiringBuildWorkerExecutor.execute(BuildOperationFiringBuildWorkerExecutor.java:42)
03-Mar-2022 01:07:58         at org.gradle.initialization.DefaultGradleLauncher.runWork(DefaultGradleLauncher.java:255)
03-Mar-2022 01:07:58         at org.gradle.initialization.DefaultGradleLauncher.doClassicBuildStages(DefaultGradleLauncher.java:164)
03-Mar-2022 01:07:58         at org.gradle.initialization.DefaultGradleLauncher.doBuildStages(DefaultGradleLauncher.java:140)
03-Mar-2022 01:07:58         at org.gradle.initialization.DefaultGradleLauncher.executeTasks(DefaultGradleLauncher.java:120)
03-Mar-2022 01:07:58         at org.gradle.internal.invocation.GradleBuildController$1.create(GradleBuildController.java:74)
03-Mar-2022 01:07:58         at org.gradle.internal.invocation.GradleBuildController$1.create(GradleBuildController.java:67)
03-Mar-2022 01:07:58         at org.gradle.internal.work.DefaultWorkerLeaseService.withLocks(DefaultWorkerLeaseService.java:189)
03-Mar-2022 01:07:58         at org.gradle.internal.work.StopShieldingWorkerLeaseService.withLocks(StopShieldingWorkerLeaseService.java:40)
03-Mar-2022 01:07:58         at org.gradle.internal.invocation.GradleBuildController.doBuild(GradleBuildController.java:67)
03-Mar-2022 01:07:58         at org.gradle.internal.invocation.GradleBuildController.run(GradleBuildController.java:56)
03-Mar-2022 01:07:58         at org.gradle.tooling.internal.provider.ExecuteBuildActionRunner.run(ExecuteBuildActionRunner.java:31)
03-Mar-2022 01:07:58         at org.gradle.launcher.exec.ChainingBuildActionRunner.run(ChainingBuildActionRunner.java:35)
03-Mar-2022 01:07:58         at org.gradle.launcher.exec.BuildOutcomeReportingBuildActionRunner.run(BuildOutcomeReportingBuildActionRunner.java:63)
03-Mar-2022 01:07:58         at org.gradle.tooling.internal.provider.ValidatingBuildActionRunner.run(ValidatingBuildActionRunner.java:32)
03-Mar-2022 01:07:58         at org.gradle.launcher.exec.BuildCompletionNotifyingBuildActionRunner.run(BuildCompletionNotifyingBuildActionRunner.java:39)
03-Mar-2022 01:07:58         at org.gradle.launcher.exec.RunAsBuildOperationBuildActionRunner$3.call(RunAsBuildOperationBuildActionRunner.java:51)
03-Mar-2022 01:07:58         at org.gradle.launcher.exec.RunAsBuildOperationBuildActionRunner$3.call(RunAsBuildOperationBuildActionRunner.java:45)
03-Mar-2022 01:07:58         at org.gradle.internal.operations.DefaultBuildOperationExecutor$CallableBuildOperationWorker.execute(DefaultBuildOperationExecutor.java:416)
03-Mar-2022 01:07:58         at org.gradle.internal.operations.DefaultBuildOperationExecutor$CallableBuildOperationWorker.execute(DefaultBuildOperationExecutor.java:406)
03-Mar-2022 01:07:58         at org.gradle.internal.operations.DefaultBuildOperationExecutor$1.execute(DefaultBuildOperationExecutor.java:165)
03-Mar-2022 01:07:58         at org.gradle.internal.operations.DefaultBuildOperationExecutor.execute(DefaultBuildOperationExecutor.java:250)
03-Mar-2022 01:07:58         at org.gradle.internal.operations.DefaultBuildOperationExecutor.execute(DefaultBuildOperationExecutor.java:158)
03-Mar-2022 01:07:58         at org.gradle.internal.operations.DefaultBuildOperationExecutor.call(DefaultBuildOperationExecutor.java:102)
03-Mar-2022 01:07:58         at org.gradle.internal.operations.DelegatingBuildOperationExecutor.call(DelegatingBuildOperationExecutor.java:36)
03-Mar-2022 01:07:58         at org.gradle.launcher.exec.RunAsBuildOperationBuildActionRunner.run(RunAsBuildOperationBuildActionRunner.java:45)
03-Mar-2022 01:07:58         at org.gradle.launcher.exec.InProcessBuildActionExecuter$1.transform(InProcessBuildActionExecuter.java:50)
03-Mar-2022 01:07:58         at org.gradle.launcher.exec.InProcessBuildActionExecuter$1.transform(InProcessBuildActionExecuter.java:47)
03-Mar-2022 01:07:58         at org.gradle.composite.internal.DefaultRootBuildState.run(DefaultRootBuildState.java:80)
03-Mar-2022 01:07:58         at org.gradle.launcher.exec.InProcessBuildActionExecuter.execute(InProcessBuildActionExecuter.java:47)
03-Mar-2022 01:07:58         at org.gradle.launcher.exec.InProcessBuildActionExecuter.execute(InProcessBuildActionExecuter.java:31)
03-Mar-2022 01:07:58         at org.gradle.launcher.exec.BuildTreeScopeBuildActionExecuter.execute(BuildTreeScopeBuildActionExecuter.java:42)
03-Mar-2022 01:07:58         at org.gradle.launcher.exec.BuildTreeScopeBuildActionExecuter.execute(BuildTreeScopeBuildActionExecuter.java:28)
03-Mar-2022 01:07:58         at org.gradle.tooling.internal.provider.ContinuousBuildActionExecuter.execute(ContinuousBuildActionExecuter.java:87)
03-Mar-2022 01:07:58         at org.gradle.tooling.internal.provider.ContinuousBuildActionExecuter.execute(ContinuousBuildActionExecuter.java:55)
03-Mar-2022 01:07:58         at org.gradle.tooling.internal.provider.SubscribableBuildActionExecuter.execute(SubscribableBuildActionExecuter.java:60)
03-Mar-2022 01:07:58         at org.gradle.tooling.internal.provider.SubscribableBuildActionExecuter.execute(SubscribableBuildActionExecuter.java:38)
03-Mar-2022 01:07:58         at org.gradle.tooling.internal.provider.SessionScopeBuildActionExecuter.execute(SessionScopeBuildActionExecuter.java:68)
03-Mar-2022 01:07:58         at org.gradle.tooling.internal.provider.SessionScopeBuildActionExecuter.execute(SessionScopeBuildActionExecuter.java:38)
03-Mar-2022 01:07:58         at org.gradle.tooling.internal.provider.GradleThreadBuildActionExecuter.execute(GradleThreadBuildActionExecuter.java:37)
03-Mar-2022 01:07:58         at org.gradle.tooling.internal.provider.GradleThreadBuildActionExecuter.execute(GradleThreadBuildActionExecuter.java:26)
03-Mar-2022 01:07:58         at org.gradle.tooling.internal.provider.ParallelismConfigurationBuildActionExecuter.execute(ParallelismConfigurationBuildActionExecuter.java:43)
03-Mar-2022 01:07:58         at org.gradle.tooling.internal.provider.ParallelismConfigurationBuildActionExecuter.execute(ParallelismConfigurationBuildActionExecuter.java:29)
03-Mar-2022 01:07:58         at org.gradle.tooling.internal.provider.StartParamsValidatingActionExecuter.execute(StartParamsValidatingActionExecuter.java:60)
03-Mar-2022 01:07:58         at org.gradle.tooling.internal.provider.StartParamsValidatingActionExecuter.execute(StartParamsValidatingActionExecuter.java:32)
03-Mar-2022 01:07:58         at org.gradle.tooling.internal.provider.SessionFailureReportingActionExecuter.execute(SessionFailureReportingActionExecuter.java:55)
03-Mar-2022 01:07:58         at org.gradle.tooling.internal.provider.SessionFailureReportingActionExecuter.execute(SessionFailureReportingActionExecuter.java:41)
03-Mar-2022 01:07:58         at org.gradle.tooling.internal.provider.SetupLoggingActionExecuter.execute(SetupLoggingActionExecuter.java:48)
03-Mar-2022 01:07:58         at org.gradle.tooling.internal.provider.SetupLoggingActionExecuter.execute(SetupLoggingActionExecuter.java:32)
03-Mar-2022 01:07:58         at org.gradle.launcher.daemon.server.exec.ExecuteBuild.doBuild(ExecuteBuild.java:68)
03-Mar-2022 01:07:58         at org.gradle.launcher.daemon.server.exec.BuildCommandOnly.execute(BuildCommandOnly.java:37)
03-Mar-2022 01:07:58         at org.gradle.launcher.daemon.server.api.DaemonCommandExecution.proceed(DaemonCommandExecution.java:104)
03-Mar-2022 01:07:58         at org.gradle.launcher.daemon.server.exec.WatchForDisconnection.execute(WatchForDisconnection.java:39)
03-Mar-2022 01:07:58         at org.gradle.launcher.daemon.server.api.DaemonCommandExecution.proceed(DaemonCommandExecution.java:104)
03-Mar-2022 01:07:58         at org.gradle.launcher.daemon.server.exec.ResetDeprecationLogger.execute(ResetDeprecationLogger.java:29)
03-Mar-2022 01:07:58         at org.gradle.launcher.daemon.server.api.DaemonCommandExecution.proceed(DaemonCommandExecution.java:104)
03-Mar-2022 01:07:58         at org.gradle.launcher.daemon.server.exec.RequestStopIfSingleUsedDaemon.execute(RequestStopIfSingleUsedDaemon.java:35)
03-Mar-2022 01:07:58         at org.gradle.launcher.daemon.server.api.DaemonCommandExecution.proceed(DaemonCommandExecution.java:104)
03-Mar-2022 01:07:58         at org.gradle.launcher.daemon.server.exec.ForwardClientInput$2.create(ForwardClientInput.java:78)
03-Mar-2022 01:07:58         at org.gradle.launcher.daemon.server.exec.ForwardClientInput$2.create(ForwardClientInput.java:75)
03-Mar-2022 01:07:58         at org.gradle.util.Swapper.swap(Swapper.java:38)
03-Mar-2022 01:07:58         at org.gradle.launcher.daemon.server.exec.ForwardClientInput.execute(ForwardClientInput.java:75)
03-Mar-2022 01:07:58         at org.gradle.launcher.daemon.server.api.DaemonCommandExecution.proceed(DaemonCommandExecution.java:104)
03-Mar-2022 01:07:58         at org.gradle.launcher.daemon.server.exec.LogAndCheckHealth.execute(LogAndCheckHealth.java:55)
03-Mar-2022 01:07:58         at org.gradle.launcher.daemon.server.api.DaemonCommandExecution.proceed(DaemonCommandExecution.java:104)
03-Mar-2022 01:07:58         at org.gradle.launcher.daemon.server.exec.LogToClient.doBuild(LogToClient.java:63)
03-Mar-2022 01:07:58         at org.gradle.launcher.daemon.server.exec.BuildCommandOnly.execute(BuildCommandOnly.java:37)
03-Mar-2022 01:07:58         at org.gradle.launcher.daemon.server.api.DaemonCommandExecution.proceed(DaemonCommandExecution.java:104)
03-Mar-2022 01:07:58         at org.gradle.launcher.daemon.server.exec.EstablishBuildEnvironment.doBuild(EstablishBuildEnvironment.java:82)
03-Mar-2022 01:07:58         at org.gradle.launcher.daemon.server.exec.BuildCommandOnly.execute(BuildCommandOnly.java:37)
03-Mar-2022 01:07:58         at org.gradle.launcher.daemon.server.api.DaemonCommandExecution.proceed(DaemonCommandExecution.java:104)
03-Mar-2022 01:07:58         at org.gradle.launcher.daemon.server.exec.StartBuildOrRespondWithBusy$1.run(StartBuildOrRespondWithBusy.java:52)
03-Mar-2022 01:07:58         at org.gradle.launcher.daemon.server.DaemonStateCoordinator$1.run(DaemonStateCoordinator.java:297)
03-Mar-2022 01:07:58         at org.gradle.internal.concurrent.ExecutorPolicy$CatchAndRecordFailures.onExecute(ExecutorPolicy.java:64)
03-Mar-2022 01:07:58         at org.gradle.internal.concurrent.ManagedExecutorImpl$1.run(ManagedExecutorImpl.java:48)
03-Mar-2022 01:07:58         at org.gradle.internal.concurrent.ThreadFactoryImpl$ManagedThreadRunnable.run(ThreadFactoryImpl.java:56)
03-Mar-2022 01:07:58 Caused by: org.gradle.internal.resolve.ArtifactNotFoundException: Could not find jxmpp-jid-1.0.3-tests.jar (org.jxmpp:jxmpp-jid:1.0.3).
03-Mar-2022 01:07:58 Searched in the following locations:
03-Mar-2022 01:07:58     file:/home/bamboo/.m2/repository/org/jxmpp/jxmpp-jid/1.0.3/jxmpp-jid-1.0.3-tests.jar
03-Mar-2022 01:07:58         at org.gradle.internal.resolve.result.DefaultBuildableArtifactResolveResult.notFound(DefaultBuildableArtifactResolveResult.java:28)
03-Mar-2022 01:07:58         at org.gradle.api.internal.artifacts.repositories.resolver.ExternalResourceResolver$RemoteRepositoryAccess.resolveArtifact(ExternalResourceResolver.java:496)
03-Mar-2022 01:07:58         at org.gradle.api.internal.artifacts.ivyservice.ivyresolve.CachingModuleComponentRepository$ResolveAndCacheRepositoryAccess.resolveArtifact(CachingModuleComponentRepository.java:445)
03-Mar-2022 01:07:58         at org.gradle.api.internal.artifacts.ivyservice.ivyresolve.LocalModuleComponentRepository$LocalAccess.resolveArtifact(LocalModuleComponentRepository.java:101)
03-Mar-2022 01:07:58         at org.gradle.api.internal.artifacts.ivyservice.ivyresolve.ErrorHandlingModuleComponentRepository$ErrorHandlingModuleComponentRepositoryAccess.lambda$resolveArtifact$15(ErrorHandlingModuleComponentRepository.java:181)
03-Mar-2022 01:07:58         at org.gradle.api.internal.artifacts.ivyservice.ivyresolve.ErrorHandlingModuleComponentRepository$ErrorHandlingModuleComponentRepositoryAccess.tryResolveAndMaybeBlacklist(ErrorHandlingModuleComponentRepository.java:237)
03-Mar-2022 01:07:58         at org.gradle.api.internal.artifacts.ivyservice.ivyresolve.ErrorHandlingModuleComponentRepository$ErrorHandlingModuleComponentRepositoryAccess.performOperationWithRetries(ErrorHandlingModuleComponentRepository.java:203)
03-Mar-2022 01:07:58         at org.gradle.api.internal.artifacts.ivyservice.ivyresolve.ErrorHandlingModuleComponentRepository$ErrorHandlingModuleComponentRepositoryAccess.resolveArtifact(ErrorHandlingModuleComponentRepository.java:179)
03-Mar-2022 01:07:58         at org.gradle.api.internal.artifacts.ivyservice.ivyresolve.RepositoryChainArtifactResolver.resolveArtifact(RepositoryChainArtifactResolver.java:94)
03-Mar-2022 01:07:58         at org.gradle.api.internal.artifacts.ivyservice.resolveengine.ComponentResolversChain$ArtifactResolverChain.resolveArtifact(ComponentResolversChain.java:123)
03-Mar-2022 01:07:58         at org.gradle.api.internal.artifacts.ivyservice.ivyresolve.ErrorHandlingArtifactResolver.resolveArtifact(ErrorHandlingArtifactResolver.java:46)
03-Mar-2022 01:07:58         at org.gradle.api.internal.artifacts.ivyservice.resolveengine.artifact.DefaultArtifactSet$LazyArtifactSource.create(DefaultArtifactSet.java:184)
03-Mar-2022 01:07:58         at org.gradle.api.internal.artifacts.ivyservice.resolveengine.artifact.DefaultArtifactSet$LazyArtifactSource.create(DefaultArtifactSet.java:170)
03-Mar-2022 01:07:58         at org.gradle.api.internal.artifacts.DefaultResolvedArtifact.getFile(DefaultResolvedArtifact.java:168)
03-Mar-2022 01:07:58         at org.gradle.api.internal.artifacts.ivyservice.resolveengine.artifact.ArtifactBackedResolvedVariant$DownloadArtifactFile.run(ArtifactBackedResolvedVariant.java:148)
03-Mar-2022 01:07:58         at org.gradle.internal.operations.DefaultBuildOperationExecutor$RunnableBuildOperationWorker.execute(DefaultBuildOperationExecutor.java:402)
03-Mar-2022 01:07:58         at org.gradle.internal.operations.DefaultBuildOperationExecutor$RunnableBuildOperationWorker.execute(DefaultBuildOperationExecutor.java:394)
03-Mar-2022 01:07:58         at org.gradle.internal.operations.DefaultBuildOperationExecutor$1.execute(DefaultBuildOperationExecutor.java:165)
03-Mar-2022 01:07:58         at org.gradle.internal.operations.DefaultBuildOperationExecutor.execute(DefaultBuildOperationExecutor.java:250)
03-Mar-2022 01:07:58         at org.gradle.internal.operations.DefaultBuildOperationExecutor.execute(DefaultBuildOperationExecutor.java:158)
03-Mar-2022 01:07:58         at org.gradle.internal.operations.DefaultBuildOperationExecutor.access$1500(DefaultBuildOperationExecutor.java:49)
03-Mar-2022 01:07:58         at org.gradle.internal.operations.DefaultBuildOperationExecutor$ParentPreservingQueueWorker.execute(DefaultBuildOperationExecutor.java:444)
03-Mar-2022 01:07:58         at org.gradle.internal.operations.DefaultBuildOperationQueue$WorkerRunnable.runOperation(DefaultBuildOperationQueue.java:231)
03-Mar-2022 01:07:58         at org.gradle.internal.operations.DefaultBuildOperationQueue$WorkerRunnable.access$600(DefaultBuildOperationQueue.java:173)
03-Mar-2022 01:07:58         at org.gradle.internal.operations.DefaultBuildOperationQueue$WorkerRunnable$1.create(DefaultBuildOperationQueue.java:210)
03-Mar-2022 01:07:58         at org.gradle.internal.operations.DefaultBuildOperationQueue$WorkerRunnable$1.create(DefaultBuildOperationQueue.java:204)
03-Mar-2022 01:07:58         at org.gradle.internal.work.DefaultWorkerLeaseService.withLocks(DefaultWorkerLeaseService.java:189)
03-Mar-2022 01:07:58         at org.gradle.internal.operations.DefaultBuildOperationQueue$WorkerRunnable.runBatch(DefaultBuildOperationQueue.java:204)
03-Mar-2022 01:07:58         at org.gradle.internal.operations.DefaultBuildOperationQueue$WorkerRunnable.run(DefaultBuildOperationQueue.java:178)
03-Mar-2022 01:07:58         at org.gradle.internal.concurrent.ExecutorPolicy$CatchAndRecordFailures.onExecute(ExecutorPolicy.java:64)
03-Mar-2022 01:07:58         at org.gradle.internal.concurrent.ManagedExecutorImpl$1.run(ManagedExecutorImpl.java:48)
03-Mar-2022 01:07:58
03-Mar-2022 01:07:58 Deprecated Gradle features were used in this build, making it incompatible with Gradle 7.0.
03-Mar-2022 01:07:58 Use '--warning-mode all' to show the individual deprecation warnings.
03-Mar-2022 01:07:58 See https://docs.gradle.org/6.4.1/userguide/command_line_interface.html#sec:command_line_warnings
03-Mar-2022 01:07:58 165 actionable tasks: 162 executed, 3 up-to-date
03-Mar-2022 01:07:58         at org.gradle.internal.concurrent.ThreadFactoryImpl$ManagedThreadRunnable.run(ThreadFactoryImpl.java:56)
03-Mar-2022 01:07:58
03-Mar-2022 01:07:58
03-Mar-2022 01:07:58 * Get more help at https://help.gradle.org
03-Mar-2022 01:07:58
03-Mar-2022 01:07:58 BUILD FAILED in 4m 12s
03-Mar-2022 01:07:59 Failing task since return code of [/opt/gradle/bin/gradle --stacktrace clean distributionZip javadocAll jacocoRootReport] was 1 while expected 0
03-Mar-2022 01:07:59 Finished task 'Gradle' with result: Failed
03-Mar-2022 01:07:59 Running post build plugin 'NCover Results Collector'
03-Mar-2022 01:07:59 Running post build plugin 'Artifact Copier'
03-Mar-2022 01:07:59 Publishing an artifact: Project binary files
03-Mar-2022 01:07:59 Unable to publish artifact [Project binary files]: the source directory /var/atlassian/bamboo-home/local-working-dir/SMACK-NIGHTLY-JOB1/build/distributions does not exist.
03-Mar-2022 01:07:59 The artifact hasn't been successfully published after 867.2 μs
03-Mar-2022 01:07:59 Running post build plugin 'npm Cache Cleanup'
03-Mar-2022 01:07:59 Running post build plugin 'Build Results Label Collector'
03-Mar-2022 01:07:59 Running post build plugin 'Clover Results Collector'
03-Mar-2022 01:07:59 Running post build plugin 'Docker Container Cleanup'
03-Mar-2022 01:07:59 Finalising the build...
03-Mar-2022 01:07:59 Stopping timer.
03-Mar-2022 01:07:59 Build SMACK-NIGHTLY-JOB1-1856 completed.
03-Mar-2022 01:07:59 Running on server: post build plugin 'NCover Results Collector'
03-Mar-2022 01:07:59 Running on server: post build plugin 'Build Hanging Detection Configuration'
03-Mar-2022 01:07:59 Running on server: post build plugin 'Build Labeller'
03-Mar-2022 01:07:59 Running on server: post build plugin 'Clover Delta Calculator'
03-Mar-2022 01:07:59 Running on server: post build plugin 'Maven Dependencies Postprocessor'
03-Mar-2022 01:07:59 All post build plugins have finished
03-Mar-2022 01:07:59 Generating build results summary...
03-Mar-2022 01:07:59 Saving build results to disk...
03-Mar-2022 01:07:59 Store variable context...
03-Mar-2022 01:07:59 Indexing build results...
03-Mar-2022 01:07:59 Finished building SMACK-NIGHTLY-JOB1-1856.