Nightly Distribution of the master branch

Build: #1859 was successful

Job: Default Job was successful

Stages & jobs

  1. Default Stage

  2. Deploy

Build log

The build generated 2,181 lines of output.   The output is too long and has been truncated to the last 1,000 lines. Download or view full build log.

13-Mar-2022 12:37:07 > Task :smack-android:compileTestFixturesJava NO-SOURCE
13-Mar-2022 12:37:07 > Task :smack-android:processTestFixturesResources NO-SOURCE
13-Mar-2022 12:37:07 > Task :smack-android:testFixturesClasses UP-TO-DATE
13-Mar-2022 12:37:07 > Task :smack-android:testFixturesJar UP-TO-DATE
13-Mar-2022 12:37:07 > Task :smack-android:generateMetadataFileForMavenJavaPublication
13-Mar-2022 12:37:07 > Task :smack-android:generatePomFileForMavenJavaPublication
13-Mar-2022 12:37:07 > Task :smack-android:copyJavadocDocFiles NO-SOURCE
13-Mar-2022 12:37:07 > Task :smack-android:javadoc UP-TO-DATE
13-Mar-2022 12:37:07 > Task :smack-android:javadocJar
13-Mar-2022 12:37:07 > Task :smack-android:sourcesJar
13-Mar-2022 12:37:07 > Task :smack-android:compileTestJava NO-SOURCE
13-Mar-2022 12:37:07 > Task :smack-android:processTestResources NO-SOURCE
13-Mar-2022 12:37:07 > Task :smack-android:testClasses UP-TO-DATE
13-Mar-2022 12:37:07 > Task :smack-android:testsJar
13-Mar-2022 12:37:07 > Task :smack-android:signMavenJavaPublication SKIPPED
13-Mar-2022 12:37:08
13-Mar-2022 12:37:08 FAILURE: Build failed with an exception.
13-Mar-2022 12:37:08
13-Mar-2022 12:37:08 * What went wrong:
13-Mar-2022 12:37:08 Execution failed for task ':smack-android:publishMavenJavaPublicationToCustomRepoRepository'.
13-Mar-2022 12:37:08 > Failed to publish publication 'mavenJava' to repository 'customRepo'
13-Mar-2022 12:37:08 > Task :smack-android:publishMavenJavaPublicationToCustomRepoRepository FAILED
13-Mar-2022 12:37:08    > Could not PUT 'https://www.igniterealtime.org/archiva/repository/maven/org/igniterealtime/smack/smack-android/4.5.0-alpha2-SNAPSHOT/maven-metadata.xml'. Received status code 401 from server: Unauthorized
13-Mar-2022 12:37:08
13-Mar-2022 12:37:08 * Try:
13-Mar-2022 12:37:08 Run with --stacktrace option to get the stack trace. Run with --info or --debug option to get more log output. Run with --scan to get full insights.
13-Mar-2022 12:37:08
13-Mar-2022 12:37:08 * Get more help at https://help.gradle.org
13-Mar-2022 12:37:08
13-Mar-2022 12:37:08 BUILD FAILED in 6s
13-Mar-2022 12:37:08
13-Mar-2022 12:37:08 Deprecated Gradle features were used in this build, making it incompatible with Gradle 7.0.
13-Mar-2022 12:37:08 Use '--warning-mode all' to show the individual deprecation warnings.
13-Mar-2022 12:37:08 See https://docs.gradle.org/6.4.1/userguide/command_line_interface.html#sec:command_line_warnings
13-Mar-2022 12:37:08 35 actionable tasks: 6 executed, 29 up-to-date
13-Mar-2022 12:37:09 Set Java to java-11-amazon-corretto.x86_64
13-Mar-2022 12:37:09 JAVA_HOME=/usr/lib/jvm/java-11-amazon-corretto.x86_64
13-Mar-2022 12:37:09 PATH=/usr/lib/jvm/java-11-amazon-corretto.x86_64/bin:/usr/local/bin:/usr/bin:/usr/local/sbin:/usr/sbin:/home/bamboo/install4j/bin/:/home/bamboo/.local/bin:/home/bamboo/bin
13-Mar-2022 12:37:09 Executing /opt/gradle/bin/gradle publish -P customRepoUrl=https://oss.sonatype.org/content/repositories/snapshots/ -P customRepoUsername=igniterealtime-snapshot-upload -P customRepoPassword=******** -P useSonatype=false
13-Mar-2022 12:37:09 NOTE: Picked up JDK_JAVA_OPTIONS:  --add-opens=java.base/java.lang=ALL-UNNAMED --add-opens=java.base/java.io=ALL-UNNAMED --add-opens=java.base/java.util=ALL-UNNAMED --add-opens=java.base/java.util.concurrent=ALL-UNNAMED --add-opens=java.rmi/sun.rmi.transport=ALL-UNNAMED
13-Mar-2022 12:37:11 Maven publication 'mavenJava' pom metadata warnings (silence with 'suppressPomMetadataWarningsFor(variant)'):
13-Mar-2022 12:37:11   - Variant testFixturesApiElements:
13-Mar-2022 12:37:11       - Declares capability org.igniterealtime.smack:smack-android-test-fixtures:4.5.0-alpha2-SNAPSHOT which cannot be mapped to Maven
13-Mar-2022 12:37:11   - Variant testFixturesRuntimeElements:
13-Mar-2022 12:37:11       - Declares capability org.igniterealtime.smack:smack-android-test-fixtures:4.5.0-alpha2-SNAPSHOT which cannot be mapped to Maven
13-Mar-2022 12:37:11 These issues indicate information that is lost in the published 'pom' metadata file, which may be an issue if the published library is consumed by an old Gradle version or Apache Maven.
13-Mar-2022 12:37:11 The 'module' metadata file, which is used by Gradle 6+ is not affected.
13-Mar-2022 12:37:11 Maven publication 'mavenJava' pom metadata warnings (silence with 'suppressPomMetadataWarningsFor(variant)'):
13-Mar-2022 12:37:11   - Variant testFixturesApiElements:
13-Mar-2022 12:37:11       - Declares capability org.igniterealtime.smack:smack-android-extensions-test-fixtures:4.5.0-alpha2-SNAPSHOT which cannot be mapped to Maven
13-Mar-2022 12:37:11   - Variant testFixturesRuntimeElements:
13-Mar-2022 12:37:11       - Declares capability org.igniterealtime.smack:smack-android-extensions-test-fixtures:4.5.0-alpha2-SNAPSHOT which cannot be mapped to Maven
13-Mar-2022 12:37:11 These issues indicate information that is lost in the published 'pom' metadata file, which may be an issue if the published library is consumed by an old Gradle version or Apache Maven.
13-Mar-2022 12:37:11 The 'module' metadata file, which is used by Gradle 6+ is not affected.
13-Mar-2022 12:37:11 Maven publication 'mavenJava' pom metadata warnings (silence with 'suppressPomMetadataWarningsFor(variant)'):
13-Mar-2022 12:37:11   - Variant testFixturesApiElements:
13-Mar-2022 12:37:11       - Declares capability org.igniterealtime.smack:smack-bosh-test-fixtures:4.5.0-alpha2-SNAPSHOT which cannot be mapped to Maven
13-Mar-2022 12:37:11   - Variant testFixturesRuntimeElements:
13-Mar-2022 12:37:11       - Declares capability org.igniterealtime.smack:smack-bosh-test-fixtures:4.5.0-alpha2-SNAPSHOT which cannot be mapped to Maven
13-Mar-2022 12:37:11 These issues indicate information that is lost in the published 'pom' metadata file, which may be an issue if the published library is consumed by an old Gradle version or Apache Maven.
13-Mar-2022 12:37:11 The 'module' metadata file, which is used by Gradle 6+ is not affected.
13-Mar-2022 12:37:11 Maven publication 'mavenJava' pom metadata warnings (silence with 'suppressPomMetadataWarningsFor(variant)'):
13-Mar-2022 12:37:11   - Variant testFixturesApiElements:
13-Mar-2022 12:37:11       - Declares capability org.igniterealtime.smack:smack-core-test-fixtures:4.5.0-alpha2-SNAPSHOT which cannot be mapped to Maven
13-Mar-2022 12:37:11   - Variant testFixturesRuntimeElements:
13-Mar-2022 12:37:11       - Declares capability org.igniterealtime.smack:smack-core-test-fixtures:4.5.0-alpha2-SNAPSHOT which cannot be mapped to Maven
13-Mar-2022 12:37:11 These issues indicate information that is lost in the published 'pom' metadata file, which may be an issue if the published library is consumed by an old Gradle version or Apache Maven.
13-Mar-2022 12:37:11 The 'module' metadata file, which is used by Gradle 6+ is not affected.
13-Mar-2022 12:37:11 Maven publication 'mavenJava' pom metadata warnings (silence with 'suppressPomMetadataWarningsFor(variant)'):
13-Mar-2022 12:37:11   - Variant testFixturesApiElements:
13-Mar-2022 12:37:11       - Declares capability org.igniterealtime.smack:smack-debug-test-fixtures:4.5.0-alpha2-SNAPSHOT which cannot be mapped to Maven
13-Mar-2022 12:37:11   - Variant testFixturesRuntimeElements:
13-Mar-2022 12:37:11       - Declares capability org.igniterealtime.smack:smack-debug-test-fixtures:4.5.0-alpha2-SNAPSHOT which cannot be mapped to Maven
13-Mar-2022 12:37:11 These issues indicate information that is lost in the published 'pom' metadata file, which may be an issue if the published library is consumed by an old Gradle version or Apache Maven.
13-Mar-2022 12:37:11 The 'module' metadata file, which is used by Gradle 6+ is not affected.
13-Mar-2022 12:37:11 Maven publication 'mavenJava' pom metadata warnings (silence with 'suppressPomMetadataWarningsFor(variant)'):
13-Mar-2022 12:37:11   - Variant testFixturesApiElements:
13-Mar-2022 12:37:11       - Declares capability org.igniterealtime.smack:smack-debug-slf4j-test-fixtures:4.5.0-alpha2-SNAPSHOT which cannot be mapped to Maven
13-Mar-2022 12:37:11   - Variant testFixturesRuntimeElements:
13-Mar-2022 12:37:11       - Declares capability org.igniterealtime.smack:smack-debug-slf4j-test-fixtures:4.5.0-alpha2-SNAPSHOT which cannot be mapped to Maven
13-Mar-2022 12:37:11 These issues indicate information that is lost in the published 'pom' metadata file, which may be an issue if the published library is consumed by an old Gradle version or Apache Maven.
13-Mar-2022 12:37:11 The 'module' metadata file, which is used by Gradle 6+ is not affected.
13-Mar-2022 12:37:11 Maven publication 'mavenJava' pom metadata warnings (silence with 'suppressPomMetadataWarningsFor(variant)'):
13-Mar-2022 12:37:11   - Variant testFixturesApiElements:
13-Mar-2022 12:37:11       - Declares capability org.igniterealtime.smack:smack-experimental-test-fixtures:4.5.0-alpha2-SNAPSHOT which cannot be mapped to Maven
13-Mar-2022 12:37:11   - Variant testFixturesRuntimeElements:
13-Mar-2022 12:37:11       - Declares capability org.igniterealtime.smack:smack-experimental-test-fixtures:4.5.0-alpha2-SNAPSHOT which cannot be mapped to Maven
13-Mar-2022 12:37:11 These issues indicate information that is lost in the published 'pom' metadata file, which may be an issue if the published library is consumed by an old Gradle version or Apache Maven.
13-Mar-2022 12:37:11 The 'module' metadata file, which is used by Gradle 6+ is not affected.
13-Mar-2022 12:37:11 Maven publication 'mavenJava' pom metadata warnings (silence with 'suppressPomMetadataWarningsFor(variant)'):
13-Mar-2022 12:37:11   - Variant testFixturesApiElements:
13-Mar-2022 12:37:11       - Declares capability org.igniterealtime.smack:smack-extensions-test-fixtures:4.5.0-alpha2-SNAPSHOT which cannot be mapped to Maven
13-Mar-2022 12:37:11   - Variant testFixturesRuntimeElements:
13-Mar-2022 12:37:11       - Declares capability org.igniterealtime.smack:smack-extensions-test-fixtures:4.5.0-alpha2-SNAPSHOT which cannot be mapped to Maven
13-Mar-2022 12:37:11 These issues indicate information that is lost in the published 'pom' metadata file, which may be an issue if the published library is consumed by an old Gradle version or Apache Maven.
13-Mar-2022 12:37:11 The 'module' metadata file, which is used by Gradle 6+ is not affected.
13-Mar-2022 12:37:11 Maven publication 'mavenJava' pom metadata warnings (silence with 'suppressPomMetadataWarningsFor(variant)'):
13-Mar-2022 12:37:11   - Variant testFixturesApiElements:
13-Mar-2022 12:37:11       - Declares capability org.igniterealtime.smack:smack-im-test-fixtures:4.5.0-alpha2-SNAPSHOT which cannot be mapped to Maven
13-Mar-2022 12:37:11   - Variant testFixturesRuntimeElements:
13-Mar-2022 12:37:11       - Declares capability org.igniterealtime.smack:smack-im-test-fixtures:4.5.0-alpha2-SNAPSHOT which cannot be mapped to Maven
13-Mar-2022 12:37:11 These issues indicate information that is lost in the published 'pom' metadata file, which may be an issue if the published library is consumed by an old Gradle version or Apache Maven.
13-Mar-2022 12:37:11 The 'module' metadata file, which is used by Gradle 6+ is not affected.
13-Mar-2022 12:37:11 Maven publication 'mavenJava' pom metadata warnings (silence with 'suppressPomMetadataWarningsFor(variant)'):
13-Mar-2022 12:37:11   - Variant testFixturesApiElements:
13-Mar-2022 12:37:11       - Declares capability org.igniterealtime.smack:smack-integration-test-test-fixtures:4.5.0-alpha2-SNAPSHOT which cannot be mapped to Maven
13-Mar-2022 12:37:11   - Variant testFixturesRuntimeElements:
13-Mar-2022 12:37:11       - Declares capability org.igniterealtime.smack:smack-integration-test-test-fixtures:4.5.0-alpha2-SNAPSHOT which cannot be mapped to Maven
13-Mar-2022 12:37:11 These issues indicate information that is lost in the published 'pom' metadata file, which may be an issue if the published library is consumed by an old Gradle version or Apache Maven.
13-Mar-2022 12:37:11 The 'module' metadata file, which is used by Gradle 6+ is not affected.
13-Mar-2022 12:37:11 Maven publication 'mavenJava' pom metadata warnings (silence with 'suppressPomMetadataWarningsFor(variant)'):
13-Mar-2022 12:37:11   - Variant testFixturesApiElements:
13-Mar-2022 12:37:11       - Declares capability org.igniterealtime.smack:smack-java8-test-fixtures:4.5.0-alpha2-SNAPSHOT which cannot be mapped to Maven
13-Mar-2022 12:37:11   - Variant testFixturesRuntimeElements:
13-Mar-2022 12:37:11       - Declares capability org.igniterealtime.smack:smack-java8-test-fixtures:4.5.0-alpha2-SNAPSHOT which cannot be mapped to Maven
13-Mar-2022 12:37:11 These issues indicate information that is lost in the published 'pom' metadata file, which may be an issue if the published library is consumed by an old Gradle version or Apache Maven.
13-Mar-2022 12:37:11 The 'module' metadata file, which is used by Gradle 6+ is not affected.
13-Mar-2022 12:37:11 Maven publication 'mavenJava' pom metadata warnings (silence with 'suppressPomMetadataWarningsFor(variant)'):
13-Mar-2022 12:37:11   - Variant testFixturesApiElements:
13-Mar-2022 12:37:11       - Declares capability org.igniterealtime.smack:smack-java8-full-test-fixtures:4.5.0-alpha2-SNAPSHOT which cannot be mapped to Maven
13-Mar-2022 12:37:11   - Variant testFixturesRuntimeElements:
13-Mar-2022 12:37:11       - Declares capability org.igniterealtime.smack:smack-java8-full-test-fixtures:4.5.0-alpha2-SNAPSHOT which cannot be mapped to Maven
13-Mar-2022 12:37:11 These issues indicate information that is lost in the published 'pom' metadata file, which may be an issue if the published library is consumed by an old Gradle version or Apache Maven.
13-Mar-2022 12:37:11 The 'module' metadata file, which is used by Gradle 6+ is not affected.
13-Mar-2022 12:37:11 Maven publication 'mavenJava' pom metadata warnings (silence with 'suppressPomMetadataWarningsFor(variant)'):
13-Mar-2022 12:37:11   - Variant testFixturesApiElements:
13-Mar-2022 12:37:11       - Declares capability org.igniterealtime.smack:smack-jingle-old-test-fixtures:4.5.0-alpha2-SNAPSHOT which cannot be mapped to Maven
13-Mar-2022 12:37:11   - Variant testFixturesRuntimeElements:
13-Mar-2022 12:37:11       - Declares capability org.igniterealtime.smack:smack-jingle-old-test-fixtures:4.5.0-alpha2-SNAPSHOT which cannot be mapped to Maven
13-Mar-2022 12:37:11 These issues indicate information that is lost in the published 'pom' metadata file, which may be an issue if the published library is consumed by an old Gradle version or Apache Maven.
13-Mar-2022 12:37:11 The 'module' metadata file, which is used by Gradle 6+ is not affected.
13-Mar-2022 12:37:11 Maven publication 'mavenJava' pom metadata warnings (silence with 'suppressPomMetadataWarningsFor(variant)'):
13-Mar-2022 12:37:11   - Variant testFixturesApiElements:
13-Mar-2022 12:37:11       - Declares capability org.igniterealtime.smack:smack-legacy-test-fixtures:4.5.0-alpha2-SNAPSHOT which cannot be mapped to Maven
13-Mar-2022 12:37:11   - Variant testFixturesRuntimeElements:
13-Mar-2022 12:37:11       - Declares capability org.igniterealtime.smack:smack-legacy-test-fixtures:4.5.0-alpha2-SNAPSHOT which cannot be mapped to Maven
13-Mar-2022 12:37:11 These issues indicate information that is lost in the published 'pom' metadata file, which may be an issue if the published library is consumed by an old Gradle version or Apache Maven.
13-Mar-2022 12:37:11 The 'module' metadata file, which is used by Gradle 6+ is not affected.
13-Mar-2022 12:37:11 Maven publication 'mavenJava' pom metadata warnings (silence with 'suppressPomMetadataWarningsFor(variant)'):
13-Mar-2022 12:37:11   - Variant testFixturesApiElements:
13-Mar-2022 12:37:11       - Declares capability org.igniterealtime.smack:smack-omemo-test-fixtures:4.5.0-alpha2-SNAPSHOT which cannot be mapped to Maven
13-Mar-2022 12:37:11   - Variant testFixturesRuntimeElements:
13-Mar-2022 12:37:11       - Declares capability org.igniterealtime.smack:smack-omemo-test-fixtures:4.5.0-alpha2-SNAPSHOT which cannot be mapped to Maven
13-Mar-2022 12:37:11 These issues indicate information that is lost in the published 'pom' metadata file, which may be an issue if the published library is consumed by an old Gradle version or Apache Maven.
13-Mar-2022 12:37:11 The 'module' metadata file, which is used by Gradle 6+ is not affected.
13-Mar-2022 12:37:11 Maven publication 'mavenJava' pom metadata warnings (silence with 'suppressPomMetadataWarningsFor(variant)'):
13-Mar-2022 12:37:11   - Variant testFixturesApiElements:
13-Mar-2022 12:37:11       - Declares capability org.igniterealtime.smack:smack-omemo-signal-test-fixtures:4.5.0-alpha2-SNAPSHOT which cannot be mapped to Maven
13-Mar-2022 12:37:11   - Variant testFixturesRuntimeElements:
13-Mar-2022 12:37:11       - Declares capability org.igniterealtime.smack:smack-omemo-signal-test-fixtures:4.5.0-alpha2-SNAPSHOT which cannot be mapped to Maven
13-Mar-2022 12:37:11 These issues indicate information that is lost in the published 'pom' metadata file, which may be an issue if the published library is consumed by an old Gradle version or Apache Maven.
13-Mar-2022 12:37:11 The 'module' metadata file, which is used by Gradle 6+ is not affected.
13-Mar-2022 12:37:11 Maven publication 'mavenJava' pom metadata warnings (silence with 'suppressPomMetadataWarningsFor(variant)'):
13-Mar-2022 12:37:11   - Variant testFixturesApiElements:
13-Mar-2022 12:37:11       - Declares capability org.igniterealtime.smack:smack-omemo-signal-integration-test-test-fixtures:4.5.0-alpha2-SNAPSHOT which cannot be mapped to Maven
13-Mar-2022 12:37:11   - Variant testFixturesRuntimeElements:
13-Mar-2022 12:37:11       - Declares capability org.igniterealtime.smack:smack-omemo-signal-integration-test-test-fixtures:4.5.0-alpha2-SNAPSHOT which cannot be mapped to Maven
13-Mar-2022 12:37:11 These issues indicate information that is lost in the published 'pom' metadata file, which may be an issue if the published library is consumed by an old Gradle version or Apache Maven.
13-Mar-2022 12:37:11 The 'module' metadata file, which is used by Gradle 6+ is not affected.
13-Mar-2022 12:37:11 Maven publication 'mavenJava' pom metadata warnings (silence with 'suppressPomMetadataWarningsFor(variant)'):
13-Mar-2022 12:37:11   - Variant testFixturesApiElements:
13-Mar-2022 12:37:11       - Declares capability org.igniterealtime.smack:smack-openpgp-test-fixtures:4.5.0-alpha2-SNAPSHOT which cannot be mapped to Maven
13-Mar-2022 12:37:11   - Variant testFixturesRuntimeElements:
13-Mar-2022 12:37:11       - Declares capability org.igniterealtime.smack:smack-openpgp-test-fixtures:4.5.0-alpha2-SNAPSHOT which cannot be mapped to Maven
13-Mar-2022 12:37:11 These issues indicate information that is lost in the published 'pom' metadata file, which may be an issue if the published library is consumed by an old Gradle version or Apache Maven.
13-Mar-2022 12:37:11 The 'module' metadata file, which is used by Gradle 6+ is not affected.
13-Mar-2022 12:37:11 Maven publication 'mavenJava' pom metadata warnings (silence with 'suppressPomMetadataWarningsFor(variant)'):
13-Mar-2022 12:37:11   - Variant testFixturesApiElements:
13-Mar-2022 12:37:11       - Declares capability org.igniterealtime.smack:smack-repl-test-fixtures:4.5.0-alpha2-SNAPSHOT which cannot be mapped to Maven
13-Mar-2022 12:37:11   - Variant testFixturesRuntimeElements:
13-Mar-2022 12:37:11       - Declares capability org.igniterealtime.smack:smack-repl-test-fixtures:4.5.0-alpha2-SNAPSHOT which cannot be mapped to Maven
13-Mar-2022 12:37:11 These issues indicate information that is lost in the published 'pom' metadata file, which may be an issue if the published library is consumed by an old Gradle version or Apache Maven.
13-Mar-2022 12:37:11 The 'module' metadata file, which is used by Gradle 6+ is not affected.
13-Mar-2022 12:37:12 Maven publication 'mavenJava' pom metadata warnings (silence with 'suppressPomMetadataWarningsFor(variant)'):
13-Mar-2022 12:37:12   - Variant testFixturesApiElements:
13-Mar-2022 12:37:12       - Declares capability org.igniterealtime.smack:smack-resolver-dnsjava-test-fixtures:4.5.0-alpha2-SNAPSHOT which cannot be mapped to Maven
13-Mar-2022 12:37:12   - Variant testFixturesRuntimeElements:
13-Mar-2022 12:37:12       - Declares capability org.igniterealtime.smack:smack-resolver-dnsjava-test-fixtures:4.5.0-alpha2-SNAPSHOT which cannot be mapped to Maven
13-Mar-2022 12:37:12 These issues indicate information that is lost in the published 'pom' metadata file, which may be an issue if the published library is consumed by an old Gradle version or Apache Maven.
13-Mar-2022 12:37:12 The 'module' metadata file, which is used by Gradle 6+ is not affected.
13-Mar-2022 12:37:12 Maven publication 'mavenJava' pom metadata warnings (silence with 'suppressPomMetadataWarningsFor(variant)'):
13-Mar-2022 12:37:12   - Variant testFixturesApiElements:
13-Mar-2022 12:37:12       - Declares capability org.igniterealtime.smack:smack-resolver-javax-test-fixtures:4.5.0-alpha2-SNAPSHOT which cannot be mapped to Maven
13-Mar-2022 12:37:12   - Variant testFixturesRuntimeElements:
13-Mar-2022 12:37:12       - Declares capability org.igniterealtime.smack:smack-resolver-javax-test-fixtures:4.5.0-alpha2-SNAPSHOT which cannot be mapped to Maven
13-Mar-2022 12:37:12 These issues indicate information that is lost in the published 'pom' metadata file, which may be an issue if the published library is consumed by an old Gradle version or Apache Maven.
13-Mar-2022 12:37:12 The 'module' metadata file, which is used by Gradle 6+ is not affected.
13-Mar-2022 12:37:12 Maven publication 'mavenJava' pom metadata warnings (silence with 'suppressPomMetadataWarningsFor(variant)'):
13-Mar-2022 12:37:12   - Variant testFixturesApiElements:
13-Mar-2022 12:37:12       - Declares capability org.igniterealtime.smack:smack-resolver-minidns-test-fixtures:4.5.0-alpha2-SNAPSHOT which cannot be mapped to Maven
13-Mar-2022 12:37:12   - Variant testFixturesRuntimeElements:
13-Mar-2022 12:37:12       - Declares capability org.igniterealtime.smack:smack-resolver-minidns-test-fixtures:4.5.0-alpha2-SNAPSHOT which cannot be mapped to Maven
13-Mar-2022 12:37:12 These issues indicate information that is lost in the published 'pom' metadata file, which may be an issue if the published library is consumed by an old Gradle version or Apache Maven.
13-Mar-2022 12:37:12 The 'module' metadata file, which is used by Gradle 6+ is not affected.
13-Mar-2022 12:37:12 Maven publication 'mavenJava' pom metadata warnings (silence with 'suppressPomMetadataWarningsFor(variant)'):
13-Mar-2022 12:37:12   - Variant testFixturesApiElements:
13-Mar-2022 12:37:12       - Declares capability org.igniterealtime.smack:smack-resolver-minidns-dox-test-fixtures:4.5.0-alpha2-SNAPSHOT which cannot be mapped to Maven
13-Mar-2022 12:37:12   - Variant testFixturesRuntimeElements:
13-Mar-2022 12:37:12       - Declares capability org.igniterealtime.smack:smack-resolver-minidns-dox-test-fixtures:4.5.0-alpha2-SNAPSHOT which cannot be mapped to Maven
13-Mar-2022 12:37:12 These issues indicate information that is lost in the published 'pom' metadata file, which may be an issue if the published library is consumed by an old Gradle version or Apache Maven.
13-Mar-2022 12:37:12 The 'module' metadata file, which is used by Gradle 6+ is not affected.
13-Mar-2022 12:37:12 Maven publication 'mavenJava' pom metadata warnings (silence with 'suppressPomMetadataWarningsFor(variant)'):
13-Mar-2022 12:37:12   - Variant testFixturesApiElements:
13-Mar-2022 12:37:12       - Declares capability org.igniterealtime.smack:smack-sasl-javax-test-fixtures:4.5.0-alpha2-SNAPSHOT which cannot be mapped to Maven
13-Mar-2022 12:37:12   - Variant testFixturesRuntimeElements:
13-Mar-2022 12:37:12       - Declares capability org.igniterealtime.smack:smack-sasl-javax-test-fixtures:4.5.0-alpha2-SNAPSHOT which cannot be mapped to Maven
13-Mar-2022 12:37:12 These issues indicate information that is lost in the published 'pom' metadata file, which may be an issue if the published library is consumed by an old Gradle version or Apache Maven.
13-Mar-2022 12:37:12 The 'module' metadata file, which is used by Gradle 6+ is not affected.
13-Mar-2022 12:37:12 Maven publication 'mavenJava' pom metadata warnings (silence with 'suppressPomMetadataWarningsFor(variant)'):
13-Mar-2022 12:37:12   - Variant testFixturesApiElements:
13-Mar-2022 12:37:12       - Declares capability org.igniterealtime.smack:smack-sasl-provided-test-fixtures:4.5.0-alpha2-SNAPSHOT which cannot be mapped to Maven
13-Mar-2022 12:37:12   - Variant testFixturesRuntimeElements:
13-Mar-2022 12:37:12       - Declares capability org.igniterealtime.smack:smack-sasl-provided-test-fixtures:4.5.0-alpha2-SNAPSHOT which cannot be mapped to Maven
13-Mar-2022 12:37:12 These issues indicate information that is lost in the published 'pom' metadata file, which may be an issue if the published library is consumed by an old Gradle version or Apache Maven.
13-Mar-2022 12:37:12 The 'module' metadata file, which is used by Gradle 6+ is not affected.
13-Mar-2022 12:37:12 Maven publication 'mavenJava' pom metadata warnings (silence with 'suppressPomMetadataWarningsFor(variant)'):
13-Mar-2022 12:37:12   - Variant testFixturesApiElements:
13-Mar-2022 12:37:12       - Declares capability org.igniterealtime.smack:smack-streammanagement-test-fixtures:4.5.0-alpha2-SNAPSHOT which cannot be mapped to Maven
13-Mar-2022 12:37:12   - Variant testFixturesRuntimeElements:
13-Mar-2022 12:37:12       - Declares capability org.igniterealtime.smack:smack-streammanagement-test-fixtures:4.5.0-alpha2-SNAPSHOT which cannot be mapped to Maven
13-Mar-2022 12:37:12 These issues indicate information that is lost in the published 'pom' metadata file, which may be an issue if the published library is consumed by an old Gradle version or Apache Maven.
13-Mar-2022 12:37:12 The 'module' metadata file, which is used by Gradle 6+ is not affected.
13-Mar-2022 12:37:12 Maven publication 'mavenJava' pom metadata warnings (silence with 'suppressPomMetadataWarningsFor(variant)'):
13-Mar-2022 12:37:12   - Variant testFixturesApiElements:
13-Mar-2022 12:37:12       - Declares capability org.igniterealtime.smack:smack-tcp-test-fixtures:4.5.0-alpha2-SNAPSHOT which cannot be mapped to Maven
13-Mar-2022 12:37:12   - Variant testFixturesRuntimeElements:
13-Mar-2022 12:37:12       - Declares capability org.igniterealtime.smack:smack-tcp-test-fixtures:4.5.0-alpha2-SNAPSHOT which cannot be mapped to Maven
13-Mar-2022 12:37:12 These issues indicate information that is lost in the published 'pom' metadata file, which may be an issue if the published library is consumed by an old Gradle version or Apache Maven.
13-Mar-2022 12:37:12 The 'module' metadata file, which is used by Gradle 6+ is not affected.
13-Mar-2022 12:37:12 Maven publication 'mavenJava' pom metadata warnings (silence with 'suppressPomMetadataWarningsFor(variant)'):
13-Mar-2022 12:37:12   - Variant testFixturesApiElements:
13-Mar-2022 12:37:12       - Declares capability org.igniterealtime.smack:smack-websocket-test-fixtures:4.5.0-alpha2-SNAPSHOT which cannot be mapped to Maven
13-Mar-2022 12:37:12   - Variant testFixturesRuntimeElements:
13-Mar-2022 12:37:12       - Declares capability org.igniterealtime.smack:smack-websocket-test-fixtures:4.5.0-alpha2-SNAPSHOT which cannot be mapped to Maven
13-Mar-2022 12:37:12 These issues indicate information that is lost in the published 'pom' metadata file, which may be an issue if the published library is consumed by an old Gradle version or Apache Maven.
13-Mar-2022 12:37:12 The 'module' metadata file, which is used by Gradle 6+ is not affected.
13-Mar-2022 12:37:12 Maven publication 'mavenJava' pom metadata warnings (silence with 'suppressPomMetadataWarningsFor(variant)'):
13-Mar-2022 12:37:12   - Variant testFixturesApiElements:
13-Mar-2022 12:37:12       - Declares capability org.igniterealtime.smack:smack-websocket-java11-test-fixtures:4.5.0-alpha2-SNAPSHOT which cannot be mapped to Maven
13-Mar-2022 12:37:12   - Variant testFixturesRuntimeElements:
13-Mar-2022 12:37:12       - Declares capability org.igniterealtime.smack:smack-websocket-java11-test-fixtures:4.5.0-alpha2-SNAPSHOT which cannot be mapped to Maven
13-Mar-2022 12:37:12 These issues indicate information that is lost in the published 'pom' metadata file, which may be an issue if the published library is consumed by an old Gradle version or Apache Maven.
13-Mar-2022 12:37:12 The 'module' metadata file, which is used by Gradle 6+ is not affected.
13-Mar-2022 12:37:12 Maven publication 'mavenJava' pom metadata warnings (silence with 'suppressPomMetadataWarningsFor(variant)'):
13-Mar-2022 12:37:12   - Variant testFixturesApiElements:
13-Mar-2022 12:37:12       - Declares capability org.igniterealtime.smack:smack-websocket-okhttp-test-fixtures:4.5.0-alpha2-SNAPSHOT which cannot be mapped to Maven
13-Mar-2022 12:37:12   - Variant testFixturesRuntimeElements:
13-Mar-2022 12:37:12       - Declares capability org.igniterealtime.smack:smack-websocket-okhttp-test-fixtures:4.5.0-alpha2-SNAPSHOT which cannot be mapped to Maven
13-Mar-2022 12:37:12 These issues indicate information that is lost in the published 'pom' metadata file, which may be an issue if the published library is consumed by an old Gradle version or Apache Maven.
13-Mar-2022 12:37:12 The 'module' metadata file, which is used by Gradle 6+ is not affected.
13-Mar-2022 12:37:12 Maven publication 'mavenJava' pom metadata warnings (silence with 'suppressPomMetadataWarningsFor(variant)'):
13-Mar-2022 12:37:12   - Variant testFixturesApiElements:
13-Mar-2022 12:37:12       - Declares capability org.igniterealtime.smack:smack-xmlparser-test-fixtures:4.5.0-alpha2-SNAPSHOT which cannot be mapped to Maven
13-Mar-2022 12:37:12   - Variant testFixturesRuntimeElements:
13-Mar-2022 12:37:12       - Declares capability org.igniterealtime.smack:smack-xmlparser-test-fixtures:4.5.0-alpha2-SNAPSHOT which cannot be mapped to Maven
13-Mar-2022 12:37:12 These issues indicate information that is lost in the published 'pom' metadata file, which may be an issue if the published library is consumed by an old Gradle version or Apache Maven.
13-Mar-2022 12:37:12 The 'module' metadata file, which is used by Gradle 6+ is not affected.
13-Mar-2022 12:37:12 Maven publication 'mavenJava' pom metadata warnings (silence with 'suppressPomMetadataWarningsFor(variant)'):
13-Mar-2022 12:37:12   - Variant testFixturesApiElements:
13-Mar-2022 12:37:12       - Declares capability org.igniterealtime.smack:smack-xmlparser-stax-test-fixtures:4.5.0-alpha2-SNAPSHOT which cannot be mapped to Maven
13-Mar-2022 12:37:12   - Variant testFixturesRuntimeElements:
13-Mar-2022 12:37:12       - Declares capability org.igniterealtime.smack:smack-xmlparser-stax-test-fixtures:4.5.0-alpha2-SNAPSHOT which cannot be mapped to Maven
13-Mar-2022 12:37:12 These issues indicate information that is lost in the published 'pom' metadata file, which may be an issue if the published library is consumed by an old Gradle version or Apache Maven.
13-Mar-2022 12:37:12 The 'module' metadata file, which is used by Gradle 6+ is not affected.
13-Mar-2022 12:37:12 Maven publication 'mavenJava' pom metadata warnings (silence with 'suppressPomMetadataWarningsFor(variant)'):
13-Mar-2022 12:37:12   - Variant testFixturesApiElements:
13-Mar-2022 12:37:12       - Declares capability org.igniterealtime.smack:smack-xmlparser-xpp3-test-fixtures:4.5.0-alpha2-SNAPSHOT which cannot be mapped to Maven
13-Mar-2022 12:37:12   - Variant testFixturesRuntimeElements:
13-Mar-2022 12:37:12       - Declares capability org.igniterealtime.smack:smack-xmlparser-xpp3-test-fixtures:4.5.0-alpha2-SNAPSHOT which cannot be mapped to Maven
13-Mar-2022 12:37:12 These issues indicate information that is lost in the published 'pom' metadata file, which may be an issue if the published library is consumed by an old Gradle version or Apache Maven.
13-Mar-2022 12:37:12 The 'module' metadata file, which is used by Gradle 6+ is not affected.
13-Mar-2022 12:37:12 > Task :smack-core:createVersionResource UP-TO-DATE
13-Mar-2022 12:37:12 > Task :smack-xmlparser:compileJava UP-TO-DATE
13-Mar-2022 12:37:12 > Task :smack-xmlparser:processResources NO-SOURCE
13-Mar-2022 12:37:12 > Task :smack-xmlparser:classes UP-TO-DATE
13-Mar-2022 12:37:12 > Task :smack-xmlparser:jar UP-TO-DATE
13-Mar-2022 12:37:12 > Task :smack-core:compileJava UP-TO-DATE
13-Mar-2022 12:37:12 > Task :smack-core:processResources UP-TO-DATE
13-Mar-2022 12:37:12 > Task :smack-core:classes UP-TO-DATE
13-Mar-2022 12:37:12 > Task :smack-core:jar UP-TO-DATE
13-Mar-2022 12:37:12 > Task :smack-im:compileJava UP-TO-DATE
13-Mar-2022 12:37:12 > Task :smack-im:processResources UP-TO-DATE
13-Mar-2022 12:37:12 > Task :smack-im:classes UP-TO-DATE
13-Mar-2022 12:37:12 > Task :smack-im:jar UP-TO-DATE
13-Mar-2022 12:37:12 > Task :smack-extensions:compileJava UP-TO-DATE
13-Mar-2022 12:37:12 > Task :smack-extensions:processResources UP-TO-DATE
13-Mar-2022 12:37:12 > Task :smack-extensions:classes UP-TO-DATE
13-Mar-2022 12:37:12 > Task :smack-extensions:jar UP-TO-DATE
13-Mar-2022 12:37:12 > Task :smack-experimental:compileJava UP-TO-DATE
13-Mar-2022 12:37:12 > Task :smack-experimental:processResources UP-TO-DATE
13-Mar-2022 12:37:12 > Task :smack-experimental:classes UP-TO-DATE
13-Mar-2022 12:37:12 > Task :smack-experimental:jar UP-TO-DATE
13-Mar-2022 12:37:12 > Task :smack-openpgp:compileJava UP-TO-DATE
13-Mar-2022 12:37:12 > Task :smack-openpgp:processResources UP-TO-DATE
13-Mar-2022 12:37:12 > Task :smack-openpgp:classes UP-TO-DATE
13-Mar-2022 12:37:12 > Task :smack-openpgp:jar UP-TO-DATE
13-Mar-2022 12:37:12 > Task :smack-resolver-minidns:compileJava UP-TO-DATE
13-Mar-2022 12:37:12 > Task :smack-resolver-minidns:processResources NO-SOURCE
13-Mar-2022 12:37:12 > Task :smack-resolver-minidns:classes UP-TO-DATE
13-Mar-2022 12:37:12 > Task :smack-resolver-minidns:jar UP-TO-DATE
13-Mar-2022 12:37:12 > Task :smack-sasl-provided:compileJava UP-TO-DATE
13-Mar-2022 12:37:12 > Task :smack-sasl-provided:processResources NO-SOURCE
13-Mar-2022 12:37:12 > Task :smack-sasl-provided:classes UP-TO-DATE
13-Mar-2022 12:37:12 > Task :smack-sasl-provided:jar UP-TO-DATE
13-Mar-2022 12:37:12 > Task :smack-xmlparser-xpp3:compileJava UP-TO-DATE
13-Mar-2022 12:37:12 > Task :smack-xmlparser-xpp3:processResources UP-TO-DATE
13-Mar-2022 12:37:12 > Task :smack-xmlparser-xpp3:classes UP-TO-DATE
13-Mar-2022 12:37:12 > Task :smack-xmlparser-xpp3:jar UP-TO-DATE
13-Mar-2022 12:37:12 > Task :smack-android:compileJava UP-TO-DATE
13-Mar-2022 12:37:12 > Task :smack-android:processResources NO-SOURCE
13-Mar-2022 12:37:12 > Task :smack-android:classes UP-TO-DATE
13-Mar-2022 12:37:12 > Task :smack-android:jar UP-TO-DATE
13-Mar-2022 12:37:12 > Task :smack-android:compileTestFixturesJava NO-SOURCE
13-Mar-2022 12:37:12 > Task :smack-android:processTestFixturesResources NO-SOURCE
13-Mar-2022 12:37:12 > Task :smack-android:testFixturesClasses UP-TO-DATE
13-Mar-2022 12:37:12 > Task :smack-android:testFixturesJar UP-TO-DATE
13-Mar-2022 12:37:12 > Task :smack-android:generateMetadataFileForMavenJavaPublication
13-Mar-2022 12:37:12 > Task :smack-android:generatePomFileForMavenJavaPublication
13-Mar-2022 12:37:12 > Task :smack-android:copyJavadocDocFiles NO-SOURCE
13-Mar-2022 12:37:12 > Task :smack-android:javadoc UP-TO-DATE
13-Mar-2022 12:37:12 > Task :smack-android:javadocJar UP-TO-DATE
13-Mar-2022 12:37:12 > Task :smack-android:sourcesJar UP-TO-DATE
13-Mar-2022 12:37:12 > Task :smack-android:compileTestJava NO-SOURCE
13-Mar-2022 12:37:12 > Task :smack-android:processTestResources NO-SOURCE
13-Mar-2022 12:37:12 > Task :smack-android:testClasses UP-TO-DATE
13-Mar-2022 12:37:12 > Task :smack-android:testsJar UP-TO-DATE
13-Mar-2022 12:37:12 > Task :smack-android:signMavenJavaPublication SKIPPED
13-Mar-2022 12:37:18 > Task :smack-android:publishMavenJavaPublicationToCustomRepoRepository
13-Mar-2022 12:37:18 > Task :smack-android:publish
13-Mar-2022 12:37:18 > Task :smack-android-extensions:compileJava UP-TO-DATE
13-Mar-2022 12:37:18 > Task :smack-android-extensions:processResources NO-SOURCE
13-Mar-2022 12:37:18 > Task :smack-android-extensions:classes UP-TO-DATE
13-Mar-2022 12:37:18 > Task :smack-android-extensions:jar UP-TO-DATE
13-Mar-2022 12:37:18 > Task :smack-android-extensions:compileTestFixturesJava NO-SOURCE
13-Mar-2022 12:37:18 > Task :smack-android-extensions:processTestFixturesResources NO-SOURCE
13-Mar-2022 12:37:18 > Task :smack-android-extensions:testFixturesClasses UP-TO-DATE
13-Mar-2022 12:37:18 > Task :smack-android-extensions:testFixturesJar UP-TO-DATE
13-Mar-2022 12:37:18 > Task :smack-android-extensions:generateMetadataFileForMavenJavaPublication
13-Mar-2022 12:37:18 > Task :smack-android-extensions:generatePomFileForMavenJavaPublication
13-Mar-2022 12:37:18 > Task :smack-android-extensions:copyJavadocDocFiles NO-SOURCE
13-Mar-2022 12:37:18 > Task :smack-android-extensions:javadoc UP-TO-DATE
13-Mar-2022 12:37:18 > Task :smack-android-extensions:javadocJar
13-Mar-2022 12:37:18 > Task :smack-android-extensions:sourcesJar
13-Mar-2022 12:37:18 > Task :smack-android-extensions:compileTestJava NO-SOURCE
13-Mar-2022 12:37:18 > Task :smack-android-extensions:processTestResources NO-SOURCE
13-Mar-2022 12:37:18 > Task :smack-android-extensions:testClasses UP-TO-DATE
13-Mar-2022 12:37:18 > Task :smack-android-extensions:testsJar
13-Mar-2022 12:37:18 > Task :smack-android-extensions:signMavenJavaPublication SKIPPED
13-Mar-2022 12:37:24 > Task :smack-android-extensions:publishMavenJavaPublicationToCustomRepoRepository
13-Mar-2022 12:37:24 > Task :smack-android-extensions:publish
13-Mar-2022 12:37:24 > Task :smack-bosh:compileJava UP-TO-DATE
13-Mar-2022 12:37:24 > Task :smack-bosh:processResources NO-SOURCE
13-Mar-2022 12:37:24 > Task :smack-bosh:classes UP-TO-DATE
13-Mar-2022 12:37:24 > Task :smack-bosh:jar UP-TO-DATE
13-Mar-2022 12:37:24 > Task :smack-bosh:compileTestFixturesJava NO-SOURCE
13-Mar-2022 12:37:24 > Task :smack-bosh:processTestFixturesResources NO-SOURCE
13-Mar-2022 12:37:24 > Task :smack-bosh:testFixturesClasses UP-TO-DATE
13-Mar-2022 12:37:24 > Task :smack-bosh:testFixturesJar UP-TO-DATE
13-Mar-2022 12:37:24 > Task :smack-bosh:generateMetadataFileForMavenJavaPublication
13-Mar-2022 12:37:24 > Task :smack-bosh:generatePomFileForMavenJavaPublication
13-Mar-2022 12:37:24 > Task :smack-bosh:copyJavadocDocFiles NO-SOURCE
13-Mar-2022 12:37:24 > Task :smack-bosh:javadoc UP-TO-DATE
13-Mar-2022 12:37:24 > Task :smack-bosh:javadocJar
13-Mar-2022 12:37:24 > Task :smack-bosh:sourcesJar
13-Mar-2022 12:37:24 > Task :smack-bosh:compileTestJava NO-SOURCE
13-Mar-2022 12:37:24 > Task :smack-bosh:processTestResources NO-SOURCE
13-Mar-2022 12:37:24 > Task :smack-bosh:testClasses UP-TO-DATE
13-Mar-2022 12:37:24 > Task :smack-bosh:testsJar
13-Mar-2022 12:37:24 > Task :smack-bosh:signMavenJavaPublication SKIPPED
13-Mar-2022 12:37:30 > Task :smack-bosh:publishMavenJavaPublicationToCustomRepoRepository
13-Mar-2022 12:37:30 > Task :smack-bosh:publish
13-Mar-2022 12:37:30 > Task :smack-xmlparser-stax:compileJava UP-TO-DATE
13-Mar-2022 12:37:30 > Task :smack-core:compileTestFixturesJava UP-TO-DATE
13-Mar-2022 12:37:30 > Task :smack-core:processTestFixturesResources NO-SOURCE
13-Mar-2022 12:37:30 > Task :smack-core:testFixturesClasses UP-TO-DATE
13-Mar-2022 12:37:30 > Task :smack-core:testFixturesJar UP-TO-DATE
13-Mar-2022 12:37:30 > Task :smack-core:generateMetadataFileForMavenJavaPublication
13-Mar-2022 12:37:30 > Task :smack-core:generatePomFileForMavenJavaPublication
13-Mar-2022 12:37:30 > Task :smack-core:copyJavadocDocFiles NO-SOURCE
13-Mar-2022 12:37:30 > Task :smack-core:javadoc UP-TO-DATE
13-Mar-2022 12:37:31 > Task :smack-core:javadocJar
13-Mar-2022 12:37:31 > Task :smack-core:sourcesJar
13-Mar-2022 12:37:31 > Task :smack-core:compileTestJava UP-TO-DATE
13-Mar-2022 12:37:31 > Task :smack-core:processTestResources UP-TO-DATE
13-Mar-2022 12:37:31 > Task :smack-core:testClasses UP-TO-DATE
13-Mar-2022 12:37:31 > Task :smack-core:testsJar
13-Mar-2022 12:37:31 > Task :smack-core:signMavenJavaPublication SKIPPED
13-Mar-2022 12:37:37 > Task :smack-core:publishMavenJavaPublicationToCustomRepoRepository
13-Mar-2022 12:37:37 > Task :smack-core:publish
13-Mar-2022 12:37:37 > Task :smack-debug:compileJava UP-TO-DATE
13-Mar-2022 12:37:37 > Task :smack-debug:processResources UP-TO-DATE
13-Mar-2022 12:37:37 > Task :smack-debug:classes UP-TO-DATE
13-Mar-2022 12:37:37 > Task :smack-debug:jar UP-TO-DATE
13-Mar-2022 12:37:37 > Task :smack-debug:compileTestFixturesJava NO-SOURCE
13-Mar-2022 12:37:37 > Task :smack-debug:processTestFixturesResources NO-SOURCE
13-Mar-2022 12:37:37 > Task :smack-debug:testFixturesClasses UP-TO-DATE
13-Mar-2022 12:37:37 > Task :smack-debug:testFixturesJar UP-TO-DATE
13-Mar-2022 12:37:37 > Task :smack-debug:generateMetadataFileForMavenJavaPublication
13-Mar-2022 12:37:37 > Task :smack-debug:generatePomFileForMavenJavaPublication
13-Mar-2022 12:37:37 > Task :smack-debug:copyJavadocDocFiles NO-SOURCE
13-Mar-2022 12:37:37 > Task :smack-debug:javadoc UP-TO-DATE
13-Mar-2022 12:37:37 > Task :smack-debug:javadocJar
13-Mar-2022 12:37:37 > Task :smack-debug:sourcesJar
13-Mar-2022 12:37:37 > Task :smack-debug:compileTestJava NO-SOURCE
13-Mar-2022 12:37:37 > Task :smack-debug:processTestResources NO-SOURCE
13-Mar-2022 12:37:37 > Task :smack-debug:testClasses UP-TO-DATE
13-Mar-2022 12:37:37 > Task :smack-debug:testsJar
13-Mar-2022 12:37:37 > Task :smack-debug:signMavenJavaPublication SKIPPED
13-Mar-2022 12:37:43 > Task :smack-debug:publishMavenJavaPublicationToCustomRepoRepository
13-Mar-2022 12:37:43 > Task :smack-debug:publish
13-Mar-2022 12:37:43 > Task :smack-debug-slf4j:compileJava UP-TO-DATE
13-Mar-2022 12:37:43 > Task :smack-debug-slf4j:processResources NO-SOURCE
13-Mar-2022 12:37:43 > Task :smack-debug-slf4j:classes UP-TO-DATE
13-Mar-2022 12:37:43 > Task :smack-debug-slf4j:jar UP-TO-DATE
13-Mar-2022 12:37:43 > Task :smack-debug-slf4j:compileTestFixturesJava NO-SOURCE
13-Mar-2022 12:37:43 > Task :smack-debug-slf4j:processTestFixturesResources NO-SOURCE
13-Mar-2022 12:37:43 > Task :smack-debug-slf4j:testFixturesClasses UP-TO-DATE
13-Mar-2022 12:37:43 > Task :smack-debug-slf4j:testFixturesJar UP-TO-DATE
13-Mar-2022 12:37:43 > Task :smack-debug-slf4j:generateMetadataFileForMavenJavaPublication
13-Mar-2022 12:37:43 > Task :smack-debug-slf4j:generatePomFileForMavenJavaPublication
13-Mar-2022 12:37:43 > Task :smack-debug-slf4j:copyJavadocDocFiles NO-SOURCE
13-Mar-2022 12:37:43 > Task :smack-debug-slf4j:javadoc UP-TO-DATE
13-Mar-2022 12:37:43 > Task :smack-debug-slf4j:javadocJar
13-Mar-2022 12:37:43 > Task :smack-debug-slf4j:sourcesJar
13-Mar-2022 12:37:43 > Task :smack-debug-slf4j:compileTestJava NO-SOURCE
13-Mar-2022 12:37:43 > Task :smack-debug-slf4j:processTestResources NO-SOURCE
13-Mar-2022 12:37:43 > Task :smack-debug-slf4j:testClasses UP-TO-DATE
13-Mar-2022 12:37:43 > Task :smack-debug-slf4j:testsJar
13-Mar-2022 12:37:43 > Task :smack-debug-slf4j:signMavenJavaPublication SKIPPED
13-Mar-2022 12:37:49 > Task :smack-debug-slf4j:publishMavenJavaPublicationToCustomRepoRepository
13-Mar-2022 12:37:49 > Task :smack-debug-slf4j:publish
13-Mar-2022 12:37:49 > Task :smack-extensions:compileTestFixturesJava UP-TO-DATE
13-Mar-2022 12:37:49 > Task :smack-experimental:compileTestFixturesJava NO-SOURCE
13-Mar-2022 12:37:49 > Task :smack-experimental:processTestFixturesResources NO-SOURCE
13-Mar-2022 12:37:49 > Task :smack-experimental:testFixturesClasses UP-TO-DATE
13-Mar-2022 12:37:49 > Task :smack-experimental:testFixturesJar UP-TO-DATE
13-Mar-2022 12:37:49 > Task :smack-experimental:generateMetadataFileForMavenJavaPublication
13-Mar-2022 12:37:49 > Task :smack-experimental:generatePomFileForMavenJavaPublication
13-Mar-2022 12:37:49 > Task :smack-experimental:copyJavadocDocFiles NO-SOURCE
13-Mar-2022 12:37:49 > Task :smack-experimental:javadoc UP-TO-DATE
13-Mar-2022 12:37:49 > Task :smack-experimental:javadocJar
13-Mar-2022 12:37:49 > Task :smack-experimental:sourcesJar
13-Mar-2022 12:37:50 > Task :smack-experimental:compileTestJava UP-TO-DATE
13-Mar-2022 12:37:50 > Task :smack-experimental:processTestResources NO-SOURCE
13-Mar-2022 12:37:50 > Task :smack-experimental:testClasses UP-TO-DATE
13-Mar-2022 12:37:50 > Task :smack-experimental:testsJar
13-Mar-2022 12:37:50 > Task :smack-experimental:signMavenJavaPublication SKIPPED
13-Mar-2022 12:37:56 > Task :smack-experimental:publishMavenJavaPublicationToCustomRepoRepository
13-Mar-2022 12:37:56 > Task :smack-experimental:publish
13-Mar-2022 12:37:56 > Task :smack-extensions:processTestFixturesResources NO-SOURCE
13-Mar-2022 12:37:56 > Task :smack-extensions:testFixturesClasses UP-TO-DATE
13-Mar-2022 12:37:56 > Task :smack-extensions:testFixturesJar UP-TO-DATE
13-Mar-2022 12:37:56 > Task :smack-extensions:generateMetadataFileForMavenJavaPublication
13-Mar-2022 12:37:56 > Task :smack-extensions:generatePomFileForMavenJavaPublication
13-Mar-2022 12:37:56 > Task :smack-extensions:copyJavadocDocFiles NO-SOURCE
13-Mar-2022 12:37:56 > Task :smack-extensions:javadoc UP-TO-DATE
13-Mar-2022 12:37:56 > Task :smack-extensions:javadocJar
13-Mar-2022 12:37:56 > Task :smack-extensions:sourcesJar
13-Mar-2022 12:37:56 > Task :smack-extensions:compileTestJava UP-TO-DATE
13-Mar-2022 12:37:56 > Task :smack-extensions:processTestResources UP-TO-DATE
13-Mar-2022 12:37:56 > Task :smack-extensions:testClasses UP-TO-DATE
13-Mar-2022 12:37:56 > Task :smack-extensions:testsJar
13-Mar-2022 12:37:56 > Task :smack-extensions:signMavenJavaPublication SKIPPED
13-Mar-2022 12:38:03 > Task :smack-extensions:publishMavenJavaPublicationToCustomRepoRepository
13-Mar-2022 12:38:03 > Task :smack-extensions:publish
13-Mar-2022 12:38:03 > Task :smack-im:compileTestFixturesJava NO-SOURCE
13-Mar-2022 12:38:03 > Task :smack-im:processTestFixturesResources NO-SOURCE
13-Mar-2022 12:38:03 > Task :smack-im:testFixturesClasses UP-TO-DATE
13-Mar-2022 12:38:03 > Task :smack-im:testFixturesJar UP-TO-DATE
13-Mar-2022 12:38:03 > Task :smack-im:generateMetadataFileForMavenJavaPublication
13-Mar-2022 12:38:03 > Task :smack-im:generatePomFileForMavenJavaPublication
13-Mar-2022 12:38:03 > Task :smack-im:copyJavadocDocFiles NO-SOURCE
13-Mar-2022 12:38:03 > Task :smack-im:javadoc UP-TO-DATE
13-Mar-2022 12:38:03 > Task :smack-im:javadocJar
13-Mar-2022 12:38:03 > Task :smack-im:sourcesJar
13-Mar-2022 12:38:03 > Task :smack-im:compileTestJava UP-TO-DATE
13-Mar-2022 12:38:03 > Task :smack-im:processTestResources NO-SOURCE
13-Mar-2022 12:38:03 > Task :smack-im:testClasses UP-TO-DATE
13-Mar-2022 12:38:03 > Task :smack-im:testsJar
13-Mar-2022 12:38:03 > Task :smack-im:signMavenJavaPublication SKIPPED
13-Mar-2022 12:38:09 > Task :smack-im:publishMavenJavaPublicationToCustomRepoRepository
13-Mar-2022 12:38:09 > Task :smack-im:publish
13-Mar-2022 12:38:09 > Task :smack-resolver-javax:compileJava UP-TO-DATE
13-Mar-2022 12:38:09 > Task :smack-resolver-javax:processResources NO-SOURCE
13-Mar-2022 12:38:09 > Task :smack-resolver-javax:classes UP-TO-DATE
13-Mar-2022 12:38:09 > Task :smack-resolver-javax:jar UP-TO-DATE
13-Mar-2022 12:38:09 > Task :smack-sasl-javax:compileJava UP-TO-DATE
13-Mar-2022 12:38:09 > Task :smack-sasl-javax:processResources NO-SOURCE
13-Mar-2022 12:38:09 > Task :smack-sasl-javax:classes UP-TO-DATE
13-Mar-2022 12:38:09 > Task :smack-sasl-javax:jar UP-TO-DATE
13-Mar-2022 12:38:09 > Task :smack-xmlparser-stax:processResources UP-TO-DATE
13-Mar-2022 12:38:09 > Task :smack-xmlparser-stax:classes UP-TO-DATE
13-Mar-2022 12:38:09 > Task :smack-xmlparser-stax:jar UP-TO-DATE
13-Mar-2022 12:38:09 > Task :smack-java8:compileJava UP-TO-DATE
13-Mar-2022 12:38:09 > Task :smack-java8:processResources NO-SOURCE
13-Mar-2022 12:38:09 > Task :smack-java8:classes UP-TO-DATE
13-Mar-2022 12:38:09 > Task :smack-java8:jar UP-TO-DATE
13-Mar-2022 12:38:09 > Task :smack-legacy:compileJava UP-TO-DATE
13-Mar-2022 12:38:09 > Task :smack-legacy:processResources UP-TO-DATE
13-Mar-2022 12:38:09 > Task :smack-legacy:classes UP-TO-DATE
13-Mar-2022 12:38:09 > Task :smack-legacy:jar UP-TO-DATE
13-Mar-2022 12:38:09 > Task :smack-omemo:compileJava UP-TO-DATE
13-Mar-2022 12:38:09 > Task :smack-omemo:processResources UP-TO-DATE
13-Mar-2022 12:38:09 > Task :smack-omemo:classes UP-TO-DATE
13-Mar-2022 12:38:09 > Task :smack-omemo:jar UP-TO-DATE
13-Mar-2022 12:38:09 > Task :smack-resolver-minidns-dox:compileJava UP-TO-DATE
13-Mar-2022 12:38:09 > Task :smack-resolver-minidns-dox:processResources NO-SOURCE
13-Mar-2022 12:38:09 > Task :smack-resolver-minidns-dox:classes UP-TO-DATE
13-Mar-2022 12:38:09 > Task :smack-resolver-minidns-dox:jar UP-TO-DATE
13-Mar-2022 12:38:09 > Task :smack-streammanagement:compileJava UP-TO-DATE
13-Mar-2022 12:38:09 > Task :smack-streammanagement:processResources NO-SOURCE
13-Mar-2022 12:38:09 > Task :smack-streammanagement:classes UP-TO-DATE
13-Mar-2022 12:38:09 > Task :smack-streammanagement:jar UP-TO-DATE
13-Mar-2022 12:38:09 > Task :smack-tcp:compileJava UP-TO-DATE
13-Mar-2022 12:38:09 > Task :smack-tcp:processResources UP-TO-DATE
13-Mar-2022 12:38:09 > Task :smack-tcp:classes UP-TO-DATE
13-Mar-2022 12:38:09 > Task :smack-tcp:jar UP-TO-DATE
13-Mar-2022 12:38:09 > Task :smack-websocket:compileJava UP-TO-DATE
13-Mar-2022 12:38:09 > Task :smack-websocket:processResources NO-SOURCE
13-Mar-2022 12:38:09 > Task :smack-websocket:classes UP-TO-DATE
13-Mar-2022 12:38:09 > Task :smack-websocket:jar UP-TO-DATE
13-Mar-2022 12:38:09 > Task :smack-websocket-okhttp:compileJava UP-TO-DATE
13-Mar-2022 12:38:09 > Task :smack-websocket-okhttp:processResources UP-TO-DATE
13-Mar-2022 12:38:09 > Task :smack-websocket-okhttp:classes UP-TO-DATE
13-Mar-2022 12:38:09 > Task :smack-websocket-okhttp:jar UP-TO-DATE
13-Mar-2022 12:38:09 > Task :smack-java8-full:compileJava UP-TO-DATE
13-Mar-2022 12:38:09 > Task :smack-java8-full:processResources NO-SOURCE
13-Mar-2022 12:38:09 > Task :smack-java8-full:classes UP-TO-DATE
13-Mar-2022 12:38:09 > Task :smack-java8-full:jar UP-TO-DATE
13-Mar-2022 12:38:09 > Task :smack-resolver-dnsjava:compileJava UP-TO-DATE
13-Mar-2022 12:38:09 > Task :smack-resolver-dnsjava:processResources NO-SOURCE
13-Mar-2022 12:38:09 > Task :smack-resolver-dnsjava:classes UP-TO-DATE
13-Mar-2022 12:38:09 > Task :smack-resolver-dnsjava:jar UP-TO-DATE
13-Mar-2022 12:38:09 > Task :smack-websocket-java11:compileJava UP-TO-DATE
13-Mar-2022 12:38:09 > Task :smack-websocket-java11:processResources UP-TO-DATE
13-Mar-2022 12:38:09 > Task :smack-websocket-java11:classes UP-TO-DATE
13-Mar-2022 12:38:09 > Task :smack-websocket-java11:jar UP-TO-DATE
13-Mar-2022 12:38:09 > Task :smack-integration-test:compileJava UP-TO-DATE
13-Mar-2022 12:38:09 > Task :smack-integration-test:processResources NO-SOURCE
13-Mar-2022 12:38:09 > Task :smack-integration-test:classes UP-TO-DATE
13-Mar-2022 12:38:09 > Task :smack-integration-test:jar UP-TO-DATE
13-Mar-2022 12:38:09 > Task :smack-integration-test:compileTestFixturesJava NO-SOURCE
13-Mar-2022 12:38:09 > Task :smack-integration-test:processTestFixturesResources NO-SOURCE
13-Mar-2022 12:38:09 > Task :smack-integration-test:testFixturesClasses UP-TO-DATE
13-Mar-2022 12:38:09 > Task :smack-integration-test:testFixturesJar UP-TO-DATE
13-Mar-2022 12:38:09 > Task :smack-integration-test:generateMetadataFileForMavenJavaPublication
13-Mar-2022 12:38:09 > Task :smack-integration-test:generatePomFileForMavenJavaPublication
13-Mar-2022 12:38:09 > Task :smack-integration-test:copyJavadocDocFiles NO-SOURCE
13-Mar-2022 12:38:09 > Task :smack-integration-test:javadoc UP-TO-DATE
13-Mar-2022 12:38:09 > Task :smack-integration-test:javadocJar
13-Mar-2022 12:38:09 > Task :smack-integration-test:sourcesJar
13-Mar-2022 12:38:10 > Task :smack-integration-test:compileTestJava UP-TO-DATE
13-Mar-2022 12:38:10 > Task :smack-integration-test:processTestResources NO-SOURCE
13-Mar-2022 12:38:10 > Task :smack-integration-test:testClasses UP-TO-DATE
13-Mar-2022 12:38:10 > Task :smack-integration-test:testsJar
13-Mar-2022 12:38:10 > Task :smack-integration-test:signMavenJavaPublication SKIPPED
13-Mar-2022 12:38:16 > Task :smack-integration-test:publishMavenJavaPublicationToCustomRepoRepository
13-Mar-2022 12:38:16 > Task :smack-integration-test:publish
13-Mar-2022 12:38:16 > Task :smack-java8:compileTestFixturesJava NO-SOURCE
13-Mar-2022 12:38:16 > Task :smack-java8:processTestFixturesResources NO-SOURCE
13-Mar-2022 12:38:16 > Task :smack-java8:testFixturesClasses UP-TO-DATE
13-Mar-2022 12:38:16 > Task :smack-java8:testFixturesJar UP-TO-DATE
13-Mar-2022 12:38:16 > Task :smack-java8:generateMetadataFileForMavenJavaPublication
13-Mar-2022 12:38:16 > Task :smack-java8:generatePomFileForMavenJavaPublication
13-Mar-2022 12:38:16 > Task :smack-java8:copyJavadocDocFiles NO-SOURCE
13-Mar-2022 12:38:16 > Task :smack-java8:javadoc SKIPPED
13-Mar-2022 12:38:16 > Task :smack-java8:javadocJar
13-Mar-2022 12:38:16 > Task :smack-java8:sourcesJar
13-Mar-2022 12:38:16 > Task :smack-java8:compileTestJava NO-SOURCE
13-Mar-2022 12:38:16 > Task :smack-java8:processTestResources NO-SOURCE
13-Mar-2022 12:38:16 > Task :smack-java8:testClasses UP-TO-DATE
13-Mar-2022 12:38:16 > Task :smack-java8:testsJar
13-Mar-2022 12:38:16 > Task :smack-java8:signMavenJavaPublication SKIPPED
13-Mar-2022 12:38:21 > Task :smack-java8:publishMavenJavaPublicationToCustomRepoRepository
13-Mar-2022 12:38:21 > Task :smack-java8:publish
13-Mar-2022 12:38:21 > Task :smack-java8-full:compileTestFixturesJava NO-SOURCE
13-Mar-2022 12:38:21 > Task :smack-java8-full:processTestFixturesResources NO-SOURCE
13-Mar-2022 12:38:21 > Task :smack-java8-full:testFixturesClasses UP-TO-DATE
13-Mar-2022 12:38:21 > Task :smack-java8-full:testFixturesJar UP-TO-DATE
13-Mar-2022 12:38:21 > Task :smack-java8-full:generateMetadataFileForMavenJavaPublication
13-Mar-2022 12:38:21 > Task :smack-java8-full:generatePomFileForMavenJavaPublication
13-Mar-2022 12:38:21 > Task :smack-java8-full:generateModularXmppClientToServerConnectionStateGraph UP-TO-DATE
13-Mar-2022 12:38:21 > Task :smack-java8-full:convertModularXmppClientToServerConnectionStateGraphDotToPng UP-TO-DATE
13-Mar-2022 12:38:21 > Task :smack-java8-full:copyJavadocDocFiles
13-Mar-2022 12:38:21 > Task :smack-java8-full:javadoc UP-TO-DATE
13-Mar-2022 12:38:21 > Task :smack-java8-full:javadocJar
13-Mar-2022 12:38:21 > Task :smack-java8-full:sourcesJar
13-Mar-2022 12:38:21 > Task :smack-java8-full:compileTestJava UP-TO-DATE
13-Mar-2022 12:38:21 > Task :smack-java8-full:processTestResources UP-TO-DATE
13-Mar-2022 12:38:21 > Task :smack-java8-full:testClasses UP-TO-DATE
13-Mar-2022 12:38:21 > Task :smack-java8-full:testsJar
13-Mar-2022 12:38:21 > Task :smack-java8-full:signMavenJavaPublication SKIPPED
13-Mar-2022 12:38:27 > Task :smack-java8-full:publishMavenJavaPublicationToCustomRepoRepository
13-Mar-2022 12:38:27 > Task :smack-java8-full:publish
13-Mar-2022 12:38:27 > Task :smack-jingle-old:compileJava UP-TO-DATE
13-Mar-2022 12:38:27 > Task :smack-jingle-old:processResources NO-SOURCE
13-Mar-2022 12:38:27 > Task :smack-jingle-old:classes UP-TO-DATE
13-Mar-2022 12:38:28 > Task :smack-jingle-old:jar UP-TO-DATE
13-Mar-2022 12:38:28 > Task :smack-jingle-old:compileTestFixturesJava NO-SOURCE
13-Mar-2022 12:38:28 > Task :smack-jingle-old:processTestFixturesResources NO-SOURCE
13-Mar-2022 12:38:28 > Task :smack-jingle-old:testFixturesClasses UP-TO-DATE
13-Mar-2022 12:38:28 > Task :smack-jingle-old:testFixturesJar UP-TO-DATE
13-Mar-2022 12:38:28 > Task :smack-jingle-old:generateMetadataFileForMavenJavaPublication
13-Mar-2022 12:38:28 > Task :smack-jingle-old:generatePomFileForMavenJavaPublication
13-Mar-2022 12:38:28 > Task :smack-jingle-old:copyJavadocDocFiles NO-SOURCE
13-Mar-2022 12:38:28 > Task :smack-jingle-old:javadoc UP-TO-DATE
13-Mar-2022 12:38:28 > Task :smack-jingle-old:javadocJar
13-Mar-2022 12:38:28 > Task :smack-jingle-old:sourcesJar
13-Mar-2022 12:38:28 > Task :smack-jingle-old:compileTestJava NO-SOURCE
13-Mar-2022 12:38:28 > Task :smack-jingle-old:processTestResources NO-SOURCE
13-Mar-2022 12:38:28 > Task :smack-jingle-old:testClasses UP-TO-DATE
13-Mar-2022 12:38:28 > Task :smack-jingle-old:testsJar
13-Mar-2022 12:38:28 > Task :smack-jingle-old:signMavenJavaPublication SKIPPED
13-Mar-2022 12:38:34 > Task :smack-jingle-old:publishMavenJavaPublicationToCustomRepoRepository
13-Mar-2022 12:38:34 > Task :smack-jingle-old:publish
13-Mar-2022 12:38:34 > Task :smack-legacy:compileTestFixturesJava NO-SOURCE
13-Mar-2022 12:38:34 > Task :smack-legacy:processTestFixturesResources NO-SOURCE
13-Mar-2022 12:38:34 > Task :smack-legacy:testFixturesClasses UP-TO-DATE
13-Mar-2022 12:38:34 > Task :smack-legacy:testFixturesJar UP-TO-DATE
13-Mar-2022 12:38:34 > Task :smack-legacy:generateMetadataFileForMavenJavaPublication
13-Mar-2022 12:38:34 > Task :smack-legacy:generatePomFileForMavenJavaPublication
13-Mar-2022 12:38:34 > Task :smack-legacy:copyJavadocDocFiles NO-SOURCE
13-Mar-2022 12:38:34 > Task :smack-legacy:javadoc UP-TO-DATE
13-Mar-2022 12:38:34 > Task :smack-legacy:javadocJar
13-Mar-2022 12:38:34 > Task :smack-legacy:sourcesJar
13-Mar-2022 12:38:34 > Task :smack-legacy:compileTestJava UP-TO-DATE
13-Mar-2022 12:38:34 > Task :smack-legacy:processTestResources NO-SOURCE
13-Mar-2022 12:38:34 > Task :smack-legacy:testClasses UP-TO-DATE
13-Mar-2022 12:38:34 > Task :smack-legacy:testsJar
13-Mar-2022 12:38:34 > Task :smack-legacy:signMavenJavaPublication SKIPPED
13-Mar-2022 12:38:40 > Task :smack-legacy:publishMavenJavaPublicationToCustomRepoRepository
13-Mar-2022 12:38:40 > Task :smack-legacy:publish
13-Mar-2022 12:38:40 > Task :smack-omemo:compileTestFixturesJava NO-SOURCE
13-Mar-2022 12:38:40 > Task :smack-omemo:processTestFixturesResources NO-SOURCE
13-Mar-2022 12:38:40 > Task :smack-omemo:testFixturesClasses UP-TO-DATE
13-Mar-2022 12:38:40 > Task :smack-omemo:testFixturesJar UP-TO-DATE
13-Mar-2022 12:38:40 > Task :smack-omemo:generateMetadataFileForMavenJavaPublication
13-Mar-2022 12:38:40 > Task :smack-omemo:generatePomFileForMavenJavaPublication
13-Mar-2022 12:38:40 > Task :smack-omemo:copyJavadocDocFiles NO-SOURCE
13-Mar-2022 12:38:40 > Task :smack-omemo:javadoc UP-TO-DATE
13-Mar-2022 12:38:40 > Task :smack-omemo:javadocJar
13-Mar-2022 12:38:40 > Task :smack-omemo:sourcesJar
13-Mar-2022 12:38:40 > Task :smack-omemo:compileTestJava UP-TO-DATE
13-Mar-2022 12:38:40 > Task :smack-omemo:processTestResources NO-SOURCE
13-Mar-2022 12:38:40 > Task :smack-omemo:testClasses UP-TO-DATE
13-Mar-2022 12:38:40 > Task :smack-omemo:testsJar UP-TO-DATE
13-Mar-2022 12:38:40 > Task :smack-omemo:signMavenJavaPublication SKIPPED
13-Mar-2022 12:38:46 > Task :smack-omemo:publishMavenJavaPublicationToCustomRepoRepository
13-Mar-2022 12:38:46 > Task :smack-omemo:publish
13-Mar-2022 12:38:46 > Task :smack-omemo-signal:compileJava UP-TO-DATE
13-Mar-2022 12:38:46 > Task :smack-omemo-signal:processResources NO-SOURCE
13-Mar-2022 12:38:46 > Task :smack-omemo-signal:classes UP-TO-DATE
13-Mar-2022 12:38:46 > Task :smack-omemo-signal:jar UP-TO-DATE
13-Mar-2022 12:38:46 > Task :smack-omemo-signal:compileTestFixturesJava NO-SOURCE
13-Mar-2022 12:38:46 > Task :smack-omemo-signal:processTestFixturesResources NO-SOURCE
13-Mar-2022 12:38:46 > Task :smack-omemo-signal:testFixturesClasses UP-TO-DATE
13-Mar-2022 12:38:46 > Task :smack-omemo-signal:testFixturesJar UP-TO-DATE
13-Mar-2022 12:38:46 > Task :smack-omemo-signal:generateMetadataFileForMavenJavaPublication
13-Mar-2022 12:38:46 > Task :smack-omemo-signal:generatePomFileForMavenJavaPublication
13-Mar-2022 12:38:46 > Task :smack-omemo-signal:copyJavadocDocFiles NO-SOURCE
13-Mar-2022 12:38:46 > Task :smack-omemo-signal:javadoc UP-TO-DATE
13-Mar-2022 12:38:47 > Task :smack-omemo-signal:javadocJar
13-Mar-2022 12:38:47 > Task :smack-omemo-signal:sourcesJar
13-Mar-2022 12:38:47 > Task :smack-omemo-signal:compileTestJava UP-TO-DATE
13-Mar-2022 12:38:47 > Task :smack-omemo-signal:processTestResources NO-SOURCE
13-Mar-2022 12:38:47 > Task :smack-omemo-signal:testClasses UP-TO-DATE
13-Mar-2022 12:38:47 > Task :smack-omemo-signal:testsJar
13-Mar-2022 12:38:47 > Task :smack-omemo-signal:signMavenJavaPublication SKIPPED
13-Mar-2022 12:38:52 > Task :smack-omemo-signal:publishMavenJavaPublicationToCustomRepoRepository
13-Mar-2022 12:38:52 > Task :smack-omemo-signal:publish
13-Mar-2022 12:38:52 > Task :smack-omemo-signal-integration-test:compileJava UP-TO-DATE
13-Mar-2022 12:38:52 > Task :smack-omemo-signal-integration-test:processResources NO-SOURCE
13-Mar-2022 12:38:52 > Task :smack-omemo-signal-integration-test:classes UP-TO-DATE
13-Mar-2022 12:38:52 > Task :smack-omemo-signal-integration-test:jar UP-TO-DATE
13-Mar-2022 12:38:52 > Task :smack-omemo-signal-integration-test:compileTestFixturesJava NO-SOURCE
13-Mar-2022 12:38:52 > Task :smack-omemo-signal-integration-test:processTestFixturesResources NO-SOURCE
13-Mar-2022 12:38:52 > Task :smack-omemo-signal-integration-test:testFixturesClasses UP-TO-DATE
13-Mar-2022 12:38:52 > Task :smack-omemo-signal-integration-test:testFixturesJar UP-TO-DATE
13-Mar-2022 12:38:53 > Task :smack-omemo-signal-integration-test:generateMetadataFileForMavenJavaPublication
13-Mar-2022 12:38:53 > Task :smack-omemo-signal-integration-test:generatePomFileForMavenJavaPublication
13-Mar-2022 12:38:53 > Task :smack-omemo-signal-integration-test:copyJavadocDocFiles NO-SOURCE
13-Mar-2022 12:38:53 > Task :smack-omemo-signal-integration-test:javadoc UP-TO-DATE
13-Mar-2022 12:38:53 > Task :smack-omemo-signal-integration-test:javadocJar
13-Mar-2022 12:38:53 > Task :smack-omemo-signal-integration-test:sourcesJar
13-Mar-2022 12:38:53 > Task :smack-omemo-signal-integration-test:compileTestJava NO-SOURCE
13-Mar-2022 12:38:53 > Task :smack-omemo-signal-integration-test:processTestResources NO-SOURCE
13-Mar-2022 12:38:53 > Task :smack-omemo-signal-integration-test:testClasses UP-TO-DATE
13-Mar-2022 12:38:53 > Task :smack-omemo-signal-integration-test:testsJar
13-Mar-2022 12:38:53 > Task :smack-omemo-signal-integration-test:signMavenJavaPublication SKIPPED
13-Mar-2022 12:38:59 > Task :smack-omemo-signal-integration-test:publishMavenJavaPublicationToCustomRepoRepository
13-Mar-2022 12:38:59 > Task :smack-omemo-signal-integration-test:publish
13-Mar-2022 12:38:59 > Task :smack-openpgp:compileTestFixturesJava NO-SOURCE
13-Mar-2022 12:38:59 > Task :smack-openpgp:processTestFixturesResources NO-SOURCE
13-Mar-2022 12:38:59 > Task :smack-openpgp:testFixturesClasses UP-TO-DATE
13-Mar-2022 12:38:59 > Task :smack-openpgp:testFixturesJar UP-TO-DATE
13-Mar-2022 12:38:59 > Task :smack-openpgp:generateMetadataFileForMavenJavaPublication
13-Mar-2022 12:38:59 > Task :smack-openpgp:generatePomFileForMavenJavaPublication
13-Mar-2022 12:38:59 > Task :smack-openpgp:copyJavadocDocFiles NO-SOURCE
13-Mar-2022 12:38:59 > Task :smack-openpgp:javadoc UP-TO-DATE
13-Mar-2022 12:38:59 > Task :smack-openpgp:javadocJar
13-Mar-2022 12:38:59 > Task :smack-openpgp:sourcesJar
13-Mar-2022 12:38:59 > Task :smack-openpgp:compileTestJava UP-TO-DATE
13-Mar-2022 12:38:59 > Task :smack-openpgp:processTestResources UP-TO-DATE
13-Mar-2022 12:38:59 > Task :smack-openpgp:testClasses UP-TO-DATE
13-Mar-2022 12:38:59 > Task :smack-openpgp:testsJar
13-Mar-2022 12:38:59 > Task :smack-openpgp:signMavenJavaPublication SKIPPED
13-Mar-2022 12:39:05 > Task :smack-openpgp:publishMavenJavaPublicationToCustomRepoRepository
13-Mar-2022 12:39:05 > Task :smack-openpgp:publish
13-Mar-2022 12:39:05 > Task :smack-repl:compileJava UP-TO-DATE
13-Mar-2022 12:39:05 > Task :smack-repl:compileScala UP-TO-DATE
13-Mar-2022 12:39:05 > Task :smack-repl:processResources NO-SOURCE
13-Mar-2022 12:39:05 > Task :smack-repl:classes UP-TO-DATE
13-Mar-2022 12:39:05 > Task :smack-repl:jar UP-TO-DATE
13-Mar-2022 12:39:05 > Task :smack-repl:compileTestFixturesJava NO-SOURCE
13-Mar-2022 12:39:05 > Task :smack-repl:compileTestFixturesScala NO-SOURCE
13-Mar-2022 12:39:05 > Task :smack-repl:processTestFixturesResources NO-SOURCE
13-Mar-2022 12:39:05 > Task :smack-repl:testFixturesClasses UP-TO-DATE
13-Mar-2022 12:39:05 > Task :smack-repl:testFixturesJar UP-TO-DATE
13-Mar-2022 12:39:05 > Task :smack-repl:generateMetadataFileForMavenJavaPublication
13-Mar-2022 12:39:05 > Task :smack-repl:generatePomFileForMavenJavaPublication
13-Mar-2022 12:39:05 > Task :smack-repl:copyJavadocDocFiles NO-SOURCE
13-Mar-2022 12:39:05 > Task :smack-repl:javadoc UP-TO-DATE
13-Mar-2022 12:39:05 > Task :smack-repl:javadocJar
13-Mar-2022 12:39:05 > Task :smack-repl:sourcesJar
13-Mar-2022 12:39:05 > Task :smack-repl:compileTestJava UP-TO-DATE
13-Mar-2022 12:39:05 > Task :smack-repl:compileTestScala NO-SOURCE
13-Mar-2022 12:39:05 > Task :smack-repl:processTestResources NO-SOURCE
13-Mar-2022 12:39:05 > Task :smack-repl:testClasses UP-TO-DATE
13-Mar-2022 12:39:05 > Task :smack-repl:testsJar
13-Mar-2022 12:39:05 > Task :smack-repl:signMavenJavaPublication SKIPPED
13-Mar-2022 12:39:11 > Task :smack-repl:publishMavenJavaPublicationToCustomRepoRepository
13-Mar-2022 12:39:11 > Task :smack-repl:publish
13-Mar-2022 12:39:11 > Task :smack-resolver-dnsjava:compileTestFixturesJava NO-SOURCE
13-Mar-2022 12:39:11 > Task :smack-resolver-dnsjava:processTestFixturesResources NO-SOURCE
13-Mar-2022 12:39:11 > Task :smack-resolver-dnsjava:testFixturesClasses UP-TO-DATE
13-Mar-2022 12:39:11 > Task :smack-resolver-dnsjava:testFixturesJar UP-TO-DATE
13-Mar-2022 12:39:11 > Task :smack-resolver-dnsjava:generateMetadataFileForMavenJavaPublication
13-Mar-2022 12:39:11 > Task :smack-resolver-dnsjava:generatePomFileForMavenJavaPublication
13-Mar-2022 12:39:11 > Task :smack-resolver-dnsjava:copyJavadocDocFiles NO-SOURCE
13-Mar-2022 12:39:11 > Task :smack-resolver-dnsjava:javadoc UP-TO-DATE
13-Mar-2022 12:39:11 > Task :smack-resolver-dnsjava:javadocJar
13-Mar-2022 12:39:11 > Task :smack-resolver-dnsjava:sourcesJar
13-Mar-2022 12:39:11 > Task :smack-resolver-dnsjava:compileTestJava NO-SOURCE
13-Mar-2022 12:39:11 > Task :smack-resolver-dnsjava:processTestResources NO-SOURCE
13-Mar-2022 12:39:11 > Task :smack-resolver-dnsjava:testClasses UP-TO-DATE
13-Mar-2022 12:39:11 > Task :smack-resolver-dnsjava:testsJar
13-Mar-2022 12:39:11 > Task :smack-resolver-dnsjava:signMavenJavaPublication SKIPPED
13-Mar-2022 12:39:17 > Task :smack-resolver-dnsjava:publishMavenJavaPublicationToCustomRepoRepository
13-Mar-2022 12:39:17 > Task :smack-resolver-dnsjava:publish
13-Mar-2022 12:39:17 > Task :smack-resolver-javax:compileTestFixturesJava NO-SOURCE
13-Mar-2022 12:39:17 > Task :smack-resolver-javax:processTestFixturesResources NO-SOURCE
13-Mar-2022 12:39:17 > Task :smack-resolver-javax:testFixturesClasses UP-TO-DATE
13-Mar-2022 12:39:17 > Task :smack-resolver-javax:testFixturesJar UP-TO-DATE
13-Mar-2022 12:39:17 > Task :smack-resolver-javax:generateMetadataFileForMavenJavaPublication
13-Mar-2022 12:39:17 > Task :smack-resolver-javax:generatePomFileForMavenJavaPublication
13-Mar-2022 12:39:17 > Task :smack-resolver-javax:copyJavadocDocFiles NO-SOURCE
13-Mar-2022 12:39:17 > Task :smack-resolver-javax:javadoc UP-TO-DATE
13-Mar-2022 12:39:17 > Task :smack-resolver-javax:javadocJar
13-Mar-2022 12:39:17 > Task :smack-resolver-javax:sourcesJar
13-Mar-2022 12:39:17 > Task :smack-resolver-javax:compileTestJava NO-SOURCE
13-Mar-2022 12:39:17 > Task :smack-resolver-javax:processTestResources NO-SOURCE
13-Mar-2022 12:39:17 > Task :smack-resolver-javax:testClasses UP-TO-DATE
13-Mar-2022 12:39:17 > Task :smack-resolver-javax:testsJar
13-Mar-2022 12:39:17 > Task :smack-resolver-javax:signMavenJavaPublication SKIPPED
13-Mar-2022 12:39:23 > Task :smack-resolver-javax:publishMavenJavaPublicationToCustomRepoRepository
13-Mar-2022 12:39:23 > Task :smack-resolver-javax:publish
13-Mar-2022 12:39:23 > Task :smack-resolver-minidns:compileTestFixturesJava NO-SOURCE
13-Mar-2022 12:39:23 > Task :smack-resolver-minidns:processTestFixturesResources NO-SOURCE
13-Mar-2022 12:39:23 > Task :smack-resolver-minidns:testFixturesClasses UP-TO-DATE
13-Mar-2022 12:39:23 > Task :smack-resolver-minidns:testFixturesJar UP-TO-DATE
13-Mar-2022 12:39:23 > Task :smack-resolver-minidns:generateMetadataFileForMavenJavaPublication
13-Mar-2022 12:39:23 > Task :smack-resolver-minidns:generatePomFileForMavenJavaPublication
13-Mar-2022 12:39:23 > Task :smack-resolver-minidns:copyJavadocDocFiles NO-SOURCE
13-Mar-2022 12:39:23 > Task :smack-resolver-minidns:javadoc UP-TO-DATE
13-Mar-2022 12:39:23 > Task :smack-resolver-minidns:javadocJar
13-Mar-2022 12:39:23 > Task :smack-resolver-minidns:sourcesJar
13-Mar-2022 12:39:23 > Task :smack-resolver-minidns:compileTestJava NO-SOURCE
13-Mar-2022 12:39:23 > Task :smack-resolver-minidns:processTestResources NO-SOURCE
13-Mar-2022 12:39:23 > Task :smack-resolver-minidns:testClasses UP-TO-DATE
13-Mar-2022 12:39:23 > Task :smack-resolver-minidns:testsJar
13-Mar-2022 12:39:23 > Task :smack-resolver-minidns:signMavenJavaPublication SKIPPED
13-Mar-2022 12:39:29 > Task :smack-resolver-minidns:publishMavenJavaPublicationToCustomRepoRepository
13-Mar-2022 12:39:29 > Task :smack-resolver-minidns:publish
13-Mar-2022 12:39:29 > Task :smack-resolver-minidns-dox:compileTestFixturesJava NO-SOURCE
13-Mar-2022 12:39:29 > Task :smack-resolver-minidns-dox:processTestFixturesResources NO-SOURCE
13-Mar-2022 12:39:29 > Task :smack-resolver-minidns-dox:testFixturesClasses UP-TO-DATE
13-Mar-2022 12:39:29 > Task :smack-resolver-minidns-dox:testFixturesJar UP-TO-DATE
13-Mar-2022 12:39:29 > Task :smack-resolver-minidns-dox:generateMetadataFileForMavenJavaPublication
13-Mar-2022 12:39:29 > Task :smack-resolver-minidns-dox:generatePomFileForMavenJavaPublication
13-Mar-2022 12:39:29 > Task :smack-resolver-minidns-dox:copyJavadocDocFiles NO-SOURCE
13-Mar-2022 12:39:29 > Task :smack-resolver-minidns-dox:javadoc UP-TO-DATE
13-Mar-2022 12:39:29 > Task :smack-resolver-minidns-dox:javadocJar
13-Mar-2022 12:39:29 > Task :smack-resolver-minidns-dox:sourcesJar
13-Mar-2022 12:39:29 > Task :smack-resolver-minidns-dox:compileTestJava UP-TO-DATE
13-Mar-2022 12:39:29 > Task :smack-resolver-minidns-dox:processTestResources NO-SOURCE
13-Mar-2022 12:39:29 > Task :smack-resolver-minidns-dox:testClasses UP-TO-DATE
13-Mar-2022 12:39:29 > Task :smack-resolver-minidns-dox:testsJar
13-Mar-2022 12:39:29 > Task :smack-resolver-minidns-dox:signMavenJavaPublication SKIPPED
13-Mar-2022 12:39:35 > Task :smack-resolver-minidns-dox:publishMavenJavaPublicationToCustomRepoRepository
13-Mar-2022 12:39:35 > Task :smack-resolver-minidns-dox:publish
13-Mar-2022 12:39:35 > Task :smack-sasl-javax:compileTestFixturesJava NO-SOURCE
13-Mar-2022 12:39:35 > Task :smack-sasl-javax:processTestFixturesResources NO-SOURCE
13-Mar-2022 12:39:35 > Task :smack-sasl-javax:testFixturesClasses UP-TO-DATE
13-Mar-2022 12:39:35 > Task :smack-sasl-javax:testFixturesJar UP-TO-DATE
13-Mar-2022 12:39:35 > Task :smack-sasl-javax:generateMetadataFileForMavenJavaPublication
13-Mar-2022 12:39:35 > Task :smack-sasl-javax:generatePomFileForMavenJavaPublication
13-Mar-2022 12:39:35 > Task :smack-sasl-javax:copyJavadocDocFiles NO-SOURCE
13-Mar-2022 12:39:35 > Task :smack-sasl-javax:javadoc UP-TO-DATE
13-Mar-2022 12:39:35 > Task :smack-sasl-javax:javadocJar
13-Mar-2022 12:39:35 > Task :smack-sasl-javax:sourcesJar
13-Mar-2022 12:39:35 > Task :smack-sasl-javax:compileTestJava UP-TO-DATE
13-Mar-2022 12:39:35 > Task :smack-sasl-javax:processTestResources NO-SOURCE
13-Mar-2022 12:39:35 > Task :smack-sasl-javax:testClasses UP-TO-DATE
13-Mar-2022 12:39:35 > Task :smack-sasl-javax:testsJar
13-Mar-2022 12:39:35 > Task :smack-sasl-javax:signMavenJavaPublication SKIPPED
13-Mar-2022 12:39:41 > Task :smack-sasl-javax:publishMavenJavaPublicationToCustomRepoRepository
13-Mar-2022 12:39:41 > Task :smack-sasl-javax:publish
13-Mar-2022 12:39:41 > Task :smack-sasl-provided:compileTestFixturesJava NO-SOURCE
13-Mar-2022 12:39:41 > Task :smack-sasl-provided:processTestFixturesResources NO-SOURCE
13-Mar-2022 12:39:41 > Task :smack-sasl-provided:testFixturesClasses UP-TO-DATE
13-Mar-2022 12:39:41 > Task :smack-sasl-provided:testFixturesJar UP-TO-DATE
13-Mar-2022 12:39:41 > Task :smack-sasl-provided:generateMetadataFileForMavenJavaPublication
13-Mar-2022 12:39:41 > Task :smack-sasl-provided:generatePomFileForMavenJavaPublication
13-Mar-2022 12:39:41 > Task :smack-sasl-provided:copyJavadocDocFiles NO-SOURCE
13-Mar-2022 12:39:41 > Task :smack-sasl-provided:javadoc UP-TO-DATE
13-Mar-2022 12:39:41 > Task :smack-sasl-provided:javadocJar
13-Mar-2022 12:39:41 > Task :smack-sasl-provided:sourcesJar
13-Mar-2022 12:39:41 > Task :smack-sasl-provided:compileTestJava UP-TO-DATE
13-Mar-2022 12:39:41 > Task :smack-sasl-provided:processTestResources NO-SOURCE
13-Mar-2022 12:39:41 > Task :smack-sasl-provided:testClasses UP-TO-DATE
13-Mar-2022 12:39:41 > Task :smack-sasl-provided:testsJar
13-Mar-2022 12:39:41 > Task :smack-sasl-provided:signMavenJavaPublication SKIPPED
13-Mar-2022 12:39:47 > Task :smack-sasl-provided:publishMavenJavaPublicationToCustomRepoRepository
13-Mar-2022 12:39:47 > Task :smack-sasl-provided:publish
13-Mar-2022 12:39:47 > Task :smack-streammanagement:compileTestFixturesJava NO-SOURCE
13-Mar-2022 12:39:47 > Task :smack-streammanagement:processTestFixturesResources NO-SOURCE
13-Mar-2022 12:39:47 > Task :smack-streammanagement:testFixturesClasses UP-TO-DATE
13-Mar-2022 12:39:47 > Task :smack-streammanagement:testFixturesJar UP-TO-DATE
13-Mar-2022 12:39:47 > Task :smack-streammanagement:generateMetadataFileForMavenJavaPublication
13-Mar-2022 12:39:47 > Task :smack-streammanagement:generatePomFileForMavenJavaPublication
13-Mar-2022 12:39:47 > Task :smack-streammanagement:copyJavadocDocFiles NO-SOURCE
13-Mar-2022 12:39:47 > Task :smack-streammanagement:javadoc UP-TO-DATE
13-Mar-2022 12:39:47 > Task :smack-streammanagement:javadocJar
13-Mar-2022 12:39:47 > Task :smack-streammanagement:sourcesJar
13-Mar-2022 12:39:47 > Task :smack-streammanagement:compileTestJava UP-TO-DATE
13-Mar-2022 12:39:47 > Task :smack-streammanagement:processTestResources NO-SOURCE
13-Mar-2022 12:39:47 > Task :smack-streammanagement:testClasses UP-TO-DATE
13-Mar-2022 12:39:47 > Task :smack-streammanagement:testsJar
13-Mar-2022 12:39:47 > Task :smack-streammanagement:signMavenJavaPublication SKIPPED
13-Mar-2022 12:39:53 > Task :smack-streammanagement:publishMavenJavaPublicationToCustomRepoRepository
13-Mar-2022 12:39:53 > Task :smack-streammanagement:publish
13-Mar-2022 12:39:53 > Task :smack-tcp:compileTestFixturesJava NO-SOURCE
13-Mar-2022 12:39:53 > Task :smack-tcp:processTestFixturesResources NO-SOURCE
13-Mar-2022 12:39:53 > Task :smack-tcp:testFixturesClasses UP-TO-DATE
13-Mar-2022 12:39:53 > Task :smack-tcp:testFixturesJar UP-TO-DATE
13-Mar-2022 12:39:53 > Task :smack-tcp:generateMetadataFileForMavenJavaPublication
13-Mar-2022 12:39:53 > Task :smack-tcp:generatePomFileForMavenJavaPublication
13-Mar-2022 12:39:53 > Task :smack-tcp:copyJavadocDocFiles
13-Mar-2022 12:39:53 > Task :smack-tcp:javadoc UP-TO-DATE
13-Mar-2022 12:39:54 > Task :smack-tcp:javadocJar
13-Mar-2022 12:39:54 > Task :smack-tcp:sourcesJar
13-Mar-2022 12:39:54 > Task :smack-tcp:compileTestJava UP-TO-DATE
13-Mar-2022 12:39:54 > Task :smack-tcp:processTestResources NO-SOURCE
13-Mar-2022 12:39:54 > Task :smack-tcp:testClasses UP-TO-DATE
13-Mar-2022 12:39:54 > Task :smack-tcp:testsJar
13-Mar-2022 12:39:54 > Task :smack-tcp:signMavenJavaPublication SKIPPED
13-Mar-2022 12:40:00 > Task :smack-tcp:publishMavenJavaPublicationToCustomRepoRepository
13-Mar-2022 12:40:00 > Task :smack-tcp:publish
13-Mar-2022 12:40:00 > Task :smack-websocket:compileTestFixturesJava UP-TO-DATE
13-Mar-2022 12:40:00 > Task :smack-websocket:processTestFixturesResources NO-SOURCE
13-Mar-2022 12:40:00 > Task :smack-websocket:testFixturesClasses UP-TO-DATE
13-Mar-2022 12:40:00 > Task :smack-websocket:testFixturesJar UP-TO-DATE
13-Mar-2022 12:40:00 > Task :smack-websocket:generateMetadataFileForMavenJavaPublication
13-Mar-2022 12:40:00 > Task :smack-websocket:generatePomFileForMavenJavaPublication
13-Mar-2022 12:40:00 > Task :smack-websocket:copyJavadocDocFiles NO-SOURCE
13-Mar-2022 12:40:00 > Task :smack-websocket:javadoc UP-TO-DATE
13-Mar-2022 12:40:00 > Task :smack-websocket:javadocJar
13-Mar-2022 12:40:00 > Task :smack-websocket:sourcesJar
13-Mar-2022 12:40:00 > Task :smack-websocket:compileTestJava UP-TO-DATE
13-Mar-2022 12:40:00 > Task :smack-websocket:processTestResources UP-TO-DATE
13-Mar-2022 12:40:00 > Task :smack-websocket:testClasses UP-TO-DATE
13-Mar-2022 12:40:00 > Task :smack-websocket:testsJar
13-Mar-2022 12:40:00 > Task :smack-websocket:signMavenJavaPublication SKIPPED
13-Mar-2022 12:40:06 > Task :smack-websocket:publishMavenJavaPublicationToCustomRepoRepository
13-Mar-2022 12:40:06 > Task :smack-websocket:publish
13-Mar-2022 12:40:06 > Task :smack-websocket-java11:compileTestFixturesJava NO-SOURCE
13-Mar-2022 12:40:06 > Task :smack-websocket-java11:processTestFixturesResources NO-SOURCE
13-Mar-2022 12:40:06 > Task :smack-websocket-java11:testFixturesClasses UP-TO-DATE
13-Mar-2022 12:40:06 > Task :smack-websocket-java11:testFixturesJar UP-TO-DATE
13-Mar-2022 12:40:06 > Task :smack-websocket-java11:generateMetadataFileForMavenJavaPublication
13-Mar-2022 12:40:06 > Task :smack-websocket-java11:generatePomFileForMavenJavaPublication
13-Mar-2022 12:40:06 > Task :smack-websocket-java11:copyJavadocDocFiles NO-SOURCE
13-Mar-2022 12:40:06 > Task :smack-websocket-java11:javadoc UP-TO-DATE
13-Mar-2022 12:40:06 > Task :smack-websocket-java11:javadocJar
13-Mar-2022 12:40:06 > Task :smack-websocket-java11:sourcesJar
13-Mar-2022 12:40:06 > Task :smack-websocket-java11:compileTestJava UP-TO-DATE
13-Mar-2022 12:40:06 > Task :smack-websocket-java11:processTestResources NO-SOURCE
13-Mar-2022 12:40:06 > Task :smack-websocket-java11:testClasses UP-TO-DATE
13-Mar-2022 12:40:06 > Task :smack-websocket-java11:testsJar
13-Mar-2022 12:40:06 > Task :smack-websocket-java11:signMavenJavaPublication SKIPPED
13-Mar-2022 12:40:12 > Task :smack-websocket-java11:publishMavenJavaPublicationToCustomRepoRepository
13-Mar-2022 12:40:12 > Task :smack-websocket-java11:publish
13-Mar-2022 12:40:12 > Task :smack-websocket-okhttp:compileTestFixturesJava NO-SOURCE
13-Mar-2022 12:40:12 > Task :smack-websocket-okhttp:processTestFixturesResources NO-SOURCE
13-Mar-2022 12:40:12 > Task :smack-websocket-okhttp:testFixturesClasses UP-TO-DATE
13-Mar-2022 12:40:12 > Task :smack-websocket-okhttp:testFixturesJar UP-TO-DATE
13-Mar-2022 12:40:12 > Task :smack-websocket-okhttp:generateMetadataFileForMavenJavaPublication
13-Mar-2022 12:40:12 > Task :smack-websocket-okhttp:generatePomFileForMavenJavaPublication
13-Mar-2022 12:40:12 > Task :smack-websocket-okhttp:copyJavadocDocFiles NO-SOURCE
13-Mar-2022 12:40:12 > Task :smack-websocket-okhttp:javadoc UP-TO-DATE
13-Mar-2022 12:40:12 > Task :smack-websocket-okhttp:javadocJar
13-Mar-2022 12:40:12 > Task :smack-websocket-okhttp:sourcesJar
13-Mar-2022 12:40:12 > Task :smack-websocket-okhttp:compileTestJava UP-TO-DATE
13-Mar-2022 12:40:12 > Task :smack-websocket-okhttp:processTestResources NO-SOURCE
13-Mar-2022 12:40:12 > Task :smack-websocket-okhttp:testClasses UP-TO-DATE
13-Mar-2022 12:40:12 > Task :smack-websocket-okhttp:testsJar
13-Mar-2022 12:40:12 > Task :smack-websocket-okhttp:signMavenJavaPublication SKIPPED
13-Mar-2022 12:40:18 > Task :smack-websocket-okhttp:publishMavenJavaPublicationToCustomRepoRepository
13-Mar-2022 12:40:18 > Task :smack-websocket-okhttp:publish
13-Mar-2022 12:40:18 > Task :smack-xmlparser:compileTestFixturesJava NO-SOURCE
13-Mar-2022 12:40:18 > Task :smack-xmlparser:processTestFixturesResources NO-SOURCE
13-Mar-2022 12:40:18 > Task :smack-xmlparser:testFixturesClasses UP-TO-DATE
13-Mar-2022 12:40:18 > Task :smack-xmlparser:testFixturesJar UP-TO-DATE
13-Mar-2022 12:40:18 > Task :smack-xmlparser:generateMetadataFileForMavenJavaPublication
13-Mar-2022 12:40:18 > Task :smack-xmlparser:generatePomFileForMavenJavaPublication
13-Mar-2022 12:40:18 > Task :smack-xmlparser:copyJavadocDocFiles NO-SOURCE
13-Mar-2022 12:40:18 > Task :smack-xmlparser:javadoc UP-TO-DATE
13-Mar-2022 12:40:18 > Task :smack-xmlparser:javadocJar
13-Mar-2022 12:40:18 > Task :smack-xmlparser:sourcesJar
13-Mar-2022 12:40:18 > Task :smack-xmlparser:compileTestJava UP-TO-DATE
13-Mar-2022 12:40:18 > Task :smack-xmlparser:processTestResources NO-SOURCE
13-Mar-2022 12:40:18 > Task :smack-xmlparser:testClasses UP-TO-DATE
13-Mar-2022 12:40:18 > Task :smack-xmlparser:testsJar
13-Mar-2022 12:40:18 > Task :smack-xmlparser:signMavenJavaPublication SKIPPED
13-Mar-2022 12:40:24 > Task :smack-xmlparser:publishMavenJavaPublicationToCustomRepoRepository
13-Mar-2022 12:40:24 > Task :smack-xmlparser:publish
13-Mar-2022 12:40:24 > Task :smack-xmlparser-stax:compileTestFixturesJava NO-SOURCE
13-Mar-2022 12:40:24 > Task :smack-xmlparser-stax:processTestFixturesResources NO-SOURCE
13-Mar-2022 12:40:24 > Task :smack-xmlparser-stax:testFixturesClasses UP-TO-DATE
13-Mar-2022 12:40:24 > Task :smack-xmlparser-stax:testFixturesJar UP-TO-DATE
13-Mar-2022 12:40:24 > Task :smack-xmlparser-stax:generateMetadataFileForMavenJavaPublication
13-Mar-2022 12:40:24 > Task :smack-xmlparser-stax:generatePomFileForMavenJavaPublication
13-Mar-2022 12:40:24 > Task :smack-xmlparser-stax:copyJavadocDocFiles NO-SOURCE
13-Mar-2022 12:40:24 > Task :smack-xmlparser-stax:javadoc UP-TO-DATE
13-Mar-2022 12:40:24 > Task :smack-xmlparser-stax:javadocJar
13-Mar-2022 12:40:24 > Task :smack-xmlparser-stax:sourcesJar
13-Mar-2022 12:40:24 > Task :smack-xmlparser-stax:compileTestJava UP-TO-DATE
13-Mar-2022 12:40:24 > Task :smack-xmlparser-stax:processTestResources NO-SOURCE
13-Mar-2022 12:40:24 > Task :smack-xmlparser-stax:testClasses UP-TO-DATE
13-Mar-2022 12:40:24 > Task :smack-xmlparser-stax:testsJar
13-Mar-2022 12:40:24 > Task :smack-xmlparser-stax:signMavenJavaPublication SKIPPED
13-Mar-2022 12:40:30 > Task :smack-xmlparser-stax:publishMavenJavaPublicationToCustomRepoRepository
13-Mar-2022 12:40:30 > Task :smack-xmlparser-stax:publish
13-Mar-2022 12:40:30 > Task :smack-xmlparser-xpp3:compileTestFixturesJava NO-SOURCE
13-Mar-2022 12:40:30 > Task :smack-xmlparser-xpp3:processTestFixturesResources NO-SOURCE
13-Mar-2022 12:40:30 > Task :smack-xmlparser-xpp3:testFixturesClasses UP-TO-DATE
13-Mar-2022 12:40:30 > Task :smack-xmlparser-xpp3:testFixturesJar UP-TO-DATE
13-Mar-2022 12:40:30 > Task :smack-xmlparser-xpp3:generateMetadataFileForMavenJavaPublication
13-Mar-2022 12:40:30 > Task :smack-xmlparser-xpp3:generatePomFileForMavenJavaPublication
13-Mar-2022 12:40:30 > Task :smack-xmlparser-xpp3:copyJavadocDocFiles NO-SOURCE
13-Mar-2022 12:40:30 > Task :smack-xmlparser-xpp3:javadoc UP-TO-DATE
13-Mar-2022 12:40:30 > Task :smack-xmlparser-xpp3:javadocJar
13-Mar-2022 12:40:30 > Task :smack-xmlparser-xpp3:sourcesJar
13-Mar-2022 12:40:30 > Task :smack-xmlparser-xpp3:compileTestJava UP-TO-DATE
13-Mar-2022 12:40:30 > Task :smack-xmlparser-xpp3:processTestResources NO-SOURCE
13-Mar-2022 12:40:30 > Task :smack-xmlparser-xpp3:testClasses UP-TO-DATE
13-Mar-2022 12:40:30 > Task :smack-xmlparser-xpp3:testsJar
13-Mar-2022 12:40:30 > Task :smack-xmlparser-xpp3:signMavenJavaPublication SKIPPED
13-Mar-2022 12:40:36 > Task :smack-xmlparser-xpp3:publishMavenJavaPublicationToCustomRepoRepository
13-Mar-2022 12:40:36 > Task :smack-xmlparser-xpp3:publish
13-Mar-2022 12:40:36
13-Mar-2022 12:40:36 Deprecated Gradle features were used in this build, making it incompatible with Gradle 7.0.
13-Mar-2022 12:40:36 Use '--warning-mode all' to show the individual deprecation warnings.
13-Mar-2022 12:40:36 See https://docs.gradle.org/6.4.1/userguide/command_line_interface.html#sec:command_line_warnings
13-Mar-2022 12:40:36
13-Mar-2022 12:40:36 BUILD SUCCESSFUL in 3m 27s
13-Mar-2022 12:40:36 378 actionable tasks: 196 executed, 182 up-to-date
13-Mar-2022 12:40:36 Finished task 'Publish artifacts' with result: Success
13-Mar-2022 12:40:36 Running post build plugin 'NCover Results Collector'
13-Mar-2022 12:40:36 Running post build plugin 'Artifact Copier'
13-Mar-2022 12:40:36 Publishing an artifact: Project binary files
13-Mar-2022 12:40:36 Finished publishing of artifact Non required shared artifact: [Project binary files], pattern: [*.zip] anchored at: [build/distributions/] in 34.90 ms
13-Mar-2022 12:40:36 Running post build plugin 'npm Cache Cleanup'
13-Mar-2022 12:40:36 Running post build plugin 'Build Results Label Collector'
13-Mar-2022 12:40:36 Running post build plugin 'Clover Results Collector'
13-Mar-2022 12:40:36 Running post build plugin 'Docker Container Cleanup'
13-Mar-2022 12:40:36 Finalising the build...
13-Mar-2022 12:40:36 Stopping timer.
13-Mar-2022 12:40:36 Build SMACK-NIGHTLY-JOB1-1859 completed.
13-Mar-2022 12:40:36 Running on server: post build plugin 'NCover Results Collector'
13-Mar-2022 12:40:36 Running on server: post build plugin 'Build Hanging Detection Configuration'
13-Mar-2022 12:40:36 Running on server: post build plugin 'Build Labeller'
13-Mar-2022 12:40:36 Running on server: post build plugin 'Clover Delta Calculator'
13-Mar-2022 12:40:36 Running on server: post build plugin 'Maven Dependencies Postprocessor'
13-Mar-2022 12:40:36 All post build plugins have finished
13-Mar-2022 12:40:36 Generating build results summary...
13-Mar-2022 12:40:37 Saving build results to disk...
13-Mar-2022 12:40:37 Store variable context...
13-Mar-2022 12:40:37 Indexing build results...
13-Mar-2022 12:40:37 Finished building SMACK-NIGHTLY-JOB1-1859.