Verifies the integrety of the projects, as builds are executed immediately after a code change was detected. This plan provides no artifiacts (use a nightly build instead).

Build: #1026 failed

Job: Build failed

Stages & jobs

  1. Build Stage

Build log

The build generated 751 lines of output. Download or view full build log.

11-Nov-2024 22:32:32 Build Smack - Continuous Integration (master) - Build #1026 (SMACK-CIMASTER-JOB1-1026) is being prepared for building on agent mesonet-ah.agron.iastate.edu, bamboo version: 9.6.5
11-Nov-2024 22:32:32 Remote agent on host mesonet-ah.agron.iastate.edu
11-Nov-2024 22:32:33 Build working directory is /home/bamboo-agent2/bamboo-agent-home/xml-data/build-dir/SMACK-CIMASTER-JOB1
11-Nov-2024 22:32:33 Executing build Smack - Continuous Integration (master) - Build #1026 (SMACK-CIMASTER-JOB1-1026)
11-Nov-2024 22:32:33 Running pre-build action: Build Log Labeller Pre Build Action
11-Nov-2024 22:32:33 Running pre-build action: VCS Version Collector
11-Nov-2024 22:32:33 Build Smack - Continuous Integration (master) - Build #1026 (SMACK-CIMASTER-JOB1-1026) started building on agent 'mesonet-ah.agron.iastate.edu' (Remote agent on host mesonet-ah.agron.iastate.edu)
11-Nov-2024 22:32:33 Starting task 'Purge pre-existing conflicting Maven artifact' of type 'com.atlassian.bamboo.plugins.scripttask:task.builder.script'
11-Nov-2024 22:32:33
Beginning to execute external process for build 'Smack - Continuous Integration (master) - Build #1026 (SMACK-CIMASTER-JOB1-1026)'
... running command line:
/home/bamboo-agent2/bamboo-agent-home/temp/SMACK-CIMASTER-JOB1-1026-ScriptBuildTask-16629723688191218474.sh
... in: /home/bamboo-agent2/bamboo-agent-home/xml-data/build-dir/SMACK-CIMASTER-JOB1
11-Nov-2024 22:32:33 Finished task 'Purge pre-existing conflicting Maven artifact' with result: Success
11-Nov-2024 22:32:33 Starting task 'Checkout Default Repository' of type 'com.atlassian.bamboo.plugins.vcs:task.vcs.checkout'
11-Nov-2024 22:32:33 Checking out into /home/bamboo-agent2/bamboo-agent-home/xml-data/build-dir/SMACK-CIMASTER-JOB1
11-Nov-2024 22:32:33 Updating source code to revision: d3cbe8c533f9c93fa0d41e6b766e490869958d40
11-Nov-2024 22:32:34 Fetching 'refs/heads/master' from 'https://github.com/igniterealtime/Smack.git'.
11-Nov-2024 22:32:34 Checking out revision d3cbe8c533f9c93fa0d41e6b766e490869958d40.
11-Nov-2024 22:32:34 Creating local git repository in '/home/bamboo-agent2/bamboo-agent-home/xml-data/build-dir/SMACK-CIMASTER-JOB1/.git'.
11-Nov-2024 22:32:34 Cloning into '/home/bamboo-agent2/bamboo-agent-home/xml-data/build-dir/SMACK-CIMASTER-JOB1'...
11-Nov-2024 22:32:34 done.
11-Nov-2024 22:32:35 Already on 'master'
11-Nov-2024 22:32:35 Your branch is up to date with 'origin/master'.
11-Nov-2024 22:32:35 Updated source code to revision: d3cbe8c533f9c93fa0d41e6b766e490869958d40
11-Nov-2024 22:32:35 Finished task 'Checkout Default Repository' with result: Success
11-Nov-2024 22:32:35 Starting task 'Build using the project-provided Gradle wrapper' of type 'com.atlassian.bamboo.plugins.scripttask:task.builder.script'
11-Nov-2024 22:32:35
Beginning to execute external process for build 'Smack - Continuous Integration (master) - Build #1026 (SMACK-CIMASTER-JOB1-1026)'
... running command line:
/home/bamboo-agent2/bamboo-agent-home/temp/SMACK-CIMASTER-JOB1-1026-ScriptBuildTask-5530992825341154569.sh
... in: /home/bamboo-agent2/bamboo-agent-home/xml-data/build-dir/SMACK-CIMASTER-JOB1
11-Nov-2024 22:32:37 To honour the JVM settings for this build a single-use Daemon process will be forked. For more on this, please refer to https://docs.gradle.org/8.10.2/userguide/gradle_daemon.html#sec:disabling_the_daemon in the Gradle documentation.
11-Nov-2024 22:32:39 Daemon will be stopped at the end of the build
11-Nov-2024 22:32:48 > Task :build-logic:extractPluginRequests
11-Nov-2024 22:32:48 > Task :build-logic:generatePluginAdapters
11-Nov-2024 22:32:50 > Task :build-logic:compileJava
11-Nov-2024 22:32:50 > Task :build-logic:compileGroovy NO-SOURCE
11-Nov-2024 22:32:51 > Task :build-logic:compileGroovyPlugins
11-Nov-2024 22:32:51 > Task :build-logic:pluginDescriptors
11-Nov-2024 22:32:51 > Task :build-logic:processResources
11-Nov-2024 22:32:51 > Task :build-logic:classes
11-Nov-2024 22:32:51 > Task :build-logic:jar
11-Nov-2024 22:33:16 > Task :smack-android:clean UP-TO-DATE
11-Nov-2024 22:33:16 > Task :smack-android-extensions:clean UP-TO-DATE
11-Nov-2024 22:33:16 > Task :smack-bosh:clean UP-TO-DATE
11-Nov-2024 22:33:16 > Task :smack-core:clean UP-TO-DATE
11-Nov-2024 22:33:16 > Task :smack-debug:clean UP-TO-DATE
11-Nov-2024 22:33:16 > Task :smack-debug-slf4j:clean UP-TO-DATE
11-Nov-2024 22:33:16 > Task :smack-examples:clean UP-TO-DATE
11-Nov-2024 22:33:16 > Task :smack-experimental:clean UP-TO-DATE
11-Nov-2024 22:33:16 > Task :smack-extensions:clean UP-TO-DATE
11-Nov-2024 22:33:16 > Task :smack-im:clean UP-TO-DATE
11-Nov-2024 22:33:16 > Task :smack-integration-test:clean UP-TO-DATE
11-Nov-2024 22:33:16 > Task :smack-java11:clean UP-TO-DATE
11-Nov-2024 22:33:16 > Task :smack-java11-full:cleanGeneratedFiles UP-TO-DATE
11-Nov-2024 22:33:16 > Task :smack-java11-full:clean UP-TO-DATE
11-Nov-2024 22:33:16 > Task :smack-jingle-old:clean UP-TO-DATE
11-Nov-2024 22:33:16 > Task :smack-legacy:clean UP-TO-DATE
11-Nov-2024 22:33:16 > Task :smack-omemo:clean UP-TO-DATE
11-Nov-2024 22:33:16 > Task :smack-omemo-signal:clean UP-TO-DATE
11-Nov-2024 22:33:16 > Task :smack-omemo-signal-integration-test:clean UP-TO-DATE
11-Nov-2024 22:33:16 > Task :smack-openpgp:clean UP-TO-DATE
11-Nov-2024 22:33:16 > Task :smack-repl:clean UP-TO-DATE
11-Nov-2024 22:33:16 > Task :smack-resolver-dnsjava:clean UP-TO-DATE
11-Nov-2024 22:33:16 > Task :smack-resolver-javax:clean UP-TO-DATE
11-Nov-2024 22:33:16 > Task :smack-resolver-minidns:clean UP-TO-DATE
11-Nov-2024 22:33:16 > Task :smack-resolver-minidns-dox:clean UP-TO-DATE
11-Nov-2024 22:33:16 > Task :smack-sasl-javax:clean UP-TO-DATE
11-Nov-2024 22:33:16 > Task :smack-sasl-provided:clean UP-TO-DATE
11-Nov-2024 22:33:16 > Task :smack-streammanagement:clean UP-TO-DATE
11-Nov-2024 22:33:16 > Task :smack-tcp:clean UP-TO-DATE
11-Nov-2024 22:33:16 > Task :smack-websocket:clean UP-TO-DATE
11-Nov-2024 22:33:16 > Task :smack-websocket-java11:clean UP-TO-DATE
11-Nov-2024 22:33:16 > Task :smack-websocket-okhttp:clean UP-TO-DATE
11-Nov-2024 22:33:16 > Task :smack-xmlparser:clean UP-TO-DATE
11-Nov-2024 22:33:16 > Task :smack-xmlparser-stax:clean UP-TO-DATE
11-Nov-2024 22:33:16 > Task :smack-xmlparser-xpp3:clean UP-TO-DATE
11-Nov-2024 22:33:24 > Task :smack-xmlparser:compileJava
11-Nov-2024 22:33:42 > Task :smack-core:compileJava
11-Nov-2024 22:33:48 > Task :smack-im:compileJava
11-Nov-2024 22:33:50 > Task :smack-resolver-minidns:compileJava
11-Nov-2024 22:33:52 > Task :smack-sasl-provided:compileJava
11-Nov-2024 22:33:54 > Task :smack-xmlparser-xpp3:compileJava
11-Nov-2024 22:33:57 > Task :smack-android:compileJava
11-Nov-2024 22:33:57 > Task :smack-android:processResources NO-SOURCE
11-Nov-2024 22:33:57 > Task :smack-android:classes
11-Nov-2024 22:33:57 > Task :smack-core:createVersionResource
11-Nov-2024 22:33:57 > Task :smack-core:processResources
11-Nov-2024 22:33:57 > Task :smack-core:classes
11-Nov-2024 22:33:57 > Task :smack-xmlparser:processResources NO-SOURCE
11-Nov-2024 22:33:57 > Task :smack-xmlparser:classes
11-Nov-2024 22:33:58 > Task :smack-xmlparser:jar
11-Nov-2024 22:33:59 > Task :smack-core:jar
11-Nov-2024 22:33:59 > Task :smack-im:processResources
11-Nov-2024 22:33:59 > Task :smack-im:classes
11-Nov-2024 22:33:59 > Task :smack-im:jar
11-Nov-2024 22:33:59 > Task :smack-resolver-minidns:processResources NO-SOURCE
11-Nov-2024 22:33:59 > Task :smack-resolver-minidns:classes
11-Nov-2024 22:34:00 > Task :smack-resolver-minidns:jar
11-Nov-2024 22:34:00 > Task :smack-sasl-provided:processResources NO-SOURCE
11-Nov-2024 22:34:00 > Task :smack-sasl-provided:classes
11-Nov-2024 22:34:00 > Task :smack-sasl-provided:jar
11-Nov-2024 22:34:00 > Task :smack-xmlparser-xpp3:processResources
11-Nov-2024 22:34:00 > Task :smack-xmlparser-xpp3:classes
11-Nov-2024 22:34:00 > Task :smack-xmlparser-xpp3:jar
11-Nov-2024 22:34:01 > Task :smack-android:jar
11-Nov-2024 22:34:01 > Task :smack-android:assemble
11-Nov-2024 22:34:02 > Task :smack-android:animalsnifferMain
11-Nov-2024 22:34:03 > Task :smack-android:compileTestFixturesJava NO-SOURCE
11-Nov-2024 22:34:03 > Task :smack-android:compileTestJava NO-SOURCE
11-Nov-2024 22:34:03 > Task :smack-android:processTestResources NO-SOURCE
11-Nov-2024 22:34:03 > Task :smack-android:testClasses UP-TO-DATE
11-Nov-2024 22:34:03 > Task :smack-android:checkstyleTest NO-SOURCE
11-Nov-2024 22:34:03 > Task :smack-android:processTestFixturesResources NO-SOURCE
11-Nov-2024 22:34:03 > Task :smack-android:testFixturesClasses UP-TO-DATE
11-Nov-2024 22:34:03 > Task :smack-android:checkstyleTestFixtures NO-SOURCE
11-Nov-2024 22:34:03 > Task :smack-android:testFixturesJar
11-Nov-2024 22:34:03 > Task :smack-android:copyJavadocDocFiles NO-SOURCE
11-Nov-2024 22:34:05 > Task :smack-android:javadoc
11-Nov-2024 22:34:05 > Task :smack-android:test NO-SOURCE
11-Nov-2024 22:34:09 > Task :smack-android:checkstyleMain
11-Nov-2024 22:34:26 > Task :smack-extensions:compileJava
11-Nov-2024 22:34:26 > Task :smack-android:check
11-Nov-2024 22:34:26 > Task :smack-android:build
11-Nov-2024 22:34:29 > Task :smack-android-extensions:compileJava
11-Nov-2024 22:34:29 > Task :smack-android-extensions:processResources NO-SOURCE
11-Nov-2024 22:34:29 > Task :smack-android-extensions:classes
11-Nov-2024 22:34:29 > Task :smack-extensions:processResources
11-Nov-2024 22:34:29 > Task :smack-extensions:classes
11-Nov-2024 22:34:30 > Task :smack-extensions:jar
11-Nov-2024 22:34:30 > Task :smack-android-extensions:jar
11-Nov-2024 22:34:30 > Task :smack-android-extensions:assemble
11-Nov-2024 22:34:31 > Task :smack-android-extensions:animalsnifferMain
11-Nov-2024 22:34:31 > Task :smack-android-extensions:compileTestFixturesJava NO-SOURCE
11-Nov-2024 22:34:31 > Task :smack-android-extensions:compileTestJava NO-SOURCE
11-Nov-2024 22:34:31 > Task :smack-android-extensions:processTestResources NO-SOURCE
11-Nov-2024 22:34:31 > Task :smack-android-extensions:testClasses UP-TO-DATE
11-Nov-2024 22:34:31 > Task :smack-android-extensions:checkstyleTest NO-SOURCE
11-Nov-2024 22:34:31 > Task :smack-android-extensions:processTestFixturesResources NO-SOURCE
11-Nov-2024 22:34:31 > Task :smack-android-extensions:testFixturesClasses UP-TO-DATE
11-Nov-2024 22:34:31 > Task :smack-android-extensions:checkstyleTestFixtures NO-SOURCE
11-Nov-2024 22:34:31 > Task :smack-android-extensions:testFixturesJar
11-Nov-2024 22:34:32 > Task :smack-android-extensions:copyJavadocDocFiles NO-SOURCE
11-Nov-2024 22:34:32 > Task :smack-android-extensions:checkstyleMain
11-Nov-2024 22:34:34 > Task :smack-android-extensions:javadoc
11-Nov-2024 22:34:34 > Task :smack-android-extensions:test NO-SOURCE
11-Nov-2024 22:34:34 > Task :smack-android-extensions:check
11-Nov-2024 22:34:34 > Task :smack-android-extensions:build
11-Nov-2024 22:34:36 > Task :smack-bosh:compileJava
11-Nov-2024 22:34:36 > Task :smack-bosh:processResources NO-SOURCE
11-Nov-2024 22:34:36 > Task :smack-bosh:classes
11-Nov-2024 22:34:36 > Task :smack-bosh:jar
11-Nov-2024 22:34:36 > Task :smack-bosh:assemble
11-Nov-2024 22:34:37 > Task :smack-bosh:animalsnifferMain
11-Nov-2024 22:34:37 > Task :smack-bosh:compileTestFixturesJava NO-SOURCE
11-Nov-2024 22:34:37 > Task :smack-bosh:compileTestJava NO-SOURCE
11-Nov-2024 22:34:37 > Task :smack-bosh:processTestResources NO-SOURCE
11-Nov-2024 22:34:37 > Task :smack-bosh:testClasses UP-TO-DATE
11-Nov-2024 22:34:37 > Task :smack-bosh:checkstyleTest NO-SOURCE
11-Nov-2024 22:34:37 > Task :smack-bosh:processTestFixturesResources NO-SOURCE
11-Nov-2024 22:34:37 > Task :smack-bosh:testFixturesClasses UP-TO-DATE
11-Nov-2024 22:34:37 > Task :smack-bosh:checkstyleTestFixtures NO-SOURCE
11-Nov-2024 22:34:37 > Task :smack-bosh:testFixturesJar
11-Nov-2024 22:34:37 > Task :smack-bosh:copyJavadocDocFiles NO-SOURCE
11-Nov-2024 22:34:38 > Task :smack-bosh:checkstyleMain
11-Nov-2024 22:34:40 > Task :smack-bosh:javadoc
11-Nov-2024 22:34:40 > Task :smack-bosh:test NO-SOURCE
11-Nov-2024 22:34:40 > Task :smack-bosh:check
11-Nov-2024 22:34:40 > Task :smack-bosh:build
11-Nov-2024 22:34:40 > Task :smack-core:assemble
11-Nov-2024 22:34:40 > Task :smack-core:animalsnifferMain
11-Nov-2024 22:34:42 > Task :smack-xmlparser-stax:compileJava
11-Nov-2024 22:34:45 > Task :smack-core:checkstyleMain
11-Nov-2024 22:34:50 > Task :smack-core:compileTestFixturesJava
11-Nov-2024 22:34:55 > Task :smack-core:compileTestJava
11-Nov-2024 22:34:55 > Task :smack-core:processTestResources
11-Nov-2024 22:34:55 > Task :smack-core:testClasses
11-Nov-2024 22:34:56 > Task :smack-core:processTestFixturesResources NO-SOURCE
11-Nov-2024 22:34:56 > Task :smack-core:testFixturesClasses
11-Nov-2024 22:34:56 > Task :smack-core:testFixturesJar
11-Nov-2024 22:34:56 > Task :smack-core:copyJavadocDocFiles NO-SOURCE
11-Nov-2024 22:34:56 > Task :smack-core:checkstyleTest
11-Nov-2024 22:35:03 > Task :smack-core:checkstyleTestFixtures
11-Nov-2024 22:35:05 > Task :smack-core:javadoc
11-Nov-2024 22:35:05 > Task :smack-xmlparser-stax:processResources
11-Nov-2024 22:35:05 > Task :smack-xmlparser-stax:classes
11-Nov-2024 22:35:05 > Task :smack-xmlparser-stax:jar
11-Nov-2024 22:35:15 > Task :smack-core:test
11-Nov-2024 22:35:15 > Task :smack-core:check
11-Nov-2024 22:35:15 > Task :smack-core:build
11-Nov-2024 22:35:20 > Task :smack-debug:compileJava
11-Nov-2024 22:35:20 > Task :smack-debug:processResources
11-Nov-2024 22:35:20 > Task :smack-debug:classes
11-Nov-2024 22:35:20 > Task :smack-debug:jar
11-Nov-2024 22:35:20 > Task :smack-debug:assemble
11-Nov-2024 22:35:20 > Task :smack-debug:compileTestFixturesJava NO-SOURCE
11-Nov-2024 22:35:20 > Task :smack-debug:compileTestJava NO-SOURCE
11-Nov-2024 22:35:20 > Task :smack-debug:processTestResources NO-SOURCE
11-Nov-2024 22:35:20 > Task :smack-debug:testClasses UP-TO-DATE
11-Nov-2024 22:35:20 > Task :smack-debug:checkstyleTest NO-SOURCE
11-Nov-2024 22:35:20 > Task :smack-debug:processTestFixturesResources NO-SOURCE
11-Nov-2024 22:35:20 > Task :smack-debug:testFixturesClasses UP-TO-DATE
11-Nov-2024 22:35:20 > Task :smack-debug:checkstyleTestFixtures NO-SOURCE
11-Nov-2024 22:35:20 > Task :smack-debug:testFixturesJar
11-Nov-2024 22:35:20 > Task :smack-debug:copyJavadocDocFiles NO-SOURCE
11-Nov-2024 22:35:21 > Task :smack-debug:checkstyleMain
11-Nov-2024 22:35:23 > Task :smack-debug:javadoc
11-Nov-2024 22:35:23 > Task :smack-debug:test NO-SOURCE
11-Nov-2024 22:35:23 > Task :smack-debug:check
11-Nov-2024 22:35:23 > Task :smack-debug:build
11-Nov-2024 22:35:25 > Task :smack-debug-slf4j:compileJava
11-Nov-2024 22:35:25 > Task :smack-debug-slf4j:processResources NO-SOURCE
11-Nov-2024 22:35:25 > Task :smack-debug-slf4j:classes
11-Nov-2024 22:35:25 > Task :smack-debug-slf4j:jar
11-Nov-2024 22:35:25 > Task :smack-debug-slf4j:assemble
11-Nov-2024 22:35:25 > Task :smack-debug-slf4j:compileTestFixturesJava NO-SOURCE
11-Nov-2024 22:35:25 > Task :smack-debug-slf4j:compileTestJava NO-SOURCE
11-Nov-2024 22:35:25 > Task :smack-debug-slf4j:processTestResources NO-SOURCE
11-Nov-2024 22:35:25 > Task :smack-debug-slf4j:testClasses UP-TO-DATE
11-Nov-2024 22:35:25 > Task :smack-debug-slf4j:checkstyleTest NO-SOURCE
11-Nov-2024 22:35:25 > Task :smack-debug-slf4j:processTestFixturesResources NO-SOURCE
11-Nov-2024 22:35:25 > Task :smack-debug-slf4j:testFixturesClasses UP-TO-DATE
11-Nov-2024 22:35:25 > Task :smack-debug-slf4j:checkstyleTestFixtures NO-SOURCE
11-Nov-2024 22:35:25 > Task :smack-debug-slf4j:testFixturesJar
11-Nov-2024 22:35:25 > Task :smack-debug-slf4j:copyJavadocDocFiles NO-SOURCE
11-Nov-2024 22:35:26 > Task :smack-debug-slf4j:checkstyleMain
11-Nov-2024 22:35:28 > Task :smack-debug-slf4j:javadoc
11-Nov-2024 22:35:28 > Task :smack-debug-slf4j:test NO-SOURCE
11-Nov-2024 22:35:28 > Task :smack-debug-slf4j:check
11-Nov-2024 22:35:28 > Task :smack-debug-slf4j:build
11-Nov-2024 22:35:39 > Task :smack-experimental:compileJava
11-Nov-2024 22:35:41 > Task :smack-resolver-javax:compileJava
11-Nov-2024 22:35:43 > Task :smack-sasl-javax:compileJava
11-Nov-2024 22:35:45 > Task :smack-java11:compileJava
11-Nov-2024 22:35:51 > Task :smack-legacy:compileJava
11-Nov-2024 22:35:56 > Task :smack-omemo:compileJava
11-Nov-2024 22:36:01 > Task :smack-openpgp:compileJava
11-Nov-2024 22:36:02 > Task :smack-resolver-minidns-dox:compileJava
11-Nov-2024 22:36:05 > Task :smack-streammanagement:compileJava
11-Nov-2024 22:36:09 > Task :smack-tcp:compileJava
11-Nov-2024 22:36:11 > Task :smack-websocket:compileJava
11-Nov-2024 22:36:13 > Task :smack-websocket-java11:compileJava
11-Nov-2024 22:36:16 > Task :smack-java11-full:compileJava
11-Nov-2024 22:36:18 > Task :smack-resolver-dnsjava:compileJava
11-Nov-2024 22:36:21 > Task :smack-websocket-okhttp:compileJava
11-Nov-2024 22:36:32 > Task :smack-integration-test:compileJava
11-Nov-2024 22:36:34 > Task :smack-omemo-signal:compileJava
11-Nov-2024 22:36:38 > Task :smack-examples:compileJava
11-Nov-2024 22:36:38 > Task :smack-examples:processResources NO-SOURCE
11-Nov-2024 22:36:38 > Task :smack-examples:classes
11-Nov-2024 22:36:38 > Task :smack-experimental:processResources
11-Nov-2024 22:36:38 > Task :smack-experimental:classes
11-Nov-2024 22:36:38 > Task :smack-experimental:jar
11-Nov-2024 22:36:38 > Task :smack-integration-test:processResources NO-SOURCE
11-Nov-2024 22:36:38 > Task :smack-integration-test:classes
11-Nov-2024 22:36:38 > Task :smack-java11:processResources NO-SOURCE
11-Nov-2024 22:36:38 > Task :smack-java11:classes
11-Nov-2024 22:36:38 > Task :smack-resolver-javax:processResources NO-SOURCE
11-Nov-2024 22:36:38 > Task :smack-resolver-javax:classes
11-Nov-2024 22:36:38 > Task :smack-resolver-javax:jar
11-Nov-2024 22:36:38 > Task :smack-sasl-javax:processResources NO-SOURCE
11-Nov-2024 22:36:38 > Task :smack-sasl-javax:classes
11-Nov-2024 22:36:38 > Task :smack-sasl-javax:jar
11-Nov-2024 22:36:38 > Task :smack-java11:jar
11-Nov-2024 22:36:38 > Task :smack-java11-full:processResources NO-SOURCE
11-Nov-2024 22:36:38 > Task :smack-java11-full:classes
11-Nov-2024 22:36:38 > Task :smack-legacy:processResources
11-Nov-2024 22:36:38 > Task :smack-legacy:classes
11-Nov-2024 22:36:39 > Task :smack-legacy:jar
11-Nov-2024 22:36:39 > Task :smack-omemo:processResources
11-Nov-2024 22:36:39 > Task :smack-omemo:classes
11-Nov-2024 22:36:39 > Task :smack-omemo:jar
11-Nov-2024 22:36:39 > Task :smack-openpgp:processResources
11-Nov-2024 22:36:39 > Task :smack-openpgp:classes
11-Nov-2024 22:36:39 > Task :smack-openpgp:jar
11-Nov-2024 22:36:40 > Task :smack-resolver-minidns-dox:processResources NO-SOURCE
11-Nov-2024 22:36:40 > Task :smack-resolver-minidns-dox:classes
11-Nov-2024 22:36:40 > Task :smack-resolver-minidns-dox:jar
11-Nov-2024 22:36:40 > Task :smack-streammanagement:processResources NO-SOURCE
11-Nov-2024 22:36:40 > Task :smack-streammanagement:classes
11-Nov-2024 22:36:40 > Task :smack-streammanagement:jar
11-Nov-2024 22:36:40 > Task :smack-tcp:processResources
11-Nov-2024 22:36:40 > Task :smack-tcp:classes
11-Nov-2024 22:36:40 > Task :smack-tcp:jar
11-Nov-2024 22:36:40 > Task :smack-websocket:processResources NO-SOURCE
11-Nov-2024 22:36:40 > Task :smack-websocket:classes
11-Nov-2024 22:36:40 > Task :smack-websocket:jar
11-Nov-2024 22:36:40 > Task :smack-websocket-java11:processResources
11-Nov-2024 22:36:40 > Task :smack-websocket-java11:classes
11-Nov-2024 22:36:40 > Task :smack-websocket-java11:jar
11-Nov-2024 22:36:40 > Task :smack-java11-full:jar
11-Nov-2024 22:36:40 > Task :smack-resolver-dnsjava:processResources NO-SOURCE
11-Nov-2024 22:36:40 > Task :smack-resolver-dnsjava:classes
11-Nov-2024 22:36:40 > Task :smack-resolver-dnsjava:jar
11-Nov-2024 22:36:40 > Task :smack-websocket-okhttp:processResources
11-Nov-2024 22:36:40 > Task :smack-websocket-okhttp:classes
11-Nov-2024 22:36:41 > Task :smack-websocket-okhttp:jar
11-Nov-2024 22:36:41 > Task :smack-integration-test:jar
11-Nov-2024 22:36:41 > Task :smack-omemo-signal:processResources NO-SOURCE
11-Nov-2024 22:36:41 > Task :smack-omemo-signal:classes
11-Nov-2024 22:36:41 > Task :smack-omemo-signal:jar
11-Nov-2024 22:36:41 > Task :smack-examples:jar
11-Nov-2024 22:36:41 > Task :smack-examples:assemble
11-Nov-2024 22:36:41 > Task :smack-examples:compileTestFixturesJava NO-SOURCE
11-Nov-2024 22:36:42 > Task :smack-examples:checkstyleMain
11-Nov-2024 22:36:43 > Task :smack-examples:compileTestJava
11-Nov-2024 22:36:43 > Task :smack-examples:processTestResources NO-SOURCE
11-Nov-2024 22:36:43 > Task :smack-examples:testClasses
11-Nov-2024 22:36:43 > Task :smack-examples:processTestFixturesResources NO-SOURCE
11-Nov-2024 22:36:43 > Task :smack-examples:testFixturesClasses UP-TO-DATE
11-Nov-2024 22:36:43 > Task :smack-examples:checkstyleTestFixtures NO-SOURCE
11-Nov-2024 22:36:43 > Task :smack-examples:testFixturesJar
11-Nov-2024 22:36:43 > Task :smack-examples:copyJavadocDocFiles NO-SOURCE
11-Nov-2024 22:36:43 > Task :smack-examples:checkstyleTest
11-Nov-2024 22:36:45 > Task :smack-examples:javadoc
11-Nov-2024 22:36:48 > Task :smack-examples:test
11-Nov-2024 22:36:48 > Task :smack-examples:check
11-Nov-2024 22:36:48 > Task :smack-examples:build
11-Nov-2024 22:36:48 > Task :smack-experimental:assemble
11-Nov-2024 22:36:48 > Task :smack-experimental:animalsnifferMain
11-Nov-2024 22:36:50 > Task :smack-extensions:compileTestFixturesJava
11-Nov-2024 22:36:50 > Task :smack-experimental:compileTestFixturesJava NO-SOURCE
11-Nov-2024 22:36:51 > Task :smack-experimental:checkstyleMain
11-Nov-2024 22:36:55 > Task :smack-experimental:compileTestJava
11-Nov-2024 22:36:55 > Task :smack-experimental:processTestResources NO-SOURCE
11-Nov-2024 22:36:55 > Task :smack-experimental:testClasses
11-Nov-2024 22:36:55 > Task :smack-experimental:processTestFixturesResources NO-SOURCE
11-Nov-2024 22:36:55 > Task :smack-experimental:testFixturesClasses UP-TO-DATE
11-Nov-2024 22:36:55 > Task :smack-experimental:checkstyleTestFixtures NO-SOURCE
11-Nov-2024 22:36:55 > Task :smack-experimental:testFixturesJar
11-Nov-2024 22:36:55 > Task :smack-experimental:copyJavadocDocFiles NO-SOURCE
11-Nov-2024 22:36:57 > Task :smack-experimental:checkstyleTest
11-Nov-2024 22:37:05 > Task :smack-experimental:javadoc
11-Nov-2024 22:37:05 > Task :smack-extensions:processTestFixturesResources NO-SOURCE
11-Nov-2024 22:37:05 > Task :smack-extensions:testFixturesClasses
11-Nov-2024 22:37:05 > Task :smack-extensions:testFixturesJar
11-Nov-2024 22:37:17 > Task :smack-experimental:test
11-Nov-2024 22:37:17 > Task :smack-experimental:check
11-Nov-2024 22:37:17 > Task :smack-experimental:build
11-Nov-2024 22:37:17 > Task :smack-extensions:assemble
11-Nov-2024 22:37:18 > Task :smack-extensions:animalsnifferMain
11-Nov-2024 22:37:24 > Task :smack-extensions:checkstyleMain
11-Nov-2024 22:37:26 > Task :smack-extensions:compileTestJava
11-Nov-2024 22:37:26 > Task :smack-extensions:processTestResources
11-Nov-2024 22:37:26 > Task :smack-extensions:testClasses
11-Nov-2024 22:37:26 > Task :smack-extensions:copyJavadocDocFiles NO-SOURCE
11-Nov-2024 22:37:26 > Task :smack-extensions:checkstyleTestFixtures
11-Nov-2024 22:37:28 > Task :smack-extensions:checkstyleTest
11-Nov-2024 22:37:39 > Task :smack-extensions:javadoc
11-Nov-2024 22:37:48 OpenJDK 64-Bit Server VM warning: Sharing is only supported for boot loader classes because bootstrap classpath has been appended
11-Nov-2024 22:37:49 OpenJDK 64-Bit Server VM warning: Sharing is only supported for boot loader classes because bootstrap classpath has been appended
11-Nov-2024 22:37:49 OpenJDK 64-Bit Server VM warning: Sharing is only supported for boot loader classes because bootstrap classpath has been appended
11-Nov-2024 22:37:49 OpenJDK 64-Bit Server VM warning: Sharing is only supported for boot loader classes because bootstrap classpath has been appended
11-Nov-2024 22:37:49 OpenJDK 64-Bit Server VM warning: Sharing is only supported for boot loader classes because bootstrap classpath has been appended
11-Nov-2024 22:37:49 OpenJDK 64-Bit Server VM warning: Sharing is only supported for boot loader classes because bootstrap classpath has been appended
11-Nov-2024 22:37:49 OpenJDK 64-Bit Server VM warning: Sharing is only supported for boot loader classes because bootstrap classpath has been appended
11-Nov-2024 22:37:49 OpenJDK 64-Bit Server VM warning: Sharing is only supported for boot loader classes because bootstrap classpath has been appended
11-Nov-2024 22:38:09 > Task :smack-extensions:test
11-Nov-2024 22:38:09 > Task :smack-extensions:check
11-Nov-2024 22:38:09 > Task :smack-extensions:build
11-Nov-2024 22:38:09 > Task :smack-im:assemble
11-Nov-2024 22:38:10 > Task :smack-im:animalsnifferMain
11-Nov-2024 22:38:10 > Task :smack-im:compileTestFixturesJava NO-SOURCE
11-Nov-2024 22:38:10 > Task :smack-im:checkstyleMain
11-Nov-2024 22:38:13 > Task :smack-im:compileTestJava
11-Nov-2024 22:38:13 > Task :smack-im:processTestResources NO-SOURCE
11-Nov-2024 22:38:13 > Task :smack-im:testClasses
11-Nov-2024 22:38:13 > Task :smack-im:processTestFixturesResources NO-SOURCE
11-Nov-2024 22:38:13 > Task :smack-im:testFixturesClasses UP-TO-DATE
11-Nov-2024 22:38:13 > Task :smack-im:checkstyleTestFixtures NO-SOURCE
11-Nov-2024 22:38:13 > Task :smack-im:testFixturesJar
11-Nov-2024 22:38:13 > Task :smack-im:copyJavadocDocFiles NO-SOURCE
11-Nov-2024 22:38:14 > Task :smack-im:checkstyleTest
11-Nov-2024 22:38:17 > Task :smack-im:javadoc
11-Nov-2024 22:38:25 > Task :smack-im:test
11-Nov-2024 22:38:25 > Task :smack-im:check
11-Nov-2024 22:38:25 > Task :smack-im:build
11-Nov-2024 22:38:25 > Task :smack-integration-test:startScripts
11-Nov-2024 22:38:26 > Task :smack-integration-test:distTar
11-Nov-2024 22:38:27 > Task :smack-integration-test:distZip
11-Nov-2024 22:38:27 > Task :smack-integration-test:assemble
11-Nov-2024 22:38:27 > Task :smack-integration-test:compileTestFixturesJava NO-SOURCE
11-Nov-2024 22:38:30 > Task :smack-integration-test:checkstyleMain
11-Nov-2024 22:38:30 > Task :smack-integration-test:compileTestJava
11-Nov-2024 22:38:30 > Task :smack-integration-test:processTestResources NO-SOURCE
11-Nov-2024 22:38:30 > Task :smack-integration-test:testClasses
11-Nov-2024 22:38:30 > Task :smack-integration-test:processTestFixturesResources NO-SOURCE
11-Nov-2024 22:38:30 > Task :smack-integration-test:testFixturesClasses UP-TO-DATE
11-Nov-2024 22:38:30 > Task :smack-integration-test:checkstyleTestFixtures NO-SOURCE
11-Nov-2024 22:38:30 > Task :smack-integration-test:testFixturesJar
11-Nov-2024 22:38:30 > Task :smack-integration-test:copyJavadocDocFiles NO-SOURCE
11-Nov-2024 22:38:30 > Task :smack-integration-test:checkstyleTest
11-Nov-2024 22:38:36 > Task :smack-integration-test:javadoc
11-Nov-2024 22:38:44 > Task :smack-integration-test:test
11-Nov-2024 22:38:44 > Task :smack-integration-test:check
11-Nov-2024 22:38:44 > Task :smack-integration-test:build
11-Nov-2024 22:38:44 > Task :smack-java11:assemble
11-Nov-2024 22:38:44 > Task :smack-java11:compileTestFixturesJava NO-SOURCE
11-Nov-2024 22:38:44 > Task :smack-java11:compileTestJava NO-SOURCE
11-Nov-2024 22:38:44 > Task :smack-java11:processTestResources NO-SOURCE
11-Nov-2024 22:38:44 > Task :smack-java11:testClasses UP-TO-DATE
11-Nov-2024 22:38:44 > Task :smack-java11:checkstyleTest NO-SOURCE
11-Nov-2024 22:38:44 > Task :smack-java11:processTestFixturesResources NO-SOURCE
11-Nov-2024 22:38:44 > Task :smack-java11:testFixturesClasses UP-TO-DATE
11-Nov-2024 22:38:44 > Task :smack-java11:checkstyleTestFixtures NO-SOURCE
11-Nov-2024 22:38:44 > Task :smack-java11:testFixturesJar
11-Nov-2024 22:38:44 > Task :smack-java11:copyJavadocDocFiles NO-SOURCE
11-Nov-2024 22:38:44 > Task :smack-java11:javadoc SKIPPED
11-Nov-2024 22:38:44 > Task :smack-java11:test NO-SOURCE
11-Nov-2024 22:38:44 > Task :smack-java11-full:assemble
11-Nov-2024 22:38:44 > Task :smack-java11-full:compileTestFixturesJava NO-SOURCE
11-Nov-2024 22:38:44 > Task :smack-java11:checkstyleMain
11-Nov-2024 22:38:45 > Task :smack-java11-full:checkstyleMain
11-Nov-2024 22:38:46 > Task :smack-java11-full:compileTestJava
11-Nov-2024 22:38:46 > Task :smack-java11:check
11-Nov-2024 22:38:46 > Task :smack-java11:build
11-Nov-2024 22:38:46 > Task :smack-java11-full:processTestResources
11-Nov-2024 22:38:46 > Task :smack-java11-full:testClasses
11-Nov-2024 22:38:46 > Task :smack-java11-full:processTestFixturesResources NO-SOURCE
11-Nov-2024 22:38:46 > Task :smack-java11-full:testFixturesClasses UP-TO-DATE
11-Nov-2024 22:38:46 > Task :smack-java11-full:checkstyleTestFixtures NO-SOURCE
11-Nov-2024 22:38:46 > Task :smack-java11-full:testFixturesJar
11-Nov-2024 22:38:46 > Task :smack-java11-full:checkstyleTest
11-Nov-2024 22:38:48 > Task :smack-java11-full:generateModularXmppClientToServerConnectionStateGraph
11-Nov-2024 22:38:48 > Task :smack-java11-full:convertModularXmppClientToServerConnectionStateGraphDotToPng
11-Nov-2024 22:38:48 > Task :smack-java11-full:copyJavadocDocFiles
11-Nov-2024 22:38:51 > Task :smack-java11-full:javadoc
11-Nov-2024 22:38:55 > Task :smack-java11-full:test
11-Nov-2024 22:38:55 > Task :smack-java11-full:check
11-Nov-2024 22:38:55 > Task :smack-java11-full:build
11-Nov-2024 22:39:05 > Task :smack-jingle-old:compileJava
11-Nov-2024 22:39:05 > Task :smack-jingle-old:processResources NO-SOURCE
11-Nov-2024 22:39:05 > Task :smack-jingle-old:classes
11-Nov-2024 22:39:05 > Task :smack-jingle-old:jar
11-Nov-2024 22:39:05 > Task :smack-jingle-old:assemble
11-Nov-2024 22:39:05 > Task :smack-jingle-old:compileTestFixturesJava NO-SOURCE
11-Nov-2024 22:39:05 > Task :smack-jingle-old:compileTestJava NO-SOURCE
11-Nov-2024 22:39:05 > Task :smack-jingle-old:processTestResources NO-SOURCE
11-Nov-2024 22:39:05 > Task :smack-jingle-old:testClasses UP-TO-DATE
11-Nov-2024 22:39:05 > Task :smack-jingle-old:checkstyleTest NO-SOURCE
11-Nov-2024 22:39:05 > Task :smack-jingle-old:processTestFixturesResources NO-SOURCE
11-Nov-2024 22:39:05 > Task :smack-jingle-old:testFixturesClasses UP-TO-DATE
11-Nov-2024 22:39:05 > Task :smack-jingle-old:checkstyleTestFixtures NO-SOURCE
11-Nov-2024 22:39:05 > Task :smack-jingle-old:testFixturesJar
11-Nov-2024 22:39:05 > Task :smack-jingle-old:copyJavadocDocFiles NO-SOURCE
11-Nov-2024 22:39:08 > Task :smack-jingle-old:checkstyleMain
11-Nov-2024 22:39:11 > Task :smack-jingle-old:javadoc
11-Nov-2024 22:39:11 > Task :smack-jingle-old:test NO-SOURCE
11-Nov-2024 22:39:11 > Task :smack-jingle-old:check
11-Nov-2024 22:39:11 > Task :smack-jingle-old:build
11-Nov-2024 22:39:11 > Task :smack-legacy:assemble
11-Nov-2024 22:39:12 > Task :smack-legacy:animalsnifferMain
11-Nov-2024 22:39:12 > Task :smack-legacy:compileTestFixturesJava NO-SOURCE
11-Nov-2024 22:39:14 > Task :smack-legacy:checkstyleMain
11-Nov-2024 22:39:14 > Task :smack-legacy:compileTestJava
11-Nov-2024 22:39:14 > Task :smack-legacy:processTestResources NO-SOURCE
11-Nov-2024 22:39:14 > Task :smack-legacy:testClasses
11-Nov-2024 22:39:14 > Task :smack-legacy:processTestFixturesResources NO-SOURCE
11-Nov-2024 22:39:14 > Task :smack-legacy:testFixturesClasses UP-TO-DATE
11-Nov-2024 22:39:14 > Task :smack-legacy:checkstyleTestFixtures NO-SOURCE
11-Nov-2024 22:39:14 > Task :smack-legacy:testFixturesJar
11-Nov-2024 22:39:14 > Task :smack-legacy:copyJavadocDocFiles NO-SOURCE
11-Nov-2024 22:39:14 > Task :smack-legacy:checkstyleTest
11-Nov-2024 22:39:20 > Task :smack-legacy:javadoc
11-Nov-2024 22:39:23 > Task :smack-legacy:test
11-Nov-2024 22:39:23 > Task :smack-legacy:check
11-Nov-2024 22:39:23 > Task :smack-legacy:build
11-Nov-2024 22:39:23 > Task :smack-omemo:assemble
11-Nov-2024 22:39:24 > Task :smack-omemo:animalsnifferMain
11-Nov-2024 22:39:24 > Task :smack-omemo:compileTestFixturesJava NO-SOURCE
11-Nov-2024 22:39:25 > Task :smack-omemo:checkstyleMain
11-Nov-2024 22:39:28 > Task :smack-omemo:compileTestJava
11-Nov-2024 22:39:28 > Task :smack-omemo:processTestResources NO-SOURCE
11-Nov-2024 22:39:28 > Task :smack-omemo:testClasses
11-Nov-2024 22:39:28 > Task :smack-omemo:processTestFixturesResources NO-SOURCE
11-Nov-2024 22:39:28 > Task :smack-omemo:testFixturesClasses UP-TO-DATE
11-Nov-2024 22:39:28 > Task :smack-omemo:checkstyleTestFixtures NO-SOURCE
11-Nov-2024 22:39:28 > Task :smack-omemo:testFixturesJar
11-Nov-2024 22:39:28 > Task :smack-omemo:testsJar
11-Nov-2024 22:39:28 > Task :smack-omemo:copyJavadocDocFiles NO-SOURCE
11-Nov-2024 22:39:28 > Task :smack-omemo:checkstyleTest
11-Nov-2024 22:39:33 > Task :smack-omemo:javadoc
11-Nov-2024 22:39:41 > Task :smack-omemo:test
11-Nov-2024 22:39:41 > Task :smack-omemo:check
11-Nov-2024 22:39:41 > Task :smack-omemo:build
11-Nov-2024 22:39:41 > Task :smack-omemo-signal:assemble
11-Nov-2024 22:39:42 > Task :smack-omemo-signal:animalsnifferMain
11-Nov-2024 22:39:42 > Task :smack-omemo-signal:compileTestFixturesJava NO-SOURCE
11-Nov-2024 22:39:42 > Task :smack-omemo-signal:checkstyleMain
11-Nov-2024 22:39:45 > Task :smack-omemo-signal:compileTestJava
11-Nov-2024 22:39:45 > Task :smack-omemo-signal:processTestResources NO-SOURCE
11-Nov-2024 22:39:45 > Task :smack-omemo-signal:testClasses
11-Nov-2024 22:39:45 > Task :smack-omemo-signal:processTestFixturesResources NO-SOURCE
11-Nov-2024 22:39:45 > Task :smack-omemo-signal:testFixturesClasses UP-TO-DATE
11-Nov-2024 22:39:45 > Task :smack-omemo-signal:checkstyleTestFixtures NO-SOURCE
11-Nov-2024 22:39:45 > Task :smack-omemo-signal:testFixturesJar
11-Nov-2024 22:39:45 > Task :smack-omemo-signal:copyJavadocDocFiles NO-SOURCE
11-Nov-2024 22:39:45 > Task :smack-omemo-signal:checkstyleTest
11-Nov-2024 22:39:48 > Task :smack-omemo-signal:javadoc
11-Nov-2024 22:39:55 > Task :smack-omemo-signal:test
11-Nov-2024 22:39:55 > Task :smack-omemo-signal:check
11-Nov-2024 22:39:55 > Task :smack-omemo-signal:build
11-Nov-2024 22:39:57 > Task :smack-omemo-signal-integration-test:compileJava
11-Nov-2024 22:39:57 > Task :smack-omemo-signal-integration-test:processResources NO-SOURCE
11-Nov-2024 22:39:57 > Task :smack-omemo-signal-integration-test:classes
11-Nov-2024 22:39:57 > Task :smack-omemo-signal-integration-test:jar
11-Nov-2024 22:39:57 > Task :smack-omemo-signal-integration-test:startScripts
11-Nov-2024 22:39:58 > Task :smack-omemo-signal-integration-test:distTar
11-Nov-2024 22:39:59 > Task :smack-omemo-signal-integration-test:distZip
11-Nov-2024 22:39:59 > Task :smack-omemo-signal-integration-test:assemble
11-Nov-2024 22:39:59 > Task :smack-omemo-signal-integration-test:compileTestFixturesJava NO-SOURCE
11-Nov-2024 22:39:59 > Task :smack-omemo-signal-integration-test:compileTestJava NO-SOURCE
11-Nov-2024 22:39:59 > Task :smack-omemo-signal-integration-test:processTestResources NO-SOURCE
11-Nov-2024 22:39:59 > Task :smack-omemo-signal-integration-test:testClasses UP-TO-DATE
11-Nov-2024 22:39:59 > Task :smack-omemo-signal-integration-test:checkstyleTest NO-SOURCE
11-Nov-2024 22:39:59 > Task :smack-omemo-signal-integration-test:processTestFixturesResources NO-SOURCE
11-Nov-2024 22:39:59 > Task :smack-omemo-signal-integration-test:testFixturesClasses UP-TO-DATE
11-Nov-2024 22:39:59 > Task :smack-omemo-signal-integration-test:checkstyleTestFixtures NO-SOURCE
11-Nov-2024 22:39:59 > Task :smack-omemo-signal-integration-test:testFixturesJar
11-Nov-2024 22:39:59 > Task :smack-omemo-signal-integration-test:copyJavadocDocFiles NO-SOURCE
11-Nov-2024 22:40:00 > Task :smack-omemo-signal-integration-test:checkstyleMain
11-Nov-2024 22:40:02 > Task :smack-omemo-signal-integration-test:javadoc
11-Nov-2024 22:40:02 > Task :smack-omemo-signal-integration-test:test NO-SOURCE
11-Nov-2024 22:40:02 > Task :smack-omemo-signal-integration-test:check
11-Nov-2024 22:40:02 > Task :smack-omemo-signal-integration-test:build
11-Nov-2024 22:40:02 > Task :smack-openpgp:assemble
11-Nov-2024 22:40:03 > Task :smack-openpgp:animalsnifferMain
11-Nov-2024 22:40:03 > Task :smack-openpgp:compileTestFixturesJava NO-SOURCE
11-Nov-2024 22:40:05 > Task :smack-openpgp:checkstyleMain
11-Nov-2024 22:40:07 > Task :smack-openpgp:compileTestJava
11-Nov-2024 22:40:07 > Task :smack-openpgp:processTestResources
11-Nov-2024 22:40:07 > Task :smack-openpgp:testClasses
11-Nov-2024 22:40:07 > Task :smack-openpgp:processTestFixturesResources NO-SOURCE
11-Nov-2024 22:40:07 > Task :smack-openpgp:testFixturesClasses UP-TO-DATE
11-Nov-2024 22:40:07 > Task :smack-openpgp:checkstyleTestFixtures NO-SOURCE
11-Nov-2024 22:40:07 > Task :smack-openpgp:testFixturesJar
11-Nov-2024 22:40:07 > Task :smack-openpgp:copyJavadocDocFiles NO-SOURCE
11-Nov-2024 22:40:08 > Task :smack-openpgp:checkstyleTest
11-Nov-2024 22:40:13 > Task :smack-openpgp:javadoc
11-Nov-2024 22:40:23
11-Nov-2024 22:40:23 > Task :smack-openpgp:test
11-Nov-2024 22:40:23
11-Nov-2024 22:40:23 SecretKeyBackupHelperTest > createAndDecryptSecretKeyElementTest() FAILED
11-Nov-2024 22:40:23     java.io.FileNotFoundException: /tmp/ox_secret_keys/alice%40wonderland.lit/secring.skr (Permission denied)
11-Nov-2024 22:40:23         at java.base/java.io.FileOutputStream.open0(Native Method)
11-Nov-2024 22:40:23         at java.base/java.io.FileOutputStream.open(FileOutputStream.java:293)
11-Nov-2024 22:40:23         at java.base/java.io.FileOutputStream.<init>(FileOutputStream.java:235)
11-Nov-2024 22:40:23         at java.base/java.io.FileOutputStream.<init>(FileOutputStream.java:184)
11-Nov-2024 22:40:23         at org.jivesoftware.smack.util.FileUtils.prepareFileOutputStream(FileUtils.java:192)
11-Nov-2024 22:40:23         at org.jivesoftware.smackx.ox.store.filebased.FileBasedOpenPgpKeyStore.writeSecretKeysOf(FileBasedOpenPgpKeyStore.java:95)
11-Nov-2024 22:40:23         at org.jivesoftware.smackx.ox.store.abstr.AbstractOpenPgpKeyStore.importSecretKey(AbstractOpenPgpKeyStore.java:174)
11-Nov-2024 22:40:23         at org.jivesoftware.smackx.ox.store.abstr.AbstractOpenPgpStore.importSecretKey(AbstractOpenPgpStore.java:131)
11-Nov-2024 22:40:23         at org.jivesoftware.smackx.ox.SecretKeyBackupHelperTest.createAndDecryptSecretKeyElementTest(SecretKeyBackupHelperTest.java:84)
11-Nov-2024 22:40:25
11-Nov-2024 22:40:25 29 tests completed, 1 failed
11-Nov-2024 22:40:25
11-Nov-2024 22:40:25 > Task :smack-openpgp:test FAILED
11-Nov-2024 22:40:25
11-Nov-2024 22:40:25 FAILURE: Build failed with an exception.
11-Nov-2024 22:40:25
11-Nov-2024 22:40:25 * What went wrong:
11-Nov-2024 22:40:25 Execution failed for task ':smack-openpgp:test'.
11-Nov-2024 22:40:25 > There were failing tests. See the report at: file:///home/bamboo-agent2/bamboo-agent-home/xml-data/build-dir/SMACK-CIMASTER-JOB1/smack-openpgp/build/reports/tests/test/index.html
11-Nov-2024 22:40:25
11-Nov-2024 22:40:25 * Try:
11-Nov-2024 22:40:25 > Run with --scan to get full insights.
11-Nov-2024 22:40:25
11-Nov-2024 22:40:25 * Exception is:
11-Nov-2024 22:40:25 org.gradle.api.tasks.TaskExecutionException: Execution failed for task ':smack-openpgp:test'.
11-Nov-2024 22:40:25         at org.gradle.api.internal.tasks.execution.ExecuteActionsTaskExecuter.lambda$executeIfValid$1(ExecuteActionsTaskExecuter.java:130)
11-Nov-2024 22:40:25         at org.gradle.internal.Try$Failure.ifSuccessfulOrElse(Try.java:293)
11-Nov-2024 22:40:25         at org.gradle.api.internal.tasks.execution.ExecuteActionsTaskExecuter.executeIfValid(ExecuteActionsTaskExecuter.java:128)
11-Nov-2024 22:40:25         at org.gradle.api.internal.tasks.execution.ExecuteActionsTaskExecuter.execute(ExecuteActionsTaskExecuter.java:116)
11-Nov-2024 22:40:25         at org.gradle.api.internal.tasks.execution.FinalizePropertiesTaskExecuter.execute(FinalizePropertiesTaskExecuter.java:46)
11-Nov-2024 22:40:25         at org.gradle.api.internal.tasks.execution.ResolveTaskExecutionModeExecuter.execute(ResolveTaskExecutionModeExecuter.java:51)
11-Nov-2024 22:40:25         at org.gradle.api.internal.tasks.execution.SkipTaskWithNoActionsExecuter.execute(SkipTaskWithNoActionsExecuter.java:57)
11-Nov-2024 22:40:25         at org.gradle.api.internal.tasks.execution.SkipOnlyIfTaskExecuter.execute(SkipOnlyIfTaskExecuter.java:74)
11-Nov-2024 22:40:25         at org.gradle.api.internal.tasks.execution.CatchExceptionTaskExecuter.execute(CatchExceptionTaskExecuter.java:36)
11-Nov-2024 22:40:25         at org.gradle.api.internal.tasks.execution.EventFiringTaskExecuter$1.executeTask(EventFiringTaskExecuter.java:77)
11-Nov-2024 22:40:25         at org.gradle.api.internal.tasks.execution.EventFiringTaskExecuter$1.call(EventFiringTaskExecuter.java:55)
11-Nov-2024 22:40:25         at org.gradle.api.internal.tasks.execution.EventFiringTaskExecuter$1.call(EventFiringTaskExecuter.java:52)
11-Nov-2024 22:40:25         at org.gradle.internal.operations.DefaultBuildOperationRunner$CallableBuildOperationWorker.execute(DefaultBuildOperationRunner.java:209)
11-Nov-2024 22:40:25         at org.gradle.internal.operations.DefaultBuildOperationRunner$CallableBuildOperationWorker.execute(DefaultBuildOperationRunner.java:204)
11-Nov-2024 22:40:25         at org.gradle.internal.operations.DefaultBuildOperationRunner$2.execute(DefaultBuildOperationRunner.java:66)
11-Nov-2024 22:40:25         at org.gradle.internal.operations.DefaultBuildOperationRunner$2.execute(DefaultBuildOperationRunner.java:59)
11-Nov-2024 22:40:25         at org.gradle.internal.operations.DefaultBuildOperationRunner.execute(DefaultBuildOperationRunner.java:166)
11-Nov-2024 22:40:25         at org.gradle.internal.operations.DefaultBuildOperationRunner.execute(DefaultBuildOperationRunner.java:59)
11-Nov-2024 22:40:25         at org.gradle.internal.operations.DefaultBuildOperationRunner.call(DefaultBuildOperationRunner.java:53)
11-Nov-2024 22:40:25         at org.gradle.api.internal.tasks.execution.EventFiringTaskExecuter.execute(EventFiringTaskExecuter.java:52)
11-Nov-2024 22:40:25         at org.gradle.execution.plan.LocalTaskNodeExecutor.execute(LocalTaskNodeExecutor.java:42)
11-Nov-2024 22:40:25         at org.gradle.execution.taskgraph.DefaultTaskExecutionGraph$InvokeNodeExecutorsAction.execute(DefaultTaskExecutionGraph.java:331)
11-Nov-2024 22:40:25         at org.gradle.execution.taskgraph.DefaultTaskExecutionGraph$InvokeNodeExecutorsAction.execute(DefaultTaskExecutionGraph.java:318)
11-Nov-2024 22:40:25         at org.gradle.execution.taskgraph.DefaultTaskExecutionGraph$BuildOperationAwareExecutionAction.lambda$execute$0(DefaultTaskExecutionGraph.java:314)
11-Nov-2024 22:40:25         at org.gradle.internal.operations.CurrentBuildOperationRef.with(CurrentBuildOperationRef.java:85)
11-Nov-2024 22:40:25         at org.gradle.execution.taskgraph.DefaultTaskExecutionGraph$BuildOperationAwareExecutionAction.execute(DefaultTaskExecutionGraph.java:314)
11-Nov-2024 22:40:25         at org.gradle.execution.taskgraph.DefaultTaskExecutionGraph$BuildOperationAwareExecutionAction.execute(DefaultTaskExecutionGraph.java:303)
11-Nov-2024 22:40:25         at org.gradle.execution.plan.DefaultPlanExecutor$ExecutorWorker.execute(DefaultPlanExecutor.java:459)
11-Nov-2024 22:40:25         at org.gradle.execution.plan.DefaultPlanExecutor$ExecutorWorker.run(DefaultPlanExecutor.java:376)
11-Nov-2024 22:40:25         at org.gradle.internal.concurrent.ExecutorPolicy$CatchAndRecordFailures.onExecute(ExecutorPolicy.java:64)
11-Nov-2024 22:40:25         at org.gradle.internal.concurrent.AbstractManagedExecutor$1.run(AbstractManagedExecutor.java:48)
11-Nov-2024 22:40:25 Caused by: org.gradle.api.internal.exceptions.MarkedVerificationException: There were failing tests. See the report at: file:///home/bamboo-agent2/bamboo-agent-home/xml-data/build-dir/SMACK-CIMASTER-JOB1/smack-openpgp/build/reports/tests/test/index.html
11-Nov-2024 22:40:25         at org.gradle.api.tasks.testing.AbstractTestTask.handleTestFailures(AbstractTestTask.java:706)
11-Nov-2024 22:40:25         at org.gradle.api.tasks.testing.AbstractTestTask.handleCollectedResults(AbstractTestTask.java:540)
11-Nov-2024 22:40:25         at org.gradle.api.tasks.testing.AbstractTestTask.executeTests(AbstractTestTask.java:535)
11-Nov-2024 22:40:25         at org.gradle.api.tasks.testing.Test.executeTests(Test.java:731)
11-Nov-2024 22:40:25         at java.base/jdk.internal.reflect.NativeMethodAccessorImpl.invoke0(Native Method)
11-Nov-2024 22:40:25         at java.base/jdk.internal.reflect.NativeMethodAccessorImpl.invoke(NativeMethodAccessorImpl.java:77)
11-Nov-2024 22:40:25         at java.base/jdk.internal.reflect.DelegatingMethodAccessorImpl.invoke(DelegatingMethodAccessorImpl.java:43)
11-Nov-2024 22:40:25         at org.gradle.internal.reflect.JavaMethod.invoke(JavaMethod.java:125)
11-Nov-2024 22:40:25         at org.gradle.api.internal.project.taskfactory.StandardTaskAction.doExecute(StandardTaskAction.java:58)
11-Nov-2024 22:40:25         at org.gradle.api.internal.project.taskfactory.StandardTaskAction.execute(StandardTaskAction.java:51)
11-Nov-2024 22:40:25         at org.gradle.api.internal.project.taskfactory.StandardTaskAction.execute(StandardTaskAction.java:29)
11-Nov-2024 22:40:25         at org.gradle.api.internal.tasks.execution.TaskExecution$3.run(TaskExecution.java:244)
11-Nov-2024 22:40:25         at org.gradle.internal.operations.DefaultBuildOperationRunner$1.execute(DefaultBuildOperationRunner.java:29)
11-Nov-2024 22:40:25         at org.gradle.internal.operations.DefaultBuildOperationRunner$1.execute(DefaultBuildOperationRunner.java:26)
11-Nov-2024 22:40:25         at org.gradle.internal.operations.DefaultBuildOperationRunner$2.execute(DefaultBuildOperationRunner.java:66)
11-Nov-2024 22:40:25         at org.gradle.internal.operations.DefaultBuildOperationRunner$2.execute(DefaultBuildOperationRunner.java:59)
11-Nov-2024 22:40:25         at org.gradle.internal.operations.DefaultBuildOperationRunner.execute(DefaultBuildOperationRunner.java:166)
11-Nov-2024 22:40:25         at org.gradle.internal.operations.DefaultBuildOperationRunner.execute(DefaultBuildOperationRunner.java:59)
11-Nov-2024 22:40:25         at org.gradle.internal.operations.DefaultBuildOperationRunner.run(DefaultBuildOperationRunner.java:47)
11-Nov-2024 22:40:25         at org.gradle.api.internal.tasks.execution.TaskExecution.executeAction(TaskExecution.java:229)
11-Nov-2024 22:40:25         at org.gradle.api.internal.tasks.execution.TaskExecution.executeActions(TaskExecution.java:212)
11-Nov-2024 22:40:25         at org.gradle.api.internal.tasks.execution.TaskExecution.executeWithPreviousOutputFiles(TaskExecution.java:195)
11-Nov-2024 22:40:25         at org.gradle.api.internal.tasks.execution.TaskExecution.execute(TaskExecution.java:162)
11-Nov-2024 22:40:25         at org.gradle.internal.execution.steps.ExecuteStep.executeInternal(ExecuteStep.java:105)
11-Nov-2024 22:40:25         at org.gradle.internal.execution.steps.ExecuteStep.access$000(ExecuteStep.java:44)
11-Nov-2024 22:40:25         at org.gradle.internal.execution.steps.ExecuteStep$1.call(ExecuteStep.java:59)
11-Nov-2024 22:40:25         at org.gradle.internal.execution.steps.ExecuteStep$1.call(ExecuteStep.java:56)
11-Nov-2024 22:40:25         at org.gradle.internal.operations.DefaultBuildOperationRunner$CallableBuildOperationWorker.execute(DefaultBuildOperationRunner.java:209)
11-Nov-2024 22:40:25         at org.gradle.internal.operations.DefaultBuildOperationRunner$CallableBuildOperationWorker.execute(DefaultBuildOperationRunner.java:204)
11-Nov-2024 22:40:25         at org.gradle.internal.operations.DefaultBuildOperationRunner$2.execute(DefaultBuildOperationRunner.java:66)
11-Nov-2024 22:40:25         at org.gradle.internal.operations.DefaultBuildOperationRunner$2.execute(DefaultBuildOperationRunner.java:59)
11-Nov-2024 22:40:25         at org.gradle.internal.operations.DefaultBuildOperationRunner.execute(DefaultBuildOperationRunner.java:166)
11-Nov-2024 22:40:25         at org.gradle.internal.operations.DefaultBuildOperationRunner.execute(DefaultBuildOperationRunner.java:59)
11-Nov-2024 22:40:25         at org.gradle.internal.operations.DefaultBuildOperationRunner.call(DefaultBuildOperationRunner.java:53)
11-Nov-2024 22:40:25         at org.gradle.internal.execution.steps.ExecuteStep.execute(ExecuteStep.java:56)
11-Nov-2024 22:40:25         at org.gradle.internal.execution.steps.ExecuteStep.execute(ExecuteStep.java:44)
11-Nov-2024 22:40:25         at org.gradle.internal.execution.steps.CancelExecutionStep.execute(CancelExecutionStep.java:42)
11-Nov-2024 22:40:25         at org.gradle.internal.execution.steps.TimeoutStep.executeWithoutTimeout(TimeoutStep.java:75)
11-Nov-2024 22:40:25         at org.gradle.internal.execution.steps.TimeoutStep.execute(TimeoutStep.java:55)
11-Nov-2024 22:40:25         at org.gradle.internal.execution.steps.PreCreateOutputParentsStep.execute(PreCreateOutputParentsStep.java:50)
11-Nov-2024 22:40:25         at org.gradle.internal.execution.steps.PreCreateOutputParentsStep.execute(PreCreateOutputParentsStep.java:28)
11-Nov-2024 22:40:25         at org.gradle.internal.execution.steps.RemovePreviousOutputsStep.execute(RemovePreviousOutputsStep.java:67)
11-Nov-2024 22:40:25         at org.gradle.internal.execution.steps.RemovePreviousOutputsStep.execute(RemovePreviousOutputsStep.java:37)
11-Nov-2024 22:40:25         at org.gradle.internal.execution.steps.BroadcastChangingOutputsStep.execute(BroadcastChangingOutputsStep.java:61)
11-Nov-2024 22:40:25         at org.gradle.internal.execution.steps.BroadcastChangingOutputsStep.execute(BroadcastChangingOutputsStep.java:26)
11-Nov-2024 22:40:25         at org.gradle.internal.execution.steps.CaptureOutputsAfterExecutionStep.execute(CaptureOutputsAfterExecutionStep.java:69)
11-Nov-2024 22:40:25         at org.gradle.internal.execution.steps.CaptureOutputsAfterExecutionStep.execute(CaptureOutputsAfterExecutionStep.java:46)
11-Nov-2024 22:40:25         at org.gradle.internal.execution.steps.ResolveInputChangesStep.execute(ResolveInputChangesStep.java:40)
11-Nov-2024 22:40:25         at org.gradle.internal.execution.steps.ResolveInputChangesStep.execute(ResolveInputChangesStep.java:29)
11-Nov-2024 22:40:25         at org.gradle.internal.execution.steps.BuildCacheStep.executeWithoutCache(BuildCacheStep.java:189)
11-Nov-2024 22:40:25         at org.gradle.internal.execution.steps.BuildCacheStep.lambda$execute$1(BuildCacheStep.java:75)
11-Nov-2024 22:40:25         at org.gradle.internal.Either$Right.fold(Either.java:175)
11-Nov-2024 22:40:25         at org.gradle.internal.execution.caching.CachingState.fold(CachingState.java:62)
11-Nov-2024 22:40:25         at org.gradle.internal.execution.steps.BuildCacheStep.execute(BuildCacheStep.java:73)
11-Nov-2024 22:40:25         at org.gradle.internal.execution.steps.BuildCacheStep.execute(BuildCacheStep.java:48)
11-Nov-2024 22:40:25         at org.gradle.internal.execution.steps.StoreExecutionStateStep.execute(StoreExecutionStateStep.java:46)
11-Nov-2024 22:40:25         at org.gradle.internal.execution.steps.StoreExecutionStateStep.execute(StoreExecutionStateStep.java:35)
11-Nov-2024 22:40:25         at org.gradle.internal.execution.steps.SkipUpToDateStep.executeBecause(SkipUpToDateStep.java:75)
11-Nov-2024 22:40:25         at org.gradle.internal.execution.steps.SkipUpToDateStep.lambda$execute$2(SkipUpToDateStep.java:53)
11-Nov-2024 22:40:25         at org.gradle.internal.execution.steps.SkipUpToDateStep.execute(SkipUpToDateStep.java:53)
11-Nov-2024 22:40:25         at org.gradle.internal.execution.steps.SkipUpToDateStep.execute(SkipUpToDateStep.java:35)
11-Nov-2024 22:40:25         at org.gradle.internal.execution.steps.legacy.MarkSnapshottingInputsFinishedStep.execute(MarkSnapshottingInputsFinishedStep.java:37)
11-Nov-2024 22:40:25         at org.gradle.internal.execution.steps.legacy.MarkSnapshottingInputsFinishedStep.execute(MarkSnapshottingInputsFinishedStep.java:27)
11-Nov-2024 22:40:25         at org.gradle.internal.execution.steps.ResolveIncrementalCachingStateStep.executeDelegate(ResolveIncrementalCachingStateStep.java:49)
11-Nov-2024 22:40:25         at org.gradle.internal.execution.steps.ResolveIncrementalCachingStateStep.executeDelegate(ResolveIncrementalCachingStateStep.java:27)
11-Nov-2024 22:40:25         at org.gradle.internal.execution.steps.AbstractResolveCachingStateStep.execute(AbstractResolveCachingStateStep.java:71)
11-Nov-2024 22:40:25         at org.gradle.internal.execution.steps.AbstractResolveCachingStateStep.execute(AbstractResolveCachingStateStep.java:39)
11-Nov-2024 22:40:25         at org.gradle.internal.execution.steps.ResolveChangesStep.execute(ResolveChangesStep.java:65)
11-Nov-2024 22:40:25         at org.gradle.internal.execution.steps.ResolveChangesStep.execute(ResolveChangesStep.java:36)
11-Nov-2024 22:40:25         at org.gradle.internal.execution.steps.ValidateStep.execute(ValidateStep.java:107)
11-Nov-2024 22:40:25         at org.gradle.internal.execution.steps.ValidateStep.execute(ValidateStep.java:56)
11-Nov-2024 22:40:25         at org.gradle.internal.execution.steps.AbstractCaptureStateBeforeExecutionStep.execute(AbstractCaptureStateBeforeExecutionStep.java:64)
11-Nov-2024 22:40:25         at org.gradle.internal.execution.steps.AbstractCaptureStateBeforeExecutionStep.execute(AbstractCaptureStateBeforeExecutionStep.java:43)
11-Nov-2024 22:40:25         at org.gradle.internal.execution.steps.AbstractSkipEmptyWorkStep.executeWithNonEmptySources(AbstractSkipEmptyWorkStep.java:125)
11-Nov-2024 22:40:25         at org.gradle.internal.execution.steps.AbstractSkipEmptyWorkStep.execute(AbstractSkipEmptyWorkStep.java:61)
11-Nov-2024 22:40:25         at org.gradle.internal.execution.steps.AbstractSkipEmptyWorkStep.execute(AbstractSkipEmptyWorkStep.java:36)
11-Nov-2024 22:40:25         at org.gradle.internal.execution.steps.legacy.MarkSnapshottingInputsStartedStep.execute(MarkSnapshottingInputsStartedStep.java:38)
11-Nov-2024 22:40:25         at org.gradle.internal.execution.steps.LoadPreviousExecutionStateStep.execute(LoadPreviousExecutionStateStep.java:36)
11-Nov-2024 22:40:25         at org.gradle.internal.execution.steps.LoadPreviousExecutionStateStep.execute(LoadPreviousExecutionStateStep.java:23)
11-Nov-2024 22:40:25         at org.gradle.internal.execution.steps.HandleStaleOutputsStep.execute(HandleStaleOutputsStep.java:75)
11-Nov-2024 22:40:25         at org.gradle.internal.execution.steps.HandleStaleOutputsStep.execute(HandleStaleOutputsStep.java:41)
11-Nov-2024 22:40:25         at org.gradle.internal.execution.steps.AssignMutableWorkspaceStep.lambda$execute$0(AssignMutableWorkspaceStep.java:35)
11-Nov-2024 22:40:25         at org.gradle.api.internal.tasks.execution.TaskExecution$4.withWorkspace(TaskExecution.java:289)
11-Nov-2024 22:40:25         at org.gradle.internal.execution.steps.AssignMutableWorkspaceStep.execute(AssignMutableWorkspaceStep.java:31)
11-Nov-2024 22:40:25         at org.gradle.internal.execution.steps.AssignMutableWorkspaceStep.execute(AssignMutableWorkspaceStep.java:22)
11-Nov-2024 22:40:25         at org.gradle.internal.execution.steps.ChoosePipelineStep.execute(ChoosePipelineStep.java:40)
11-Nov-2024 22:40:25         at org.gradle.internal.execution.steps.ChoosePipelineStep.execute(ChoosePipelineStep.java:23)
11-Nov-2024 22:40:25         at org.gradle.internal.execution.steps.ExecuteWorkBuildOperationFiringStep.lambda$execute$2(ExecuteWorkBuildOperationFiringStep.java:67)
11-Nov-2024 22:40:25         at org.gradle.internal.execution.steps.ExecuteWorkBuildOperationFiringStep.execute(ExecuteWorkBuildOperationFiringStep.java:67)
11-Nov-2024 22:40:25         at org.gradle.internal.execution.steps.ExecuteWorkBuildOperationFiringStep.execute(ExecuteWorkBuildOperationFiringStep.java:39)
11-Nov-2024 22:40:25         at org.gradle.internal.execution.steps.IdentityCacheStep.execute(IdentityCacheStep.java:46)
11-Nov-2024 22:40:25         at org.gradle.internal.execution.steps.IdentityCacheStep.execute(IdentityCacheStep.java:34)
11-Nov-2024 22:40:25         at org.gradle.internal.execution.steps.IdentifyStep.execute(IdentifyStep.java:48)
11-Nov-2024 22:40:25         at org.gradle.internal.execution.steps.IdentifyStep.execute(IdentifyStep.java:35)
11-Nov-2024 22:40:25         at org.gradle.internal.execution.impl.DefaultExecutionEngine$1.execute(DefaultExecutionEngine.java:61)
11-Nov-2024 22:40:25         at org.gradle.api.internal.tasks.execution.ExecuteActionsTaskExecuter.executeIfValid(ExecuteActionsTaskExecuter.java:127)
11-Nov-2024 22:40:25         at org.gradle.api.internal.tasks.execution.ExecuteActionsTaskExecuter.execute(ExecuteActionsTaskExecuter.java:116)
11-Nov-2024 22:40:25         at org.gradle.api.internal.tasks.execution.FinalizePropertiesTaskExecuter.execute(FinalizePropertiesTaskExecuter.java:46)
11-Nov-2024 22:40:25         at org.gradle.api.internal.tasks.execution.ResolveTaskExecutionModeExecuter.execute(ResolveTaskExecutionModeExecuter.java:51)
11-Nov-2024 22:40:25         at org.gradle.api.internal.tasks.execution.SkipTaskWithNoActionsExecuter.execute(SkipTaskWithNoActionsExecuter.java:57)
11-Nov-2024 22:40:25         at org.gradle.api.internal.tasks.execution.SkipOnlyIfTaskExecuter.execute(SkipOnlyIfTaskExecuter.java:74)
11-Nov-2024 22:40:25         at org.gradle.api.internal.tasks.execution.CatchExceptionTaskExecuter.execute(CatchExceptionTaskExecuter.java:36)
11-Nov-2024 22:40:25         at org.gradle.api.internal.tasks.execution.EventFiringTaskExecuter$1.executeTask(EventFiringTaskExecuter.java:77)
11-Nov-2024 22:40:25         at org.gradle.api.internal.tasks.execution.EventFiringTaskExecuter$1.call(EventFiringTaskExecuter.java:55)
11-Nov-2024 22:40:25         at org.gradle.api.internal.tasks.execution.EventFiringTaskExecuter$1.call(EventFiringTaskExecuter.java:52)
11-Nov-2024 22:40:25         at org.gradle.internal.operations.DefaultBuildOperationRunner$CallableBuildOperationWorker.execute(DefaultBuildOperationRunner.java:209)
11-Nov-2024 22:40:25         at org.gradle.internal.operations.DefaultBuildOperationRunner$CallableBuildOperationWorker.execute(DefaultBuildOperationRunner.java:204)
11-Nov-2024 22:40:25         at org.gradle.internal.operations.DefaultBuildOperationRunner$2.execute(DefaultBuildOperationRunner.java:66)
11-Nov-2024 22:40:25         at org.gradle.internal.operations.DefaultBuildOperationRunner$2.execute(DefaultBuildOperationRunner.java:59)
11-Nov-2024 22:40:25         at org.gradle.internal.operations.DefaultBuildOperationRunner.execute(DefaultBuildOperationRunner.java:166)
11-Nov-2024 22:40:25         at org.gradle.internal.operations.DefaultBuildOperationRunner.execute(DefaultBuildOperationRunner.java:59)
11-Nov-2024 22:40:25         at org.gradle.internal.operations.DefaultBuildOperationRunner.call(DefaultBuildOperationRunner.java:53)
11-Nov-2024 22:40:25         at org.gradle.api.internal.tasks.execution.EventFiringTaskExecuter.execute(EventFiringTaskExecuter.java:52)
11-Nov-2024 22:40:25         at org.gradle.execution.plan.LocalTaskNodeExecutor.execute(LocalTaskNodeExecutor.java:42)
11-Nov-2024 22:40:25         at org.gradle.execution.taskgraph.DefaultTaskExecutionGraph$InvokeNodeExecutorsAction.execute(DefaultTaskExecutionGraph.java:331)
11-Nov-2024 22:40:25         at org.gradle.execution.taskgraph.DefaultTaskExecutionGraph$InvokeNodeExecutorsAction.execute(DefaultTaskExecutionGraph.java:318)
11-Nov-2024 22:40:25         at org.gradle.execution.taskgraph.DefaultTaskExecutionGraph$BuildOperationAwareExecutionAction.lambda$execute$0(DefaultTaskExecutionGraph.java:314)
11-Nov-2024 22:40:25         at org.gradle.internal.operations.CurrentBuildOperationRef.with(CurrentBuildOperationRef.java:85)
11-Nov-2024 22:40:25         at org.gradle.execution.taskgraph.DefaultTaskExecutionGraph$BuildOperationAwareExecutionAction.execute(DefaultTaskExecutionGraph.java:314)
11-Nov-2024 22:40:25         at org.gradle.execution.taskgraph.DefaultTaskExecutionGraph$BuildOperationAwareExecutionAction.execute(DefaultTaskExecutionGraph.java:303)
11-Nov-2024 22:40:25         at org.gradle.execution.plan.DefaultPlanExecutor$ExecutorWorker.execute(DefaultPlanExecutor.java:459)
11-Nov-2024 22:40:25         at org.gradle.execution.plan.DefaultPlanExecutor$ExecutorWorker.run(DefaultPlanExecutor.java:376)
11-Nov-2024 22:40:25
11-Nov-2024 22:40:25 Deprecated Gradle features were used in this build, making it incompatible with Gradle 9.0.
11-Nov-2024 22:40:25
11-Nov-2024 22:40:25 You can use '--warning-mode all' to show the individual deprecation warnings and determine if they come from your own scripts or plugins.
11-Nov-2024 22:40:25
11-Nov-2024 22:40:25         at org.gradle.internal.concurrent.ExecutorPolicy$CatchAndRecordFailures.onExecute(ExecutorPolicy.java:64)
11-Nov-2024 22:40:25         at org.gradle.internal.concurrent.AbstractManagedExecutor$1.run(AbstractManagedExecutor.java:48)
11-Nov-2024 22:40:25 For more on this, please refer to https://docs.gradle.org/8.10.2/userguide/command_line_interface.html#sec:command_line_warnings in the Gradle documentation.
11-Nov-2024 22:40:25
11-Nov-2024 22:40:25 240 actionable tasks: 205 executed, 35 up-to-date
11-Nov-2024 22:40:25
11-Nov-2024 22:40:25 BUILD FAILED in 7m 49s
11-Nov-2024 22:40:26 Failing task since return code of [/home/bamboo-agent2/bamboo-agent-home/temp/SMACK-CIMASTER-JOB1-1026-ScriptBuildTask-5530992825341154569.sh] was 1 while expected 0
11-Nov-2024 22:40:26 Finished task 'Build using the project-provided Gradle wrapper' with result: Failed
11-Nov-2024 22:40:26 Running post build plugin 'Docker Container Cleanup'
11-Nov-2024 22:40:26 Running post build plugin 'NCover Results Collector'
11-Nov-2024 22:40:26 Running post build plugin 'Build Results Label Collector'
11-Nov-2024 22:40:26 Running post build plugin 'Clover Results Collector'
11-Nov-2024 22:40:26 Running post build plugin 'npm Cache Cleanup'
11-Nov-2024 22:40:26 Running post build plugin 'Artifact Copier'
11-Nov-2024 22:40:26 Publishing an artifact: Smack builds
11-Nov-2024 22:40:30 Finished publishing of artifact Non required job artifact Http Compression On : [Smack builds], patterns: [**/build/libs/*.jar] in 3.353 s
11-Nov-2024 22:40:30 Finalising the build...
11-Nov-2024 22:40:30 Stopping timer.
11-Nov-2024 22:40:30 Build SMACK-CIMASTER-JOB1-1026 completed.
12-Nov-2024 04:40:31 Running on server: post build plugin 'Build Hanging Detection Configuration'
12-Nov-2024 04:40:31 Running on server: post build plugin 'NCover Results Collector'
12-Nov-2024 04:40:31 Running on server: post build plugin 'Build Labeller'
12-Nov-2024 04:40:31 Running on server: post build plugin 'Clover Delta Calculator'
12-Nov-2024 04:40:31 Running on server: post build plugin 'Maven Dependencies Postprocessor'
12-Nov-2024 04:40:31 All post build plugins have finished
12-Nov-2024 04:40:31 Generating build results summary...
12-Nov-2024 04:40:31 Saving build results to disk...
12-Nov-2024 04:40:31 Store variable context...
12-Nov-2024 04:40:31 Finished building SMACK-CIMASTER-JOB1-1026.