Nightly Distribution of the master branch

Build: #1595 failed

Job: Default Job failed

Stages & jobs

  1. Default Stage

  2. Deploy

Build log

The build generated 197 lines of output. Download or view full build log

18-Jul-2018 01:00:01 Build Smack - Nightly Binary Distribution Build - Default Job #1595 (SMACK-NIGHTLY-JOB1-1595) started building on agent Default Agent
18-Jul-2018 01:00:01
18-Jul-2018 01:00:01 Build working directory is /var/atlassian/bamboo-home/xml-data/build-dir/SMACK-NIGHTLY-JOB1
18-Jul-2018 01:00:01 Executing build Smack - Nightly Binary Distribution Build - Default Job #1595 (SMACK-NIGHTLY-JOB1-1595)
18-Jul-2018 01:00:01 Starting task 'Checkout Default Repository' of type 'com.atlassian.bamboo.plugins.vcs:task.vcs.checkout'
18-Jul-2018 01:00:01 Checking out into /var/atlassian/bamboo-home/xml-data/build-dir/SMACK-NIGHTLY-JOB1
18-Jul-2018 01:00:01 Updating source code to revision: cf2b3ef63417d13e6a898ca37cbb5ac17e3e4866
18-Jul-2018 01:00:01 Fetching 'refs/heads/master' from 'https://github.com/igniterealtime/Smack.git'.
18-Jul-2018 01:00:03 Checking out revision cf2b3ef63417d13e6a898ca37cbb5ac17e3e4866.
18-Jul-2018 01:00:03 From file:///var/atlassian/bamboo-home/xml-data/build-dir/_git-repositories-cache/47a8451c7dd41a75aeccbfabacda90372f436d0d
18-Jul-2018 01:00:03    8011ba96..cf2b3ef6  master     -> origin/master
18-Jul-2018 01:00:03    78a5f508..0ffc29aa  4.3        -> origin/4.3
18-Jul-2018 01:00:03 Already on 'master'
18-Jul-2018 01:00:03 Your branch is behind 'origin/master' by 2 commits, and can be fast-forwarded.
18-Jul-2018 01:00:03   (use "git pull" to update your local branch)
18-Jul-2018 01:00:03 HEAD is now at cf2b3ef6 Merge pull request #252 from vanitasvitae/requireNonNullOrEmpty
18-Jul-2018 01:00:03 Updated source code to revision: cf2b3ef63417d13e6a898ca37cbb5ac17e3e4866
18-Jul-2018 01:00:03 Finished task 'Checkout Default Repository' with result: Success
18-Jul-2018 01:00:03 Running pre-build action: VCS Version Collector
18-Jul-2018 01:00:03 Starting task 'Gradle distribution zip' of type 'com.atlassian.bamboo.plugins.scripttask:task.builder.command'
18-Jul-2018 01:00:03
Beginning to execute external process for build 'Smack - Nightly Binary Distribution Build - Default Job #1595 (SMACK-NIGHTLY-JOB1-1595)'
... running command line:
/opt/gradle/bin/gradle --stacktrace clean distributionZip javadocAll jacocoRootReport
... in: /var/atlassian/bamboo-home/xml-data/build-dir/SMACK-NIGHTLY-JOB1
... using extra environment variables:
bamboo_planRepository_1_branch=master
bamboo_capability_system_builder_mvn3_Maven_3_3_9=/opt/apache-maven-3.3.9
bamboo_planRepository_1_branchDisplayName=master
bamboo_repository_revision_number=cf2b3ef63417d13e6a898ca37cbb5ac17e3e4866
bamboo_capability_daily_xfer=
bamboo_resultsUrl=https://bamboo.igniterealtime.org/browse/SMACK-NIGHTLY-JOB1-1595
JAVA_OPTS=-XX:MaxPermSize=256M
bamboo_repository_39256079_git_branch=master
bamboo_build_working_directory=/var/atlassian/bamboo-home/xml-data/build-dir/SMACK-NIGHTLY-JOB1
bamboo_capability_system_builder_command_Gradle=/opt/gradle/bin/gradle
bamboo_planRepository_1_name=Smack (master)
bamboo_buildKey=SMACK-NIGHTLY-JOB1
bamboo_shortPlanName=Nightly Binary Distribution Build
bamboo_planRepository_name=Smack (master)
bamboo_capability_system_jdk_JDK_1_6_0_20=/opt/java/sdk/Sun/jdk1.6.0_20
bamboo_buildNumber=1595
bamboo_shortJobName=Default Job
bamboo_buildResultsUrl=https://bamboo.igniterealtime.org/browse/SMACK-NIGHTLY-JOB1-1595
bamboo_capability_system_builder_command_Gradle__Faketime_=/opt/gradle-faketime
bamboo_planRepository_repositoryUrl=https://github.com/igniterealtime/Smack.git
bamboo_repository_39256079_branch_name=master
bamboo_agentId=131073
bamboo_planName=Smack - Nightly Binary Distribution Build
bamboo_shortPlanKey=NIGHTLY
bamboo_shortJobKey=JOB1
bamboo_planRepository_revision=cf2b3ef63417d13e6a898ca37cbb5ac17e3e4866
bamboo_buildTimeStamp=2018-07-18T01:00:01.433Z
bamboo_repository_previous_revision_number=8011ba96bb79d246383008e819ef13228e1370cf
bamboo_capability_system_builder_mvn2_Maven_2=/opt/maven/apache-maven-2.2.1
bamboo_planRepository_previousRevision=8011ba96bb79d246383008e819ef13228e1370cf
bamboo_capability_rpm=
bamboo_capability_system_builder_ant_Ant_1_9_4=/opt/apache-ant-1.9.4
bamboo_repository_git_branch=master
bamboo_buildResultKey=SMACK-NIGHTLY-JOB1-1595
bamboo_repository_branch_name=master
bamboo_buildPlanName=Smack - Nightly Binary Distribution Build - Default Job
bamboo_capability_Install4j=6.0.4
bamboo_planRepository_1_revision=cf2b3ef63417d13e6a898ca37cbb5ac17e3e4866
bamboo_capability_system_builder_ant_Ant_1_7_1=/opt/apache-ant-1.7.1
bamboo_repository_name=Smack (master)
bamboo_repository_39256079_revision_number=cf2b3ef63417d13e6a898ca37cbb5ac17e3e4866
bamboo_capability_system_builder_mvn2_Maven_2_2_1=/opt/maven/apache-maven-2.2.1
bamboo_buildFailed=false
bamboo_planRepository_branch=master
bamboo_capability_system_jdk_JDK_1_7_0_51=/opt/java/sdk/1.7
bamboo_capability_system_builder_command_Bash=/bin/bash
bamboo_agentWorkingDirectory=/var/atlassian/bamboo-home/xml-data/build-dir
bamboo_capability_system_git_executable=/usr/bin/git
bamboo_repository_git_username=
bamboo_repository_39256079_previous_revision_number=8011ba96bb79d246383008e819ef13228e1370cf
bamboo_planRepository_1_previousRevision=8011ba96bb79d246383008e819ef13228e1370cf
bamboo_planRepository_branchDisplayName=master
bamboo_planRepository_1_type=gitv2
bamboo_repository_39256079_git_repositoryUrl=https://github.com/igniterealtime/Smack.git
bamboo_planRepository_branchName=master
bamboo_capability_flex_sdk=4.6
bamboo_repository_39256079_name=Smack (master)
bamboo_capability_system_builder_mvn3_Maven=/opt/maven
bamboo_capability_system_jdk_JDK=/opt/java/sdk/current
bamboo_capability_android=
bamboo_plan_storageTag=SMACK-NIGHTLY
bamboo_hg_cache_directory=/var/atlassian/bamboo-home/xml-data/build-dir/_hg-repositories-cache
bamboo_planRepository_1_username=
bamboo_planRepository_type=gitv2
bamboo_git_cache_directory=/var/atlassian/bamboo-home/xml-data/build-dir/_git-repositories-cache
bamboo_repository_git_repositoryUrl=https://github.com/igniterealtime/Smack.git
bamboo_capability_system_builder_ant_Ant=/opt/apache-ant-1.9.7
bamboo_tmp_directory=/var/atlassian/bamboo-home/temp
bamboo_working_directory=/var/atlassian/bamboo-home/xml-data/build-dir/SMACK-NIGHTLY-JOB1
bamboo_capability_faketime=
bamboo_planKey=SMACK-NIGHTLY
bamboo_planRepository_1_repositoryUrl=https://github.com/igniterealtime/Smack.git
bamboo_planRepository_username=
bamboo_capability_system_jdk_JDK_1_8=/opt/java/sdk/current
bamboo_capability_system_builder_ant_Ant_1_8_1=/opt/apache-ant-1.8.1
bamboo_capability_system_jdk_JDK_1_6=/opt/java/sdk/1.6
bamboo_repository_39256079_git_username=
bamboo_capability_system_jdk_JDK_1_7=/opt/java/sdk/1.7
bamboo_capability_system_builder_ant_Ant_1_6_5=/opt/apache-ant-1.6.5
bamboo_planRepository_1_branchName=master
18-Jul-2018 01:00:03 OpenJDK 64-Bit Server VM warning: ignoring option MaxPermSize=256M; support was removed in 8.0
18-Jul-2018 01:00:04 Starting a Gradle Daemon (subsequent builds will be faster)
18-Jul-2018 01:00:13 :clean
18-Jul-2018 01:00:13 :smack-android:clean
18-Jul-2018 01:00:13 :smack-android-extensions:clean
18-Jul-2018 01:00:13 :smack-bosh:clean
18-Jul-2018 01:00:13 :smack-compression-jzlib:clean
18-Jul-2018 01:00:13 :smack-core:clean
18-Jul-2018 01:00:13 :smack-debug:clean
18-Jul-2018 01:00:13 :smack-debug-slf4j:clean
18-Jul-2018 01:00:14 :smack-experimental:clean
18-Jul-2018 01:00:14 :smack-extensions:clean
18-Jul-2018 01:00:14 :smack-im:clean
18-Jul-2018 01:00:14 :smack-integration-test:clean
18-Jul-2018 01:00:14 :smack-java7:clean
18-Jul-2018 01:00:14 :smack-jingle-old:clean
18-Jul-2018 01:00:14 :smack-legacy:clean
18-Jul-2018 01:00:14 :smack-omemo:clean
18-Jul-2018 01:00:14 :smack-omemo-signal:clean
18-Jul-2018 01:00:14 :smack-omemo-signal-integration-test:clean
18-Jul-2018 01:00:14 :smack-repl:clean
18-Jul-2018 01:00:14 :smack-resolver-dnsjava:clean
18-Jul-2018 01:00:15 :smack-resolver-javax:clean
18-Jul-2018 01:00:15 :smack-resolver-minidns:clean
18-Jul-2018 01:00:15 :smack-sasl-javax:clean
18-Jul-2018 01:00:15 :smack-sasl-provided:clean
18-Jul-2018 01:00:15 :smack-tcp:clean
18-Jul-2018 01:00:15 :smack-core:createVersionResource
18-Jul-2018 01:00:21 :smack-core:compileJava
18-Jul-2018 01:00:21 :smack-core:processResources
18-Jul-2018 01:00:21 :smack-core:classes
18-Jul-2018 01:00:22 :smack-core:osgiClasses
18-Jul-2018 01:00:22 :smack-core:jar
18-Jul-2018 01:00:25 :smack-im:compileJava
18-Jul-2018 01:00:25 :smack-im:processResources
18-Jul-2018 01:00:25 :smack-im:classes
18-Jul-2018 01:00:25 :smack-im:osgiClasses
18-Jul-2018 01:00:25 :smack-im:jar
18-Jul-2018 01:00:26 :smack-resolver-minidns:compileJava
18-Jul-2018 01:00:26 :smack-resolver-minidns:processResources NO-SOURCE
18-Jul-2018 01:00:26 :smack-resolver-minidns:classes
18-Jul-2018 01:00:26 :smack-resolver-minidns:osgiClasses
18-Jul-2018 01:00:26 :smack-resolver-minidns:jar
18-Jul-2018 01:00:28 :smack-sasl-provided:compileJava
18-Jul-2018 01:00:28 :smack-sasl-provided:processResources NO-SOURCE
18-Jul-2018 01:00:28 :smack-sasl-provided:classes
18-Jul-2018 01:00:28 :smack-sasl-provided:osgiClasses
18-Jul-2018 01:00:28 :smack-sasl-provided:jar
18-Jul-2018 01:00:29 :smack-android:compileJava
18-Jul-2018 01:00:29 :smack-android:processResources NO-SOURCE
18-Jul-2018 01:00:29 :smack-android:classes
18-Jul-2018 01:00:29 :smack-android:osgiClasses
18-Jul-2018 01:00:29 :smack-android:jar
18-Jul-2018 01:00:37 :smack-bosh:compileJava
18-Jul-2018 01:00:37 :smack-bosh:processResources NO-SOURCE
18-Jul-2018 01:00:37 :smack-bosh:classes
18-Jul-2018 01:00:37 :smack-bosh:osgiClasses
18-Jul-2018 01:00:37 :smack-bosh:jar
18-Jul-2018 01:00:37
18-Jul-2018 01:00:37 FAILURE: Build failed with an exception.
18-Jul-2018 01:00:37
18-Jul-2018 01:00:37 * What went wrong:
18-Jul-2018 01:00:37 Could not resolve all files for configuration ':smack-core:testCompileClasspath'.
18-Jul-2018 01:00:37 > Could not find jxmpp-jid-tests.jar (org.jxmpp:jxmpp-jid:0.6.2).
18-Jul-2018 01:00:37   Searched in the following locations:
18-Jul-2018 01:00:37       file:/home/bamboo/.m2/repository/org/jxmpp/jxmpp-jid/0.6.2/jxmpp-jid-0.6.2-tests.jar
18-Jul-2018 01:00:37
18-Jul-2018 01:00:37 * Try:
18-Jul-2018 01:00:37 Run with --info or --debug option to get more log output. Run with --scan to get full insights.
18-Jul-2018 01:00:37
18-Jul-2018 01:00:37 * Exception is:
18-Jul-2018 01:00:37 org.gradle.api.internal.artifacts.ivyservice.DefaultLenientConfiguration$ArtifactResolveException: Could not resolve all files for configuration ':smack-core:testCompileClasspath'.
18-Jul-2018 01:00:37         at org.gradle.api.internal.artifacts.configurations.DefaultConfiguration.rethrowFailure(DefaultConfiguration.java:944)
18-Jul-2018 01:00:37         at org.gradle.api.internal.artifacts.configurations.DefaultConfiguration.access$1600(DefaultConfiguration.java:120)
18-Jul-2018 01:00:37         at org.gradle.api.internal.artifacts.configurations.DefaultConfiguration$ConfigurationFileCollection.getFiles(DefaultConfiguration.java:918)
18-Jul-2018 01:00:37         at org.gradle.api.internal.artifacts.configurations.DefaultConfiguration.getFiles(DefaultConfiguration.java:415)
18-Jul-2018 01:00:37         at org.gradle.api.internal.artifacts.configurations.DefaultConfiguration_Decorated.getFiles(Unknown Source)
18-Jul-2018 01:00:37         at org.gradle.api.internal.file.AbstractFileCollection.iterator(AbstractFileCollection.java:68)
18-Jul-2018 01:00:37         at org.gradle.api.internal.changedetection.state.AbstractFileCollectionSnapshotter$FileCollectionVisitorImpl.visitCollection(AbstractFileCollectionSnapshotter.java:72)
18-Jul-2018 01:00:37         at org.gradle.api.internal.file.AbstractFileCollection.visitRootElements(AbstractFileCollection.java:234)
18-Jul-2018 01:00:37         at org.gradle.api.internal.file.CompositeFileCollection.visitRootElements(CompositeFileCollection.java:185)
18-Jul-2018 01:00:37         at org.gradle.api.internal.changedetection.state.AbstractFileCollectionSnapshotter.snapshot(AbstractFileCollectionSnapshotter.java:55)
18-Jul-2018 01:00:37         at org.gradle.api.internal.changedetection.state.DefaultCompileClasspathSnapshotter.snapshot(DefaultCompileClasspathSnapshotter.java:38)
18-Jul-2018 01:00:37         at org.gradle.api.internal.changedetection.state.CacheBackedTaskHistoryRepository.snapshotTaskFiles(CacheBackedTaskHistoryRepository.java:329)
18-Jul-2018 01:00:37         at org.gradle.api.internal.changedetection.state.CacheBackedTaskHistoryRepository.createExecution(CacheBackedTaskHistoryRepository.java:151)
18-Jul-2018 01:00:37         at org.gradle.api.internal.changedetection.state.CacheBackedTaskHistoryRepository.access$100(CacheBackedTaskHistoryRepository.java:61)
18-Jul-2018 01:00:37         at org.gradle.api.internal.changedetection.state.CacheBackedTaskHistoryRepository$1.getCurrentExecution(CacheBackedTaskHistoryRepository.java:111)
18-Jul-2018 01:00:37         at org.gradle.api.internal.changedetection.changes.DefaultTaskArtifactStateRepository$TaskArtifactStateImpl.getStates(DefaultTaskArtifactStateRepository.java:208)
18-Jul-2018 01:00:37         at org.gradle.api.internal.changedetection.changes.DefaultTaskArtifactStateRepository$TaskArtifactStateImpl.isUpToDate(DefaultTaskArtifactStateRepository.java:93)
18-Jul-2018 01:00:37         at org.gradle.api.internal.tasks.execution.SkipUpToDateTaskExecuter.execute(SkipUpToDateTaskExecuter.java:50)
18-Jul-2018 01:00:37         at org.gradle.api.internal.tasks.execution.ResolveTaskOutputCachingStateExecuter.execute(ResolveTaskOutputCachingStateExecuter.java:54)
18-Jul-2018 01:00:37         at org.gradle.api.internal.tasks.execution.ValidatingTaskExecuter.execute(ValidatingTaskExecuter.java:59)
18-Jul-2018 01:00:37         at org.gradle.api.internal.tasks.execution.SkipEmptySourceFilesTaskExecuter.execute(SkipEmptySourceFilesTaskExecuter.java:101)
18-Jul-2018 01:00:37         at org.gradle.api.internal.tasks.execution.FinalizeInputFilePropertiesTaskExecuter.execute(FinalizeInputFilePropertiesTaskExecuter.java:44)
18-Jul-2018 01:00:37         at org.gradle.api.internal.tasks.execution.CleanupStaleOutputsExecuter.execute(CleanupStaleOutputsExecuter.java:91)
18-Jul-2018 01:00:37         at org.gradle.api.internal.tasks.execution.ResolveTaskArtifactStateTaskExecuter.execute(ResolveTaskArtifactStateTaskExecuter.java:62)
18-Jul-2018 01:00:37         at org.gradle.api.internal.tasks.execution.SkipTaskWithNoActionsExecuter.execute(SkipTaskWithNoActionsExecuter.java:59)
18-Jul-2018 01:00:37         at org.gradle.api.internal.tasks.execution.SkipOnlyIfTaskExecuter.execute(SkipOnlyIfTaskExecuter.java:54)
18-Jul-2018 01:00:37         at org.gradle.api.internal.tasks.execution.ExecuteAtMostOnceTaskExecuter.execute(ExecuteAtMostOnceTaskExecuter.java:43)
18-Jul-2018 01:00:37 :smack-core:compileTestJava FAILED
18-Jul-2018 01:00:37         at org.gradle.api.internal.tasks.execution.CatchExceptionTaskExecuter.execute(CatchExceptionTaskExecuter.java:34)
18-Jul-2018 01:00:37         at org.gradle.execution.taskgraph.DefaultTaskGraphExecuter$EventFiringTaskWorker$1.run(DefaultTaskGraphExecuter.java:256)
18-Jul-2018 01:00:37         at org.gradle.internal.progress.DefaultBuildOperationExecutor$RunnableBuildOperationWorker.execute(DefaultBuildOperationExecutor.java:336)
18-Jul-2018 01:00:37         at org.gradle.internal.progress.DefaultBuildOperationExecutor$RunnableBuildOperationWorker.execute(DefaultBuildOperationExecutor.java:328)
18-Jul-2018 01:00:37         at org.gradle.internal.progress.DefaultBuildOperationExecutor.execute(DefaultBuildOperationExecutor.java:199)
18-Jul-2018 01:00:37         at org.gradle.internal.progress.DefaultBuildOperationExecutor.run(DefaultBuildOperationExecutor.java:110)
18-Jul-2018 01:00:37         at org.gradle.execution.taskgraph.DefaultTaskGraphExecuter$EventFiringTaskWorker.execute(DefaultTaskGraphExecuter.java:249)
18-Jul-2018 01:00:37         at org.gradle.execution.taskgraph.DefaultTaskGraphExecuter$EventFiringTaskWorker.execute(DefaultTaskGraphExecuter.java:238)
18-Jul-2018 01:00:37         at org.gradle.execution.taskgraph.DefaultTaskPlanExecutor$TaskExecutorWorker.processTask(DefaultTaskPlanExecutor.java:123)
18-Jul-2018 01:00:37         at org.gradle.execution.taskgraph.DefaultTaskPlanExecutor$TaskExecutorWorker.access$200(DefaultTaskPlanExecutor.java:79)
18-Jul-2018 01:00:37         at org.gradle.execution.taskgraph.DefaultTaskPlanExecutor$TaskExecutorWorker$1.execute(DefaultTaskPlanExecutor.java:104)
18-Jul-2018 01:00:37         at org.gradle.execution.taskgraph.DefaultTaskPlanExecutor$TaskExecutorWorker$1.execute(DefaultTaskPlanExecutor.java:98)
18-Jul-2018 01:00:37         at org.gradle.execution.taskgraph.DefaultTaskExecutionPlan.execute(DefaultTaskExecutionPlan.java:663)
18-Jul-2018 01:00:37         at org.gradle.execution.taskgraph.DefaultTaskExecutionPlan.executeWithTask(DefaultTaskExecutionPlan.java:597)
18-Jul-2018 01:00:37         at org.gradle.execution.taskgraph.DefaultTaskPlanExecutor$TaskExecutorWorker.run(DefaultTaskPlanExecutor.java:98)
18-Jul-2018 01:00:37         at org.gradle.internal.concurrent.ExecutorPolicy$CatchAndRecordFailures.onExecute(ExecutorPolicy.java:63)
18-Jul-2018 01:00:37         at org.gradle.internal.concurrent.ManagedExecutorImpl$1.run(ManagedExecutorImpl.java:46)
18-Jul-2018 01:00:37         at org.gradle.internal.concurrent.ThreadFactoryImpl$ManagedThreadRunnable.run(ThreadFactoryImpl.java:55)
18-Jul-2018 01:00:37 Caused by: org.gradle.internal.resolve.ArtifactNotFoundException: Could not find jxmpp-jid-tests.jar (org.jxmpp:jxmpp-jid:0.6.2).
18-Jul-2018 01:00:37 Searched in the following locations:
18-Jul-2018 01:00:37     file:/home/bamboo/.m2/repository/org/jxmpp/jxmpp-jid/0.6.2/jxmpp-jid-0.6.2-tests.jar
18-Jul-2018 01:00:37         at org.gradle.internal.resolve.result.DefaultBuildableArtifactResolveResult.notFound(DefaultBuildableArtifactResolveResult.java:27)
18-Jul-2018 01:00:37         at org.gradle.api.internal.artifacts.repositories.resolver.ExternalResourceResolver$RemoteRepositoryAccess.resolveArtifact(ExternalResourceResolver.java:434)
18-Jul-2018 01:00:37         at org.gradle.api.internal.artifacts.ivyservice.ivyresolve.CachingModuleComponentRepository$ResolveAndCacheRepositoryAccess.resolveArtifact(CachingModuleComponentRepository.java:427)
18-Jul-2018 01:00:37         at org.gradle.api.internal.artifacts.ivyservice.ivyresolve.LocalModuleComponentRepository$LocalAccess.resolveArtifact(LocalModuleComponentRepository.java:105)
18-Jul-2018 01:00:37         at org.gradle.api.internal.artifacts.ivyservice.ivyresolve.ErrorHandlingModuleComponentRepository$ErrorHandlingModuleComponentRepositoryAccess.resolveArtifact(ErrorHandlingModuleComponentRepository.java:181)
18-Jul-2018 01:00:37         at org.gradle.api.internal.artifacts.ivyservice.ivyresolve.RepositoryChainArtifactResolver.resolveArtifact(RepositoryChainArtifactResolver.java:78)
18-Jul-2018 01:00:37         at org.gradle.api.internal.artifacts.ivyservice.resolveengine.ComponentResolversChain$ArtifactResolverChain.resolveArtifact(ComponentResolversChain.java:121)
18-Jul-2018 01:00:37         at org.gradle.api.internal.artifacts.ivyservice.ivyresolve.ErrorHandlingArtifactResolver.resolveArtifact(ErrorHandlingArtifactResolver.java:46)
18-Jul-2018 01:00:37         at org.gradle.api.internal.artifacts.ivyservice.resolveengine.artifact.DefaultArtifactSet$LazyArtifactSource.create(DefaultArtifactSet.java:170)
18-Jul-2018 01:00:37         at org.gradle.api.internal.artifacts.ivyservice.resolveengine.artifact.DefaultArtifactSet$LazyArtifactSource.create(DefaultArtifactSet.java:157)
18-Jul-2018 01:00:37         at org.gradle.api.internal.artifacts.DefaultResolvedArtifact.getFile(DefaultResolvedArtifact.java:135)
18-Jul-2018 01:00:37         at org.gradle.api.internal.artifacts.ivyservice.resolveengine.artifact.ArtifactBackedResolvedVariant$DownloadArtifactFile.run(ArtifactBackedResolvedVariant.java:148)
18-Jul-2018 01:00:37         at org.gradle.internal.progress.DefaultBuildOperationExecutor$RunnableBuildOperationWorker.execute(DefaultBuildOperationExecutor.java:336)
18-Jul-2018 01:00:37         at org.gradle.internal.progress.DefaultBuildOperationExecutor$RunnableBuildOperationWorker.execute(DefaultBuildOperationExecutor.java:328)
18-Jul-2018 01:00:37         at org.gradle.internal.progress.DefaultBuildOperationExecutor.execute(DefaultBuildOperationExecutor.java:199)
18-Jul-2018 01:00:37         at org.gradle.internal.progress.DefaultBuildOperationExecutor.access$900(DefaultBuildOperationExecutor.java:63)
18-Jul-2018 01:00:37         at org.gradle.internal.progress.DefaultBuildOperationExecutor$ParentPreservingQueueWorker.execute(DefaultBuildOperationExecutor.java:378)
18-Jul-2018 01:00:37         at org.gradle.internal.operations.DefaultBuildOperationQueue$WorkerRunnable.runOperation(DefaultBuildOperationQueue.java:230)
18-Jul-2018 01:00:37         at org.gradle.internal.operations.DefaultBuildOperationQueue$WorkerRunnable.access$600(DefaultBuildOperationQueue.java:172)
18-Jul-2018 01:00:37         at org.gradle.internal.operations.DefaultBuildOperationQueue$WorkerRunnable$1.call(DefaultBuildOperationQueue.java:209)
18-Jul-2018 01:00:37         at org.gradle.internal.operations.DefaultBuildOperationQueue$WorkerRunnable$1.call(DefaultBuildOperationQueue.java:203)
18-Jul-2018 01:00:37         at org.gradle.internal.work.DefaultWorkerLeaseService.withLocks(DefaultWorkerLeaseService.java:152)
18-Jul-2018 01:00:37         at org.gradle.internal.operations.DefaultBuildOperationQueue$WorkerRunnable.runBatch(DefaultBuildOperationQueue.java:202)
18-Jul-2018 01:00:37         at org.gradle.internal.operations.DefaultBuildOperationQueue$WorkerRunnable.run(DefaultBuildOperationQueue.java:177)
18-Jul-2018 01:00:37         ... 3 more
18-Jul-2018 01:00:37
18-Jul-2018 01:00:37
18-Jul-2018 01:00:37 * Get more help at https://help.gradle.org
18-Jul-2018 01:00:37
18-Jul-2018 01:00:37 BUILD FAILED in 33s
18-Jul-2018 01:00:37 47 actionable tasks: 47 executed
18-Jul-2018 01:00:37 Failing task since return code of [/opt/gradle/bin/gradle --stacktrace clean distributionZip javadocAll jacocoRootReport] was 1 while expected 0
18-Jul-2018 01:00:37 Finished task 'Gradle distribution zip' with result: Failed
18-Jul-2018 01:00:37 Running post build plugin 'NCover Results Collector'
18-Jul-2018 01:00:37 Running post build plugin 'Artifact Copier'
18-Jul-2018 01:00:37 Publishing an artifact: Project binary files
18-Jul-2018 01:00:37 Unable to publish artifact [Project binary files]: the source directory /var/atlassian/bamboo-home/xml-data/build-dir/SMACK-NIGHTLY-JOB1/build/distributions does not exist.
18-Jul-2018 01:00:37 The artifact is required for down stream Stages and Jobs, build will now fail.
18-Jul-2018 01:00:37 The artifact hasn't been successfully published after 318.7 μs
18-Jul-2018 01:00:37 Running post build plugin 'npm Cache Cleanup'
18-Jul-2018 01:00:37 Running post build plugin 'Clover Results Collector'
18-Jul-2018 01:00:37 Running post build plugin 'Docker Container Cleanup'
18-Jul-2018 01:00:37 Finalising the build...
18-Jul-2018 01:00:37 Stopping timer.
18-Jul-2018 01:00:37 Build SMACK-NIGHTLY-JOB1-1595 completed.
18-Jul-2018 01:00:37 Running on server: post build plugin 'NCover Results Collector'
18-Jul-2018 01:00:37 Running on server: post build plugin 'Build Hanging Detection Configuration'
18-Jul-2018 01:00:37 Running on server: post build plugin 'Clover Delta Calculator'
18-Jul-2018 01:00:37 Running on server: post build plugin 'Maven Dependencies Postprocessor'
18-Jul-2018 01:00:37 All post build plugins have finished
18-Jul-2018 01:00:37 Generating build results summary...
18-Jul-2018 01:00:37 Saving build results to disk...
18-Jul-2018 01:00:37 Logging substituted variables...
18-Jul-2018 01:00:37 Indexing build results...
18-Jul-2018 01:00:37 Finished building SMACK-NIGHTLY-JOB1-1595.