Build: #170 failed

Job: Default Job failed

Stages & jobs

  1. Default Stage

  2. Deploy

Build log

The build generated 1,072 lines of output.The output is too long and has been truncated to the last 1,000 lines. Download or view full build log.

12-Aug-2020 01:01:16 > Task :smack-android-extensions:copyJavadocDocFiles NO-SOURCE
12-Aug-2020 01:01:17 > Task :smack-android-extensions:javadoc
12-Aug-2020 01:01:19 > Task :smack-bosh:compileJava
12-Aug-2020 01:01:19 > Task :smack-bosh:processResources NO-SOURCE
12-Aug-2020 01:01:19 > Task :smack-bosh:classes
12-Aug-2020 01:01:19 > Task :smack-bosh:copyJavadocDocFiles NO-SOURCE
12-Aug-2020 01:01:21 > Task :smack-bosh:javadoc
12-Aug-2020 01:01:21 > Task :smack-core:processResources
12-Aug-2020 01:01:21 > Task :smack-core:classes
12-Aug-2020 01:01:21 > Task :smack-core:copyJavadocDocFiles NO-SOURCE
12-Aug-2020 01:01:27 > Task :smack-core:javadoc
12-Aug-2020 01:01:29 > Task :smack-debug:compileJava
12-Aug-2020 01:01:29 > Task :smack-debug:processResources
12-Aug-2020 01:01:29 > Task :smack-debug:classes
12-Aug-2020 01:01:29 > Task :smack-debug:copyJavadocDocFiles NO-SOURCE
12-Aug-2020 01:01:30 > Task :smack-debug:javadoc
12-Aug-2020 01:01:31 > Task :smack-debug-slf4j:compileJava
12-Aug-2020 01:01:31 > Task :smack-debug-slf4j:processResources NO-SOURCE
12-Aug-2020 01:01:31 > Task :smack-debug-slf4j:classes
12-Aug-2020 01:01:31 > Task :smack-debug-slf4j:copyJavadocDocFiles NO-SOURCE
12-Aug-2020 01:01:33 > Task :smack-debug-slf4j:javadoc
12-Aug-2020 01:01:33 > Task :smack-experimental:processResources
12-Aug-2020 01:01:33 > Task :smack-experimental:classes
12-Aug-2020 01:01:33 > Task :smack-experimental:copyJavadocDocFiles NO-SOURCE
12-Aug-2020 01:01:38 > Task :smack-experimental:javadoc
12-Aug-2020 01:01:38 > Task :smack-extensions:processResources
12-Aug-2020 01:01:38 > Task :smack-extensions:classes
12-Aug-2020 01:01:38 > Task :smack-extensions:copyJavadocDocFiles NO-SOURCE
12-Aug-2020 01:01:46 > Task :smack-extensions:javadoc
12-Aug-2020 01:01:46 > Task :smack-im:processResources
12-Aug-2020 01:01:46 > Task :smack-im:classes
12-Aug-2020 01:01:46 > Task :smack-im:copyJavadocDocFiles NO-SOURCE
12-Aug-2020 01:01:48 > Task :smack-im:javadoc
12-Aug-2020 01:01:49 > Task :smack-resolver-javax:compileJava
12-Aug-2020 01:01:50 > Task :smack-sasl-javax:compileJava
12-Aug-2020 01:01:51 > Task :smack-xmlparser-stax:compileJava
12-Aug-2020 01:01:52 > Task :smack-java7:compileJava
12-Aug-2020 01:01:55 > Task :smack-legacy:compileJava
12-Aug-2020 01:01:58 > Task :smack-omemo:compileJava
12-Aug-2020 01:01:58 > Task :smack-resolver-minidns-dox:compileJava
12-Aug-2020 01:02:00 > Task :smack-tcp:compileJava
12-Aug-2020 01:02:02 > Task :smack-java8-full:compileJava
12-Aug-2020 01:02:03 > Task :smack-resolver-dnsjava:compileJava
12-Aug-2020 01:02:07 > Task :smack-integration-test:compileJava
12-Aug-2020 01:02:07 > Task :smack-integration-test:processResources NO-SOURCE
12-Aug-2020 01:02:07 > Task :smack-integration-test:classes
12-Aug-2020 01:02:07 > Task :smack-integration-test:copyJavadocDocFiles NO-SOURCE
12-Aug-2020 01:02:10 > Task :smack-integration-test:javadoc
12-Aug-2020 01:02:10 > Task :smack-java7:processResources NO-SOURCE
12-Aug-2020 01:02:10 > Task :smack-java7:classes
12-Aug-2020 01:02:10 > Task :smack-java7:copyJavadocDocFiles NO-SOURCE
12-Aug-2020 01:02:10 > Task :smack-java7:javadoc SKIPPED
12-Aug-2020 01:02:10 > Task :smack-java8-full:processResources NO-SOURCE
12-Aug-2020 01:02:10 > Task :smack-java8-full:classes
12-Aug-2020 01:02:10 > Task :smack-bosh:jar
12-Aug-2020 01:02:10 > Task :smack-core:jar
12-Aug-2020 01:02:11 > Task :smack-debug:jar
12-Aug-2020 01:02:11 > Task :smack-experimental:jar
12-Aug-2020 01:02:11 > Task :smack-extensions:jar
12-Aug-2020 01:02:11 > Task :smack-im:jar
12-Aug-2020 01:02:11 > Task :smack-java7:jar
12-Aug-2020 01:02:11 > Task :smack-legacy:processResources
12-Aug-2020 01:02:11 > Task :smack-legacy:classes
12-Aug-2020 01:02:11 > Task :smack-legacy:jar
12-Aug-2020 01:02:11 > Task :smack-omemo:processResources
12-Aug-2020 01:02:11 > Task :smack-omemo:classes
12-Aug-2020 01:02:11 > Task :smack-omemo:jar
12-Aug-2020 01:02:11 > Task :smack-openpgp:processResources
12-Aug-2020 01:02:11 > Task :smack-openpgp:classes
12-Aug-2020 01:02:11 > Task :smack-openpgp:jar
12-Aug-2020 01:02:11 > Task :smack-resolver-javax:processResources NO-SOURCE
12-Aug-2020 01:02:11 > Task :smack-resolver-javax:classes
12-Aug-2020 01:02:11 > Task :smack-resolver-javax:jar
12-Aug-2020 01:02:11 > Task :smack-resolver-minidns:processResources NO-SOURCE
12-Aug-2020 01:02:11 > Task :smack-resolver-minidns:classes
12-Aug-2020 01:02:11 > Task :smack-resolver-minidns:jar
12-Aug-2020 01:02:11 > Task :smack-resolver-minidns-dox:processResources NO-SOURCE
12-Aug-2020 01:02:11 > Task :smack-resolver-minidns-dox:classes
12-Aug-2020 01:02:11 > Task :smack-resolver-minidns-dox:jar
12-Aug-2020 01:02:11 > Task :smack-sasl-javax:processResources NO-SOURCE
12-Aug-2020 01:02:11 > Task :smack-sasl-javax:classes
12-Aug-2020 01:02:11 > Task :smack-sasl-javax:jar
12-Aug-2020 01:02:11 > Task :smack-tcp:processResources
12-Aug-2020 01:02:11 > Task :smack-tcp:classes
12-Aug-2020 01:02:11 > Task :smack-tcp:jar
12-Aug-2020 01:02:11 > Task :smack-xmlparser:processResources NO-SOURCE
12-Aug-2020 01:02:11 > Task :smack-xmlparser:classes
12-Aug-2020 01:02:11 > Task :smack-xmlparser:jar
12-Aug-2020 01:02:11 > Task :smack-xmlparser-stax:processResources
12-Aug-2020 01:02:11 > Task :smack-xmlparser-stax:classes
12-Aug-2020 01:02:11 > Task :smack-xmlparser-stax:jar
12-Aug-2020 01:02:12 NOTE: Picked up JDK_JAVA_OPTIONS:  --add-opens=java.base/java.lang=ALL-UNNAMED --add-opens=java.base/java.io=ALL-UNNAMED --add-opens=java.rmi/sun.rmi.transport=ALL-UNNAMED
12-Aug-2020 01:02:12
12-Aug-2020 01:02:12 > Task :smack-java8-full:generateModularXmppClientToServerConnectionStateGraph
12-Aug-2020 01:02:13
12-Aug-2020 01:02:13 > Task :smack-java8-full:convertModularXmppClientToServerConnectionStateGraphDotToPng
12-Aug-2020 01:02:13 > Task :smack-java8-full:copyJavadocDocFiles
12-Aug-2020 01:02:14 > Task :smack-java8-full:javadoc
12-Aug-2020 01:02:18 > Task :smack-jingle-old:compileJava
12-Aug-2020 01:02:18 > Task :smack-jingle-old:processResources NO-SOURCE
12-Aug-2020 01:02:18 > Task :smack-jingle-old:classes
12-Aug-2020 01:02:18 > Task :smack-jingle-old:copyJavadocDocFiles NO-SOURCE
12-Aug-2020 01:02:23 > Task :smack-jingle-old:javadoc
12-Aug-2020 01:02:23 > Task :smack-legacy:copyJavadocDocFiles NO-SOURCE
12-Aug-2020 01:02:26 > Task :smack-legacy:javadoc
12-Aug-2020 01:02:26 > Task :smack-omemo:copyJavadocDocFiles NO-SOURCE
12-Aug-2020 01:02:30 > Task :smack-omemo:javadoc
12-Aug-2020 01:02:31 > Task :smack-omemo-signal:compileJava
12-Aug-2020 01:02:31 > Task :smack-omemo-signal:processResources NO-SOURCE
12-Aug-2020 01:02:31 > Task :smack-omemo-signal:classes
12-Aug-2020 01:02:31 > Task :smack-omemo-signal:copyJavadocDocFiles NO-SOURCE
12-Aug-2020 01:02:33 > Task :smack-omemo-signal:javadoc
12-Aug-2020 01:02:34 > Task :smack-omemo-signal-integration-test:compileJava
12-Aug-2020 01:02:34 > Task :smack-omemo-signal-integration-test:processResources NO-SOURCE
12-Aug-2020 01:02:34 > Task :smack-omemo-signal-integration-test:classes
12-Aug-2020 01:02:34 > Task :smack-omemo-signal-integration-test:copyJavadocDocFiles NO-SOURCE
12-Aug-2020 01:02:36 > Task :smack-omemo-signal-integration-test:javadoc
12-Aug-2020 01:02:36 > Task :smack-openpgp:copyJavadocDocFiles NO-SOURCE
12-Aug-2020 01:02:39 > Task :smack-openpgp:javadoc
12-Aug-2020 01:02:41 > Task :smack-repl:compileJava
12-Aug-2020 01:02:43 NOTE: Picked up JDK_JAVA_OPTIONS:  --add-opens=java.base/java.lang=ALL-UNNAMED --add-opens=java.base/java.io=ALL-UNNAMED --add-opens=java.rmi/sun.rmi.transport=ALL-UNNAMED
12-Aug-2020 01:02:43
12-Aug-2020 01:02:43 > Task :smack-repl:compileScala
12-Aug-2020 01:02:48
12-Aug-2020 01:02:48 > Task :smack-repl:processResources NO-SOURCE
12-Aug-2020 01:02:48 > Task :smack-repl:classes
12-Aug-2020 01:02:48 > Task :smack-repl:copyJavadocDocFiles NO-SOURCE
12-Aug-2020 01:02:50 > Task :smack-repl:javadoc
12-Aug-2020 01:02:50 > Task :smack-resolver-dnsjava:processResources NO-SOURCE
12-Aug-2020 01:02:50 > Task :smack-resolver-dnsjava:classes
12-Aug-2020 01:02:50 > Task :smack-resolver-dnsjava:copyJavadocDocFiles NO-SOURCE
12-Aug-2020 01:02:52 > Task :smack-resolver-dnsjava:javadoc
12-Aug-2020 01:02:52 > Task :smack-resolver-javax:copyJavadocDocFiles NO-SOURCE
12-Aug-2020 01:02:53 > Task :smack-resolver-javax:javadoc
12-Aug-2020 01:02:53 > Task :smack-resolver-minidns:copyJavadocDocFiles NO-SOURCE
12-Aug-2020 01:02:55 > Task :smack-resolver-minidns:javadoc
12-Aug-2020 01:02:55 > Task :smack-resolver-minidns-dox:copyJavadocDocFiles NO-SOURCE
12-Aug-2020 01:02:56 > Task :smack-resolver-minidns-dox:javadoc
12-Aug-2020 01:02:56 > Task :smack-sasl-javax:copyJavadocDocFiles NO-SOURCE
12-Aug-2020 01:02:58 > Task :smack-sasl-javax:javadoc
12-Aug-2020 01:02:58 > Task :smack-sasl-provided:processResources NO-SOURCE
12-Aug-2020 01:02:58 > Task :smack-sasl-provided:classes
12-Aug-2020 01:02:58 > Task :smack-sasl-provided:copyJavadocDocFiles NO-SOURCE
12-Aug-2020 01:02:59 > Task :smack-sasl-provided:javadoc
12-Aug-2020 01:02:59 > Task :smack-tcp:copyJavadocDocFiles NO-SOURCE
12-Aug-2020 01:03:02 > Task :smack-tcp:javadoc
12-Aug-2020 01:03:02 > Task :smack-xmlparser:copyJavadocDocFiles NO-SOURCE
12-Aug-2020 01:03:03 > Task :smack-xmlparser:javadoc
12-Aug-2020 01:03:03 > Task :smack-xmlparser-stax:copyJavadocDocFiles NO-SOURCE
12-Aug-2020 01:03:05 > Task :smack-xmlparser-stax:javadoc
12-Aug-2020 01:03:05 > Task :smack-xmlparser-xpp3:processResources
12-Aug-2020 01:03:05 > Task :smack-xmlparser-xpp3:classes
12-Aug-2020 01:03:05 > Task :smack-xmlparser-xpp3:copyJavadocDocFiles NO-SOURCE
12-Aug-2020 01:03:06 > Task :smack-xmlparser-xpp3:javadoc
12-Aug-2020 01:03:32 > Task :javadocAll
12-Aug-2020 01:03:33 > Task :markdownToHtml
12-Aug-2020 01:03:33 > Task :prepareReleasedocs
12-Aug-2020 01:03:33 > Task :smack-android:jar
12-Aug-2020 01:03:33 > Task :smack-android:assemble
12-Aug-2020 01:03:35 > Task :smack-android:animalsnifferMain
12-Aug-2020 01:03:37 > Task :smack-android:checkstyleMain
12-Aug-2020 01:03:37 > Task :smack-android:compileTestFixturesJava NO-SOURCE
12-Aug-2020 01:03:37 > Task :smack-android:compileTestJava NO-SOURCE
12-Aug-2020 01:03:37 > Task :smack-android:processTestResources NO-SOURCE
12-Aug-2020 01:03:37 > Task :smack-android:testClasses UP-TO-DATE
12-Aug-2020 01:03:37 > Task :smack-android:checkstyleTest NO-SOURCE
12-Aug-2020 01:03:37 > Task :smack-android:processTestFixturesResources NO-SOURCE
12-Aug-2020 01:03:37 > Task :smack-android:testFixturesClasses UP-TO-DATE
12-Aug-2020 01:03:37 > Task :smack-android:checkstyleTestFixtures NO-SOURCE
12-Aug-2020 01:03:37 > Task :smack-sasl-provided:jar
12-Aug-2020 01:03:37 > Task :smack-xmlparser-xpp3:jar
12-Aug-2020 01:03:37 > Task :smack-android:clirr
12-Aug-2020 01:03:37 > Task :smack-android:testFixturesJar
12-Aug-2020 01:03:37 > Task :smack-android:test NO-SOURCE
12-Aug-2020 01:03:37 > Task :smack-android:check
12-Aug-2020 01:03:37 > Task :smack-android:build
12-Aug-2020 01:03:37 > Task :smack-android-extensions:jar
12-Aug-2020 01:03:37 > Task :smack-android-extensions:assemble
12-Aug-2020 01:03:38 > Task :smack-android-extensions:animalsnifferMain
12-Aug-2020 01:03:38 > Task :smack-android-extensions:checkstyleMain
12-Aug-2020 01:03:38 > Task :smack-android-extensions:compileTestFixturesJava NO-SOURCE
12-Aug-2020 01:03:38 > Task :smack-android-extensions:compileTestJava NO-SOURCE
12-Aug-2020 01:03:38 > Task :smack-android-extensions:processTestResources NO-SOURCE
12-Aug-2020 01:03:38 > Task :smack-android-extensions:testClasses UP-TO-DATE
12-Aug-2020 01:03:38 > Task :smack-android-extensions:checkstyleTest NO-SOURCE
12-Aug-2020 01:03:38 > Task :smack-android-extensions:processTestFixturesResources NO-SOURCE
12-Aug-2020 01:03:38 > Task :smack-android-extensions:testFixturesClasses UP-TO-DATE
12-Aug-2020 01:03:38 > Task :smack-android-extensions:checkstyleTestFixtures NO-SOURCE
12-Aug-2020 01:03:38 > Task :smack-android-extensions:clirr
12-Aug-2020 01:03:38 > Task :smack-android-extensions:testFixturesJar
12-Aug-2020 01:03:38 > Task :smack-android-extensions:test NO-SOURCE
12-Aug-2020 01:03:38 > Task :smack-android-extensions:check
12-Aug-2020 01:03:38 > Task :smack-android-extensions:build
12-Aug-2020 01:03:38 > Task :smack-bosh:assemble
12-Aug-2020 01:03:38 > Task :smack-bosh:animalsnifferMain
12-Aug-2020 01:03:38 > Task :smack-bosh:checkstyleMain
12-Aug-2020 01:03:38 > Task :smack-bosh:compileTestFixturesJava NO-SOURCE
12-Aug-2020 01:03:38 > Task :smack-bosh:compileTestJava NO-SOURCE
12-Aug-2020 01:03:38 > Task :smack-bosh:processTestResources NO-SOURCE
12-Aug-2020 01:03:38 > Task :smack-bosh:testClasses UP-TO-DATE
12-Aug-2020 01:03:38 > Task :smack-bosh:checkstyleTest NO-SOURCE
12-Aug-2020 01:03:38 > Task :smack-bosh:processTestFixturesResources NO-SOURCE
12-Aug-2020 01:03:38 > Task :smack-bosh:testFixturesClasses UP-TO-DATE
12-Aug-2020 01:03:38 > Task :smack-bosh:checkstyleTestFixtures NO-SOURCE
12-Aug-2020 01:03:38 > Task :smack-bosh:clirr
12-Aug-2020 01:03:38 > Task :smack-bosh:testFixturesJar
12-Aug-2020 01:03:38 > Task :smack-bosh:test NO-SOURCE
12-Aug-2020 01:03:38 > Task :smack-bosh:check
12-Aug-2020 01:03:38 > Task :smack-bosh:build
12-Aug-2020 01:03:38 > Task :smack-core:assemble
12-Aug-2020 01:03:39 > Task :smack-core:animalsnifferMain
12-Aug-2020 01:03:41 > Task :smack-core:checkstyleMain
12-Aug-2020 01:03:43 > Task :smack-core:compileTestFixturesJava
12-Aug-2020 01:03:45 > Task :smack-core:compileTestJava
12-Aug-2020 01:03:45 > Task :smack-core:processTestResources
12-Aug-2020 01:03:45 > Task :smack-core:testClasses
12-Aug-2020 01:03:46 > Task :smack-core:checkstyleTest
12-Aug-2020 01:03:46 > Task :smack-core:processTestFixturesResources NO-SOURCE
12-Aug-2020 01:03:46 > Task :smack-core:testFixturesClasses
12-Aug-2020 01:03:46 > Task :smack-core:checkstyleTestFixtures
12-Aug-2020 01:03:46 > Task :smack-core:clirr
12-Aug-2020 01:03:46 > Task :smack-core:testFixturesJar
12-Aug-2020 01:03:48
12-Aug-2020 01:03:48 > Task :smack-core:test
12-Aug-2020 01:03:48 NOTE: Picked up JDK_JAVA_OPTIONS:  --add-opens=java.base/java.lang=ALL-UNNAMED --add-opens=java.base/java.io=ALL-UNNAMED --add-opens=java.rmi/sun.rmi.transport=ALL-UNNAMED
12-Aug-2020 01:03:52
12-Aug-2020 01:03:52 > Task :smack-core:check
12-Aug-2020 01:03:52 > Task :smack-core:build
12-Aug-2020 01:03:52 > Task :smack-debug:assemble
12-Aug-2020 01:03:52 > Task :smack-debug:checkstyleMain
12-Aug-2020 01:03:53 > Task :smack-debug:compileTestFixturesJava NO-SOURCE
12-Aug-2020 01:03:53 > Task :smack-debug:compileTestJava NO-SOURCE
12-Aug-2020 01:03:53 > Task :smack-debug:processTestResources NO-SOURCE
12-Aug-2020 01:03:53 > Task :smack-debug:testClasses UP-TO-DATE
12-Aug-2020 01:03:53 > Task :smack-debug:checkstyleTest NO-SOURCE
12-Aug-2020 01:03:53 > Task :smack-debug:processTestFixturesResources NO-SOURCE
12-Aug-2020 01:03:53 > Task :smack-debug:testFixturesClasses UP-TO-DATE
12-Aug-2020 01:03:53 > Task :smack-debug:checkstyleTestFixtures NO-SOURCE
12-Aug-2020 01:03:53 > Task :smack-debug:clirr
12-Aug-2020 01:03:53 > Task :smack-debug:testFixturesJar
12-Aug-2020 01:03:53 > Task :smack-debug:test NO-SOURCE
12-Aug-2020 01:03:53 > Task :smack-debug:check
12-Aug-2020 01:03:53 > Task :smack-debug:build
12-Aug-2020 01:03:53 > Task :smack-debug-slf4j:jar
12-Aug-2020 01:03:53 > Task :smack-debug-slf4j:assemble
12-Aug-2020 01:03:53 > Task :smack-debug-slf4j:checkstyleMain
12-Aug-2020 01:03:53 > Task :smack-debug-slf4j:compileTestFixturesJava NO-SOURCE
12-Aug-2020 01:03:53 > Task :smack-debug-slf4j:compileTestJava NO-SOURCE
12-Aug-2020 01:03:53 > Task :smack-debug-slf4j:processTestResources NO-SOURCE
12-Aug-2020 01:03:53 > Task :smack-debug-slf4j:testClasses UP-TO-DATE
12-Aug-2020 01:03:53 > Task :smack-debug-slf4j:checkstyleTest NO-SOURCE
12-Aug-2020 01:03:53 > Task :smack-debug-slf4j:processTestFixturesResources NO-SOURCE
12-Aug-2020 01:03:53 > Task :smack-debug-slf4j:testFixturesClasses UP-TO-DATE
12-Aug-2020 01:03:53 > Task :smack-debug-slf4j:checkstyleTestFixtures NO-SOURCE
12-Aug-2020 01:03:53 > Task :smack-debug-slf4j:clirr
12-Aug-2020 01:03:53 > Task :smack-debug-slf4j:testFixturesJar
12-Aug-2020 01:03:53 > Task :smack-debug-slf4j:test NO-SOURCE
12-Aug-2020 01:03:53 > Task :smack-debug-slf4j:check
12-Aug-2020 01:03:53 > Task :smack-debug-slf4j:build
12-Aug-2020 01:03:53 > Task :smack-experimental:assemble
12-Aug-2020 01:03:53 > Task :smack-experimental:animalsnifferMain
12-Aug-2020 01:03:54 > Task :smack-experimental:checkstyleMain
12-Aug-2020 01:03:55 > Task :smack-extensions:compileTestFixturesJava
12-Aug-2020 01:03:55 > Task :smack-experimental:compileTestFixturesJava NO-SOURCE
12-Aug-2020 01:03:59 > Task :smack-experimental:compileTestJava
12-Aug-2020 01:03:59 > Task :smack-experimental:processTestResources NO-SOURCE
12-Aug-2020 01:03:59 > Task :smack-experimental:testClasses
12-Aug-2020 01:03:59 > Task :smack-experimental:checkstyleTest
12-Aug-2020 01:03:59 > Task :smack-experimental:processTestFixturesResources NO-SOURCE
12-Aug-2020 01:03:59 > Task :smack-experimental:testFixturesClasses UP-TO-DATE
12-Aug-2020 01:03:59 > Task :smack-experimental:checkstyleTestFixtures NO-SOURCE
12-Aug-2020 01:03:59 > Task :smack-experimental:clirr
12-Aug-2020 01:03:59 > Task :smack-experimental:testFixturesJar
12-Aug-2020 01:03:59 > Task :smack-extensions:processTestFixturesResources NO-SOURCE
12-Aug-2020 01:03:59 > Task :smack-extensions:testFixturesClasses
12-Aug-2020 01:03:59 > Task :smack-extensions:testFixturesJar
12-Aug-2020 01:04:01 NOTE: Picked up JDK_JAVA_OPTIONS:  --add-opens=java.base/java.lang=ALL-UNNAMED --add-opens=java.base/java.io=ALL-UNNAMED --add-opens=java.rmi/sun.rmi.transport=ALL-UNNAMED
12-Aug-2020 01:04:01
12-Aug-2020 01:04:01 > Task :smack-experimental:test
12-Aug-2020 01:04:05
12-Aug-2020 01:04:05 > Task :smack-experimental:check
12-Aug-2020 01:04:05 > Task :smack-experimental:build
12-Aug-2020 01:04:05 > Task :smack-extensions:assemble
12-Aug-2020 01:04:05 > Task :smack-extensions:animalsnifferMain
12-Aug-2020 01:04:08 > Task :smack-extensions:checkstyleMain
12-Aug-2020 01:04:12 > Task :smack-extensions:compileTestJava
12-Aug-2020 01:04:12 > Task :smack-extensions:processTestResources
12-Aug-2020 01:04:12 > Task :smack-extensions:testClasses
12-Aug-2020 01:04:13 > Task :smack-extensions:checkstyleTest
12-Aug-2020 01:04:13 > Task :smack-extensions:checkstyleTestFixtures
12-Aug-2020 01:04:13 > Task :smack-extensions:clirr
12-Aug-2020 01:04:15
12-Aug-2020 01:04:15 > Task :smack-extensions:test
12-Aug-2020 01:04:15 NOTE: Picked up JDK_JAVA_OPTIONS:  --add-opens=java.base/java.lang=ALL-UNNAMED --add-opens=java.base/java.io=ALL-UNNAMED --add-opens=java.rmi/sun.rmi.transport=ALL-UNNAMED
12-Aug-2020 01:04:36
12-Aug-2020 01:04:36 > Task :smack-extensions:check
12-Aug-2020 01:04:36 > Task :smack-extensions:build
12-Aug-2020 01:04:36 > Task :smack-im:assemble
12-Aug-2020 01:04:36 > Task :smack-im:animalsnifferMain
12-Aug-2020 01:04:37 > Task :smack-im:checkstyleMain
12-Aug-2020 01:04:37 > Task :smack-im:compileTestFixturesJava NO-SOURCE
12-Aug-2020 01:04:38 > Task :smack-im:compileTestJava
12-Aug-2020 01:04:38 > Task :smack-im:processTestResources NO-SOURCE
12-Aug-2020 01:04:38 > Task :smack-im:testClasses
12-Aug-2020 01:04:39 > Task :smack-im:checkstyleTest
12-Aug-2020 01:04:39 > Task :smack-im:processTestFixturesResources NO-SOURCE
12-Aug-2020 01:04:39 > Task :smack-im:testFixturesClasses UP-TO-DATE
12-Aug-2020 01:04:39 > Task :smack-im:checkstyleTestFixtures NO-SOURCE
12-Aug-2020 01:04:39 > Task :smack-im:clirr
12-Aug-2020 01:04:39 > Task :smack-im:testFixturesJar
12-Aug-2020 01:04:41
12-Aug-2020 01:04:41 > Task :smack-im:test
12-Aug-2020 01:04:41 NOTE: Picked up JDK_JAVA_OPTIONS:  --add-opens=java.base/java.lang=ALL-UNNAMED --add-opens=java.base/java.io=ALL-UNNAMED --add-opens=java.rmi/sun.rmi.transport=ALL-UNNAMED
12-Aug-2020 01:04:42
12-Aug-2020 01:04:42 > Task :smack-im:check
12-Aug-2020 01:04:42 > Task :smack-im:build
12-Aug-2020 01:04:42 > Task :smack-integration-test:jar
12-Aug-2020 01:04:42 > Task :smack-java8-full:jar
12-Aug-2020 01:04:42 > Task :smack-resolver-dnsjava:jar
12-Aug-2020 01:04:42 > Task :smack-integration-test:startScripts
12-Aug-2020 01:04:42 > Task :smack-integration-test:distTar
12-Aug-2020 01:04:43 > Task :smack-integration-test:distZip
12-Aug-2020 01:04:43 > Task :smack-integration-test:assemble
12-Aug-2020 01:04:44 > Task :smack-integration-test:checkstyleMain
12-Aug-2020 01:04:44 > Task :smack-integration-test:compileTestFixturesJava NO-SOURCE
12-Aug-2020 01:04:45 > Task :smack-integration-test:compileTestJava
12-Aug-2020 01:04:45 > Task :smack-integration-test:processTestResources NO-SOURCE
12-Aug-2020 01:04:45 > Task :smack-integration-test:testClasses
12-Aug-2020 01:04:45 > Task :smack-integration-test:checkstyleTest
12-Aug-2020 01:04:45 > Task :smack-integration-test:processTestFixturesResources NO-SOURCE
12-Aug-2020 01:04:45 > Task :smack-integration-test:testFixturesClasses UP-TO-DATE
12-Aug-2020 01:04:45 > Task :smack-integration-test:checkstyleTestFixtures NO-SOURCE
12-Aug-2020 01:04:45 > Task :smack-integration-test:clirr
12-Aug-2020 01:04:45 > Task :smack-integration-test:testFixturesJar
12-Aug-2020 01:04:47
12-Aug-2020 01:04:47 > Task :smack-integration-test:test
12-Aug-2020 01:04:47 NOTE: Picked up JDK_JAVA_OPTIONS:  --add-opens=java.base/java.lang=ALL-UNNAMED --add-opens=java.base/java.io=ALL-UNNAMED --add-opens=java.rmi/sun.rmi.transport=ALL-UNNAMED
12-Aug-2020 01:04:49
12-Aug-2020 01:04:49 > Task :smack-integration-test:check
12-Aug-2020 01:04:49 > Task :smack-integration-test:build
12-Aug-2020 01:04:49 > Task :smack-java7:assemble
12-Aug-2020 01:04:50 > Task :smack-java7:checkstyleMain
12-Aug-2020 01:04:50 > Task :smack-java7:compileTestFixturesJava NO-SOURCE
12-Aug-2020 01:04:50 > Task :smack-java7:compileTestJava NO-SOURCE
12-Aug-2020 01:04:50 > Task :smack-java7:processTestResources NO-SOURCE
12-Aug-2020 01:04:50 > Task :smack-java7:testClasses UP-TO-DATE
12-Aug-2020 01:04:50 > Task :smack-java7:checkstyleTest NO-SOURCE
12-Aug-2020 01:04:50 > Task :smack-java7:processTestFixturesResources NO-SOURCE
12-Aug-2020 01:04:50 > Task :smack-java7:testFixturesClasses UP-TO-DATE
12-Aug-2020 01:04:50 > Task :smack-java7:checkstyleTestFixtures NO-SOURCE
12-Aug-2020 01:04:50 > Task :smack-java7:clirr
12-Aug-2020 01:04:50 > Task :smack-java7:testFixturesJar
12-Aug-2020 01:04:50 > Task :smack-java7:test NO-SOURCE
12-Aug-2020 01:04:50 > Task :smack-java7:check
12-Aug-2020 01:04:50 > Task :smack-java7:build
12-Aug-2020 01:04:50 > Task :smack-java8-full:assemble
12-Aug-2020 01:04:50 > Task :smack-java8-full:checkstyleMain
12-Aug-2020 01:04:50 > Task :smack-java8-full:compileTestFixturesJava NO-SOURCE
12-Aug-2020 01:04:51 > Task :smack-java8-full:compileTestJava
12-Aug-2020 01:04:51 > Task :smack-java8-full:processTestResources
12-Aug-2020 01:04:51 > Task :smack-java8-full:testClasses
12-Aug-2020 01:04:51 > Task :smack-java8-full:checkstyleTest
12-Aug-2020 01:04:51 > Task :smack-java8-full:processTestFixturesResources NO-SOURCE
12-Aug-2020 01:04:51 > Task :smack-java8-full:testFixturesClasses UP-TO-DATE
12-Aug-2020 01:04:51 > Task :smack-java8-full:checkstyleTestFixtures NO-SOURCE
12-Aug-2020 01:04:51 > Task :smack-java8-full:clirr
12-Aug-2020 01:04:51 > Task :smack-java8-full:testFixturesJar
12-Aug-2020 01:04:53
12-Aug-2020 01:04:53 > Task :smack-java8-full:test
12-Aug-2020 01:04:53 NOTE: Picked up JDK_JAVA_OPTIONS:  --add-opens=java.base/java.lang=ALL-UNNAMED --add-opens=java.base/java.io=ALL-UNNAMED --add-opens=java.rmi/sun.rmi.transport=ALL-UNNAMED
12-Aug-2020 01:04:55
12-Aug-2020 01:04:55 > Task :smack-java8-full:check
12-Aug-2020 01:04:55 > Task :smack-java8-full:build
12-Aug-2020 01:04:55 > Task :smack-jingle-old:jar
12-Aug-2020 01:04:55 > Task :smack-jingle-old:assemble
12-Aug-2020 01:04:56 > Task :smack-jingle-old:checkstyleMain
12-Aug-2020 01:04:56 > Task :smack-jingle-old:compileTestFixturesJava NO-SOURCE
12-Aug-2020 01:04:56 > Task :smack-jingle-old:compileTestJava NO-SOURCE
12-Aug-2020 01:04:56 > Task :smack-jingle-old:processTestResources NO-SOURCE
12-Aug-2020 01:04:56 > Task :smack-jingle-old:testClasses UP-TO-DATE
12-Aug-2020 01:04:56 > Task :smack-jingle-old:checkstyleTest NO-SOURCE
12-Aug-2020 01:04:56 > Task :smack-jingle-old:processTestFixturesResources NO-SOURCE
12-Aug-2020 01:04:56 > Task :smack-jingle-old:testFixturesClasses UP-TO-DATE
12-Aug-2020 01:04:56 > Task :smack-jingle-old:checkstyleTestFixtures NO-SOURCE
12-Aug-2020 01:04:56 > Task :smack-jingle-old:clirr
12-Aug-2020 01:04:56 > Task :smack-jingle-old:testFixturesJar
12-Aug-2020 01:04:56 > Task :smack-jingle-old:test NO-SOURCE
12-Aug-2020 01:04:56 > Task :smack-jingle-old:check
12-Aug-2020 01:04:56 > Task :smack-jingle-old:build
12-Aug-2020 01:04:56 > Task :smack-legacy:assemble
12-Aug-2020 01:04:57 > Task :smack-legacy:checkstyleMain
12-Aug-2020 01:04:57 > Task :smack-legacy:compileTestFixturesJava NO-SOURCE
12-Aug-2020 01:04:57 > Task :smack-legacy:compileTestJava
12-Aug-2020 01:04:57 > Task :smack-legacy:processTestResources NO-SOURCE
12-Aug-2020 01:04:57 > Task :smack-legacy:testClasses
12-Aug-2020 01:04:57 > Task :smack-legacy:checkstyleTest
12-Aug-2020 01:04:57 > Task :smack-legacy:processTestFixturesResources NO-SOURCE
12-Aug-2020 01:04:57 > Task :smack-legacy:testFixturesClasses UP-TO-DATE
12-Aug-2020 01:04:57 > Task :smack-legacy:checkstyleTestFixtures NO-SOURCE
12-Aug-2020 01:04:57 > Task :smack-legacy:clirr
12-Aug-2020 01:04:57 > Task :smack-legacy:testFixturesJar
12-Aug-2020 01:04:59 NOTE: Picked up JDK_JAVA_OPTIONS:  --add-opens=java.base/java.lang=ALL-UNNAMED --add-opens=java.base/java.io=ALL-UNNAMED --add-opens=java.rmi/sun.rmi.transport=ALL-UNNAMED
12-Aug-2020 01:04:59
12-Aug-2020 01:04:59 > Task :smack-legacy:test
12-Aug-2020 01:05:00
12-Aug-2020 01:05:00 > Task :smack-legacy:check
12-Aug-2020 01:05:00 > Task :smack-legacy:build
12-Aug-2020 01:05:00 > Task :smack-omemo:assemble
12-Aug-2020 01:05:00 > Task :smack-omemo:animalsnifferMain
12-Aug-2020 01:05:01 > Task :smack-omemo:checkstyleMain
12-Aug-2020 01:05:01 > Task :smack-omemo:compileTestFixturesJava NO-SOURCE
12-Aug-2020 01:05:02 > Task :smack-omemo:compileTestJava
12-Aug-2020 01:05:02 > Task :smack-omemo:processTestResources NO-SOURCE
12-Aug-2020 01:05:02 > Task :smack-omemo:testClasses
12-Aug-2020 01:05:02 > Task :smack-omemo:checkstyleTest
12-Aug-2020 01:05:02 > Task :smack-omemo:processTestFixturesResources NO-SOURCE
12-Aug-2020 01:05:02 > Task :smack-omemo:testFixturesClasses UP-TO-DATE
12-Aug-2020 01:05:02 > Task :smack-omemo:checkstyleTestFixtures NO-SOURCE
12-Aug-2020 01:05:02 > Task :smack-omemo:clirr
12-Aug-2020 01:05:02 > Task :smack-omemo:testFixturesJar
12-Aug-2020 01:05:04
12-Aug-2020 01:05:04 > Task :smack-omemo:test
12-Aug-2020 01:05:04 NOTE: Picked up JDK_JAVA_OPTIONS:  --add-opens=java.base/java.lang=ALL-UNNAMED --add-opens=java.base/java.io=ALL-UNNAMED --add-opens=java.rmi/sun.rmi.transport=ALL-UNNAMED
12-Aug-2020 01:05:05
12-Aug-2020 01:05:05 > Task :smack-omemo:check
12-Aug-2020 01:05:05 > Task :smack-omemo:build
12-Aug-2020 01:05:05 > Task :smack-omemo-signal:jar
12-Aug-2020 01:05:05 > Task :smack-omemo-signal:assemble
12-Aug-2020 01:05:06 > Task :smack-omemo-signal:animalsnifferMain
12-Aug-2020 01:05:06 > Task :smack-omemo-signal:checkstyleMain
12-Aug-2020 01:05:06 > Task :smack-omemo:testsJar
12-Aug-2020 01:05:06 > Task :smack-omemo-signal:compileTestFixturesJava NO-SOURCE
12-Aug-2020 01:05:07 > Task :smack-omemo-signal:compileTestJava
12-Aug-2020 01:05:07 > Task :smack-omemo-signal:processTestResources NO-SOURCE
12-Aug-2020 01:05:07 > Task :smack-omemo-signal:testClasses
12-Aug-2020 01:05:07 > Task :smack-omemo-signal:checkstyleTest
12-Aug-2020 01:05:07 > Task :smack-omemo-signal:processTestFixturesResources NO-SOURCE
12-Aug-2020 01:05:07 > Task :smack-omemo-signal:testFixturesClasses UP-TO-DATE
12-Aug-2020 01:05:07 > Task :smack-omemo-signal:checkstyleTestFixtures NO-SOURCE
12-Aug-2020 01:05:07 > Task :smack-omemo-signal:clirr
12-Aug-2020 01:05:07 > Task :smack-omemo-signal:testFixturesJar
12-Aug-2020 01:05:09
12-Aug-2020 01:05:09 > Task :smack-omemo-signal:test
12-Aug-2020 01:05:09 NOTE: Picked up JDK_JAVA_OPTIONS:  --add-opens=java.base/java.lang=ALL-UNNAMED --add-opens=java.base/java.io=ALL-UNNAMED --add-opens=java.rmi/sun.rmi.transport=ALL-UNNAMED
12-Aug-2020 01:05:11
12-Aug-2020 01:05:11 > Task :smack-omemo-signal:check
12-Aug-2020 01:05:11 > Task :smack-omemo-signal:build
12-Aug-2020 01:05:11 > Task :smack-omemo-signal-integration-test:jar
12-Aug-2020 01:05:11 > Task :smack-omemo-signal-integration-test:startScripts
12-Aug-2020 01:05:12 > Task :smack-omemo-signal-integration-test:distTar
12-Aug-2020 01:05:12 > Task :smack-omemo-signal-integration-test:distZip
12-Aug-2020 01:05:12 > Task :smack-omemo-signal-integration-test:assemble
12-Aug-2020 01:05:12 > Task :smack-omemo-signal-integration-test:checkstyleMain
12-Aug-2020 01:05:12 > Task :smack-omemo-signal-integration-test:compileTestFixturesJava NO-SOURCE
12-Aug-2020 01:05:12 > Task :smack-omemo-signal-integration-test:compileTestJava NO-SOURCE
12-Aug-2020 01:05:12 > Task :smack-omemo-signal-integration-test:processTestResources NO-SOURCE
12-Aug-2020 01:05:12 > Task :smack-omemo-signal-integration-test:testClasses UP-TO-DATE
12-Aug-2020 01:05:12 > Task :smack-omemo-signal-integration-test:checkstyleTest NO-SOURCE
12-Aug-2020 01:05:12 > Task :smack-omemo-signal-integration-test:processTestFixturesResources NO-SOURCE
12-Aug-2020 01:05:12 > Task :smack-omemo-signal-integration-test:testFixturesClasses UP-TO-DATE
12-Aug-2020 01:05:12 > Task :smack-omemo-signal-integration-test:checkstyleTestFixtures NO-SOURCE
12-Aug-2020 01:05:12 > Task :smack-omemo-signal-integration-test:clirr
12-Aug-2020 01:05:12 > Task :smack-omemo-signal-integration-test:testFixturesJar
12-Aug-2020 01:05:12 > Task :smack-omemo-signal-integration-test:test NO-SOURCE
12-Aug-2020 01:05:12 > Task :smack-omemo-signal-integration-test:check
12-Aug-2020 01:05:12 > Task :smack-omemo-signal-integration-test:build
12-Aug-2020 01:05:12 > Task :smack-openpgp:assemble
12-Aug-2020 01:05:13 > Task :smack-openpgp:animalsnifferMain
12-Aug-2020 01:05:13 > Task :smack-openpgp:checkstyleMain
12-Aug-2020 01:05:13 > Task :smack-openpgp:compileTestFixturesJava NO-SOURCE
12-Aug-2020 01:05:15 > Task :smack-openpgp:compileTestJava
12-Aug-2020 01:05:15 > Task :smack-openpgp:processTestResources NO-SOURCE
12-Aug-2020 01:05:15 > Task :smack-openpgp:testClasses
12-Aug-2020 01:05:15 > Task :smack-openpgp:checkstyleTest
12-Aug-2020 01:05:15 > Task :smack-openpgp:processTestFixturesResources NO-SOURCE
12-Aug-2020 01:05:15 > Task :smack-openpgp:testFixturesClasses UP-TO-DATE
12-Aug-2020 01:05:15 > Task :smack-openpgp:checkstyleTestFixtures NO-SOURCE
12-Aug-2020 01:05:15 > Task :smack-openpgp:clirr
12-Aug-2020 01:05:15 > Task :smack-openpgp:testFixturesJar
12-Aug-2020 01:05:17
12-Aug-2020 01:05:17 > Task :smack-openpgp:test
12-Aug-2020 01:05:17 NOTE: Picked up JDK_JAVA_OPTIONS:  --add-opens=java.base/java.lang=ALL-UNNAMED --add-opens=java.base/java.io=ALL-UNNAMED --add-opens=java.rmi/sun.rmi.transport=ALL-UNNAMED
12-Aug-2020 01:05:21
12-Aug-2020 01:05:21 > Task :smack-openpgp:check
12-Aug-2020 01:05:21 > Task :smack-openpgp:build
12-Aug-2020 01:05:21 > Task :smack-repl:jar
12-Aug-2020 01:05:21 > Task :smack-repl:assemble
12-Aug-2020 01:05:21 > Task :smack-repl:checkstyleMain
12-Aug-2020 01:05:21 > Task :smack-repl:compileTestFixturesJava NO-SOURCE
12-Aug-2020 01:05:21 > Task :smack-repl:compileTestFixturesScala NO-SOURCE
12-Aug-2020 01:05:22 > Task :smack-repl:compileTestJava
12-Aug-2020 01:05:22 > Task :smack-repl:compileTestScala NO-SOURCE
12-Aug-2020 01:05:22 > Task :smack-repl:processTestResources NO-SOURCE
12-Aug-2020 01:05:22 > Task :smack-repl:testClasses
12-Aug-2020 01:05:22 > Task :smack-repl:checkstyleTest
12-Aug-2020 01:05:22 > Task :smack-repl:processTestFixturesResources NO-SOURCE
12-Aug-2020 01:05:22 > Task :smack-repl:testFixturesClasses UP-TO-DATE
12-Aug-2020 01:05:22 > Task :smack-repl:checkstyleTestFixtures NO-SOURCE
12-Aug-2020 01:05:22 > Task :smack-repl:clirr
12-Aug-2020 01:05:23
12-Aug-2020 01:05:23 > Task :smack-repl:scalaStyleMainCheck
12-Aug-2020 01:05:23 Processed 1 file(s)
12-Aug-2020 01:05:23 Found 0 warnings
12-Aug-2020 01:05:23 Finished in 736 ms
12-Aug-2020 01:05:23
12-Aug-2020 01:05:23 > Task :smack-repl:scalaStyleTestCheck NO-SOURCE
12-Aug-2020 01:05:23 > Task :smack-repl:scalaStyleTestFixturesCheck NO-SOURCE
12-Aug-2020 01:05:23 > Task :smack-repl:scalaStyleCheck
12-Aug-2020 01:05:23 > Task :smack-repl:testFixturesJar
12-Aug-2020 01:05:23 Found 0 errors
12-Aug-2020 01:05:25
12-Aug-2020 01:05:25 > Task :smack-repl:test
12-Aug-2020 01:05:25
12-Aug-2020 01:05:25 NOTE: Picked up JDK_JAVA_OPTIONS:  --add-opens=java.base/java.lang=ALL-UNNAMED --add-opens=java.base/java.io=ALL-UNNAMED --add-opens=java.rmi/sun.rmi.transport=ALL-UNNAMED
12-Aug-2020 01:05:25 > Task :smack-repl:check
12-Aug-2020 01:05:25 > Task :smack-repl:build
12-Aug-2020 01:05:25 > Task :smack-resolver-dnsjava:assemble
12-Aug-2020 01:05:25 > Task :smack-resolver-dnsjava:checkstyleMain
12-Aug-2020 01:05:25 > Task :smack-resolver-dnsjava:compileTestFixturesJava NO-SOURCE
12-Aug-2020 01:05:25 > Task :smack-resolver-dnsjava:compileTestJava NO-SOURCE
12-Aug-2020 01:05:25 > Task :smack-resolver-dnsjava:processTestResources NO-SOURCE
12-Aug-2020 01:05:25 > Task :smack-resolver-dnsjava:testClasses UP-TO-DATE
12-Aug-2020 01:05:25 > Task :smack-resolver-dnsjava:checkstyleTest NO-SOURCE
12-Aug-2020 01:05:25 > Task :smack-resolver-dnsjava:processTestFixturesResources NO-SOURCE
12-Aug-2020 01:05:25 > Task :smack-resolver-dnsjava:testFixturesClasses UP-TO-DATE
12-Aug-2020 01:05:25 > Task :smack-resolver-dnsjava:checkstyleTestFixtures NO-SOURCE
12-Aug-2020 01:05:25 > Task :smack-resolver-dnsjava:clirr
12-Aug-2020 01:05:25 > Task :smack-resolver-dnsjava:testFixturesJar
12-Aug-2020 01:05:25 > Task :smack-resolver-dnsjava:test NO-SOURCE
12-Aug-2020 01:05:25 > Task :smack-resolver-dnsjava:check
12-Aug-2020 01:05:25 > Task :smack-resolver-dnsjava:build
12-Aug-2020 01:05:25 > Task :smack-resolver-javax:assemble
12-Aug-2020 01:05:25 > Task :smack-resolver-javax:checkstyleMain
12-Aug-2020 01:05:25 > Task :smack-resolver-javax:compileTestFixturesJava NO-SOURCE
12-Aug-2020 01:05:25 > Task :smack-resolver-javax:compileTestJava NO-SOURCE
12-Aug-2020 01:05:25 > Task :smack-resolver-javax:processTestResources NO-SOURCE
12-Aug-2020 01:05:25 > Task :smack-resolver-javax:testClasses UP-TO-DATE
12-Aug-2020 01:05:25 > Task :smack-resolver-javax:checkstyleTest NO-SOURCE
12-Aug-2020 01:05:25 > Task :smack-resolver-javax:processTestFixturesResources NO-SOURCE
12-Aug-2020 01:05:25 > Task :smack-resolver-javax:testFixturesClasses UP-TO-DATE
12-Aug-2020 01:05:25 > Task :smack-resolver-javax:checkstyleTestFixtures NO-SOURCE
12-Aug-2020 01:05:25 > Task :smack-resolver-javax:clirr
12-Aug-2020 01:05:25 > Task :smack-resolver-javax:testFixturesJar
12-Aug-2020 01:05:25 > Task :smack-resolver-javax:test NO-SOURCE
12-Aug-2020 01:05:25 > Task :smack-resolver-javax:check
12-Aug-2020 01:05:25 > Task :smack-resolver-javax:build
12-Aug-2020 01:05:25 > Task :smack-resolver-minidns:assemble
12-Aug-2020 01:05:25 > Task :smack-resolver-minidns:animalsnifferMain
12-Aug-2020 01:05:25 > Task :smack-resolver-minidns:checkstyleMain
12-Aug-2020 01:05:25 > Task :smack-resolver-minidns:compileTestFixturesJava NO-SOURCE
12-Aug-2020 01:05:25 > Task :smack-resolver-minidns:compileTestJava NO-SOURCE
12-Aug-2020 01:05:25 > Task :smack-resolver-minidns:processTestResources NO-SOURCE
12-Aug-2020 01:05:25 > Task :smack-resolver-minidns:testClasses UP-TO-DATE
12-Aug-2020 01:05:25 > Task :smack-resolver-minidns:checkstyleTest NO-SOURCE
12-Aug-2020 01:05:25 > Task :smack-resolver-minidns:processTestFixturesResources NO-SOURCE
12-Aug-2020 01:05:25 > Task :smack-resolver-minidns:testFixturesClasses UP-TO-DATE
12-Aug-2020 01:05:25 > Task :smack-resolver-minidns:checkstyleTestFixtures NO-SOURCE
12-Aug-2020 01:05:25 > Task :smack-resolver-minidns:clirr
12-Aug-2020 01:05:25 > Task :smack-resolver-minidns:testFixturesJar
12-Aug-2020 01:05:25 > Task :smack-resolver-minidns:test NO-SOURCE
12-Aug-2020 01:05:25 > Task :smack-resolver-minidns:check
12-Aug-2020 01:05:25 > Task :smack-resolver-minidns:build
12-Aug-2020 01:05:25 > Task :smack-resolver-minidns-dox:assemble
12-Aug-2020 01:05:25 > Task :smack-resolver-minidns-dox:checkstyleMain
12-Aug-2020 01:05:25 > Task :smack-resolver-minidns-dox:compileTestFixturesJava NO-SOURCE
12-Aug-2020 01:05:26 > Task :smack-resolver-minidns-dox:compileTestJava
12-Aug-2020 01:05:26 > Task :smack-resolver-minidns-dox:processTestResources NO-SOURCE
12-Aug-2020 01:05:26 > Task :smack-resolver-minidns-dox:testClasses
12-Aug-2020 01:05:26 > Task :smack-resolver-minidns-dox:checkstyleTest
12-Aug-2020 01:05:26 > Task :smack-resolver-minidns-dox:processTestFixturesResources NO-SOURCE
12-Aug-2020 01:05:26 > Task :smack-resolver-minidns-dox:testFixturesClasses UP-TO-DATE
12-Aug-2020 01:05:26 > Task :smack-resolver-minidns-dox:checkstyleTestFixtures NO-SOURCE
12-Aug-2020 01:05:26 > Task :smack-resolver-minidns-dox:clirr
12-Aug-2020 01:05:26 > Task :smack-resolver-minidns-dox:testFixturesJar
12-Aug-2020 01:05:28
12-Aug-2020 01:05:28 > Task :smack-resolver-minidns-dox:test
12-Aug-2020 01:05:28
12-Aug-2020 01:05:28 > Task :smack-resolver-minidns-dox:check
12-Aug-2020 01:05:28 > Task :smack-resolver-minidns-dox:build
12-Aug-2020 01:05:28 > Task :smack-sasl-javax:assemble
12-Aug-2020 01:05:28 NOTE: Picked up JDK_JAVA_OPTIONS:  --add-opens=java.base/java.lang=ALL-UNNAMED --add-opens=java.base/java.io=ALL-UNNAMED --add-opens=java.rmi/sun.rmi.transport=ALL-UNNAMED
12-Aug-2020 01:05:28 > Task :smack-sasl-javax:checkstyleMain
12-Aug-2020 01:05:28 > Task :smack-sasl-javax:compileTestFixturesJava NO-SOURCE
12-Aug-2020 01:05:29 > Task :smack-sasl-javax:compileTestJava
12-Aug-2020 01:05:29 > Task :smack-sasl-javax:processTestResources NO-SOURCE
12-Aug-2020 01:05:29 > Task :smack-sasl-javax:testClasses
12-Aug-2020 01:05:29 > Task :smack-sasl-javax:checkstyleTest
12-Aug-2020 01:05:29 > Task :smack-sasl-javax:processTestFixturesResources NO-SOURCE
12-Aug-2020 01:05:29 > Task :smack-sasl-javax:testFixturesClasses UP-TO-DATE
12-Aug-2020 01:05:29 > Task :smack-sasl-javax:checkstyleTestFixtures NO-SOURCE
12-Aug-2020 01:05:29 > Task :smack-sasl-javax:clirr
12-Aug-2020 01:05:29 > Task :smack-sasl-javax:testFixturesJar
12-Aug-2020 01:05:31
12-Aug-2020 01:05:31 > Task :smack-sasl-javax:test
12-Aug-2020 01:05:31 NOTE: Picked up JDK_JAVA_OPTIONS:  --add-opens=java.base/java.lang=ALL-UNNAMED --add-opens=java.base/java.io=ALL-UNNAMED --add-opens=java.rmi/sun.rmi.transport=ALL-UNNAMED
12-Aug-2020 01:05:31
12-Aug-2020 01:05:31 > Task :smack-sasl-javax:check
12-Aug-2020 01:05:31 > Task :smack-sasl-javax:build
12-Aug-2020 01:05:31 > Task :smack-sasl-provided:assemble
12-Aug-2020 01:05:32 > Task :smack-sasl-provided:animalsnifferMain
12-Aug-2020 01:05:32 > Task :smack-sasl-provided:checkstyleMain
12-Aug-2020 01:05:32 > Task :smack-sasl-provided:compileTestFixturesJava NO-SOURCE
12-Aug-2020 01:05:32 > Task :smack-sasl-provided:compileTestJava
12-Aug-2020 01:05:32 > Task :smack-sasl-provided:processTestResources NO-SOURCE
12-Aug-2020 01:05:32 > Task :smack-sasl-provided:testClasses
12-Aug-2020 01:05:33 > Task :smack-sasl-provided:checkstyleTest
12-Aug-2020 01:05:33 > Task :smack-sasl-provided:processTestFixturesResources NO-SOURCE
12-Aug-2020 01:05:33 > Task :smack-sasl-provided:testFixturesClasses UP-TO-DATE
12-Aug-2020 01:05:33 > Task :smack-sasl-provided:checkstyleTestFixtures NO-SOURCE
12-Aug-2020 01:05:33 > Task :smack-sasl-provided:clirr
12-Aug-2020 01:05:33 > Task :smack-sasl-provided:testFixturesJar
12-Aug-2020 01:05:35
12-Aug-2020 01:05:35 > Task :smack-sasl-provided:test
12-Aug-2020 01:05:35 NOTE: Picked up JDK_JAVA_OPTIONS:  --add-opens=java.base/java.lang=ALL-UNNAMED --add-opens=java.base/java.io=ALL-UNNAMED --add-opens=java.rmi/sun.rmi.transport=ALL-UNNAMED
12-Aug-2020 01:05:35
12-Aug-2020 01:05:35 > Task :smack-sasl-provided:check
12-Aug-2020 01:05:35 > Task :smack-sasl-provided:build
12-Aug-2020 01:05:35 > Task :smack-tcp:assemble
12-Aug-2020 01:05:35 > Task :smack-tcp:animalsnifferMain
12-Aug-2020 01:05:36 > Task :smack-tcp:checkstyleMain
12-Aug-2020 01:05:36 > Task :smack-tcp:compileTestFixturesJava NO-SOURCE
12-Aug-2020 01:05:37 > Task :smack-tcp:compileTestJava
12-Aug-2020 01:05:37 > Task :smack-tcp:processTestResources NO-SOURCE
12-Aug-2020 01:05:37 > Task :smack-tcp:testClasses
12-Aug-2020 01:05:37 > Task :smack-tcp:checkstyleTest
12-Aug-2020 01:05:37 > Task :smack-tcp:processTestFixturesResources NO-SOURCE
12-Aug-2020 01:05:37 > Task :smack-tcp:testFixturesClasses UP-TO-DATE
12-Aug-2020 01:05:37 > Task :smack-tcp:checkstyleTestFixtures NO-SOURCE
12-Aug-2020 01:05:37 > Task :smack-tcp:clirr
12-Aug-2020 01:05:37 > Task :smack-tcp:testFixturesJar
12-Aug-2020 01:05:39
12-Aug-2020 01:05:39 > Task :smack-tcp:test
12-Aug-2020 01:05:39 NOTE: Picked up JDK_JAVA_OPTIONS:  --add-opens=java.base/java.lang=ALL-UNNAMED --add-opens=java.base/java.io=ALL-UNNAMED --add-opens=java.rmi/sun.rmi.transport=ALL-UNNAMED
12-Aug-2020 01:05:40
12-Aug-2020 01:05:40 > Task :smack-tcp:check
12-Aug-2020 01:05:40 > Task :smack-tcp:build
12-Aug-2020 01:05:40 > Task :smack-xmlparser:assemble
12-Aug-2020 01:05:40 > Task :smack-xmlparser:animalsnifferMain
12-Aug-2020 01:05:40 > Task :smack-xmlparser:checkstyleMain
12-Aug-2020 01:05:40 > Task :smack-xmlparser:compileTestFixturesJava NO-SOURCE
12-Aug-2020 01:05:41 > Task :smack-xmlparser:compileTestJava
12-Aug-2020 01:05:41 > Task :smack-xmlparser:processTestResources NO-SOURCE
12-Aug-2020 01:05:41 > Task :smack-xmlparser:testClasses
12-Aug-2020 01:05:41 > Task :smack-xmlparser:checkstyleTest
12-Aug-2020 01:05:41 > Task :smack-xmlparser:processTestFixturesResources NO-SOURCE
12-Aug-2020 01:05:41 > Task :smack-xmlparser:testFixturesClasses UP-TO-DATE
12-Aug-2020 01:05:41 > Task :smack-xmlparser:checkstyleTestFixtures NO-SOURCE
12-Aug-2020 01:05:41 > Task :smack-xmlparser:clirr
12-Aug-2020 01:05:41 > Task :smack-xmlparser:testFixturesJar
12-Aug-2020 01:05:43
12-Aug-2020 01:05:43 > Task :smack-xmlparser:test
12-Aug-2020 01:05:43 NOTE: Picked up JDK_JAVA_OPTIONS:  --add-opens=java.base/java.lang=ALL-UNNAMED --add-opens=java.base/java.io=ALL-UNNAMED --add-opens=java.rmi/sun.rmi.transport=ALL-UNNAMED
12-Aug-2020 01:05:43
12-Aug-2020 01:05:43 > Task :smack-xmlparser:check
12-Aug-2020 01:05:43 > Task :smack-xmlparser:build
12-Aug-2020 01:05:43 > Task :smack-xmlparser-stax:assemble
12-Aug-2020 01:05:43 > Task :smack-xmlparser-stax:checkstyleMain
12-Aug-2020 01:05:43 > Task :smack-xmlparser-stax:compileTestFixturesJava NO-SOURCE
12-Aug-2020 01:05:44 > Task :smack-xmlparser-stax:compileTestJava
12-Aug-2020 01:05:44 > Task :smack-xmlparser-stax:processTestResources NO-SOURCE
12-Aug-2020 01:05:44 > Task :smack-xmlparser-stax:testClasses
12-Aug-2020 01:05:44 > Task :smack-xmlparser-stax:checkstyleTest
12-Aug-2020 01:05:44 > Task :smack-xmlparser-stax:processTestFixturesResources NO-SOURCE
12-Aug-2020 01:05:44 > Task :smack-xmlparser-stax:testFixturesClasses UP-TO-DATE
12-Aug-2020 01:05:44 > Task :smack-xmlparser-stax:checkstyleTestFixtures NO-SOURCE
12-Aug-2020 01:05:44 > Task :smack-xmlparser-stax:clirr
12-Aug-2020 01:05:44 > Task :smack-xmlparser-stax:testFixturesJar
12-Aug-2020 01:05:46
12-Aug-2020 01:05:46 > Task :smack-xmlparser-stax:test
12-Aug-2020 01:05:46
12-Aug-2020 01:05:46 > Task :smack-xmlparser-stax:check
12-Aug-2020 01:05:46 > Task :smack-xmlparser-stax:build
12-Aug-2020 01:05:46 > Task :smack-xmlparser-xpp3:assemble
12-Aug-2020 01:05:46 NOTE: Picked up JDK_JAVA_OPTIONS:  --add-opens=java.base/java.lang=ALL-UNNAMED --add-opens=java.base/java.io=ALL-UNNAMED --add-opens=java.rmi/sun.rmi.transport=ALL-UNNAMED
12-Aug-2020 01:05:46 > Task :smack-xmlparser-xpp3:animalsnifferMain
12-Aug-2020 01:05:46 > Task :smack-xmlparser-xpp3:checkstyleMain
12-Aug-2020 01:05:46 > Task :smack-xmlparser-xpp3:compileTestFixturesJava NO-SOURCE
12-Aug-2020 01:05:47 > Task :smack-xmlparser-xpp3:compileTestJava
12-Aug-2020 01:05:47 > Task :smack-xmlparser-xpp3:processTestResources NO-SOURCE
12-Aug-2020 01:05:47 > Task :smack-xmlparser-xpp3:testClasses
12-Aug-2020 01:05:47 > Task :smack-xmlparser-xpp3:checkstyleTest
12-Aug-2020 01:05:47 > Task :smack-xmlparser-xpp3:processTestFixturesResources NO-SOURCE
12-Aug-2020 01:05:47 > Task :smack-xmlparser-xpp3:testFixturesClasses UP-TO-DATE
12-Aug-2020 01:05:47 > Task :smack-xmlparser-xpp3:checkstyleTestFixtures NO-SOURCE
12-Aug-2020 01:05:47 > Task :smack-xmlparser-xpp3:clirr
12-Aug-2020 01:05:47 > Task :smack-xmlparser-xpp3:testFixturesJar
12-Aug-2020 01:05:48 NOTE: Picked up JDK_JAVA_OPTIONS:  --add-opens=java.base/java.lang=ALL-UNNAMED --add-opens=java.base/java.io=ALL-UNNAMED --add-opens=java.rmi/sun.rmi.transport=ALL-UNNAMED
12-Aug-2020 01:05:48
12-Aug-2020 01:05:48 > Task :smack-xmlparser-xpp3:test
12-Aug-2020 01:05:48
12-Aug-2020 01:05:48 > Task :smack-xmlparser-xpp3:check
12-Aug-2020 01:05:48 > Task :smack-xmlparser-xpp3:build
12-Aug-2020 01:05:52 > Task :distributionZip
12-Aug-2020 01:05:54 > Task :smack-core:jacocoTestReport
12-Aug-2020 01:05:55 > Task :smack-experimental:jacocoTestReport
12-Aug-2020 01:05:57 > Task :smack-extensions:jacocoTestReport
12-Aug-2020 01:05:57 > Task :smack-im:jacocoTestReport
12-Aug-2020 01:05:57 > Task :smack-integration-test:jacocoTestReport
12-Aug-2020 01:05:57 > Task :smack-java8-full:jacocoTestReport
12-Aug-2020 01:05:58 > Task :smack-legacy:jacocoTestReport
12-Aug-2020 01:05:58 > Task :smack-omemo:jacocoTestReport
12-Aug-2020 01:05:58 > Task :smack-omemo-signal:jacocoTestReport
12-Aug-2020 01:05:58 > Task :smack-openpgp:jacocoTestReport
12-Aug-2020 01:05:59 > Task :smack-repl:jacocoTestReport
12-Aug-2020 01:05:59 > Task :smack-resolver-minidns-dox:jacocoTestReport
12-Aug-2020 01:05:59 > Task :smack-sasl-javax:jacocoTestReport
12-Aug-2020 01:05:59 > Task :smack-sasl-provided:jacocoTestReport
12-Aug-2020 01:05:59 > Task :smack-tcp:jacocoTestReport
12-Aug-2020 01:05:59 > Task :smack-xmlparser:jacocoTestReport
12-Aug-2020 01:05:59 > Task :smack-xmlparser-stax:jacocoTestReport
12-Aug-2020 01:05:59 > Task :smack-xmlparser-xpp3:jacocoTestReport
12-Aug-2020 01:06:04 > Task :jacocoRootReport
12-Aug-2020 01:06:04
12-Aug-2020 01:06:04 Deprecated Gradle features were used in this build, making it incompatible with Gradle 7.0.
12-Aug-2020 01:06:04 Use '--warning-mode all' to show the individual deprecation warnings.
12-Aug-2020 01:06:04 See https://docs.gradle.org/6.4.1/userguide/command_line_interface.html#sec:command_line_warnings
12-Aug-2020 01:06:04
12-Aug-2020 01:06:04 BUILD SUCCESSFUL in 5m 58s
12-Aug-2020 01:06:04 327 actionable tasks: 297 executed, 30 up-to-date
12-Aug-2020 01:06:05 Finished task 'Run unit tests and create distribution Zip' with result: Success
12-Aug-2020 01:06:05 Starting task 'Parse test reports' of type 'com.atlassian.bamboo.plugins.testresultparser:task.testresultparser.junit'
12-Aug-2020 01:06:05 Parsing test results under /var/atlassian/bamboo-home/xml-data/build-dir/SMACK-NIGHTLYSTABLE-JOB1...
12-Aug-2020 01:06:06 Finished task 'Parse test reports' with result: Success
12-Aug-2020 01:06:06 Starting task 'Publish artifacts to archiva' of type 'com.atlassian.bamboo.plugins.scripttask:task.builder.script'
12-Aug-2020 01:06:06
Beginning to execute external process for build 'Smack - Nightly Binary Distribution Build (stable-branch) - Default Job #170 (SMACK-NIGHTLYSTABLE-JOB1-170)'
... running command line:
/var/atlassian/bamboo-home/temp/SMACK-NIGHTLYSTABLE-JOB1-170-ScriptBuildTask-8472700085755435653.sh
... in: /var/atlassian/bamboo-home/xml-data/build-dir/SMACK-NIGHTLYSTABLE-JOB1
... using extra environment variables:
bamboo_planRepository_1_branch=4.4
bamboo_planRepository_1_branchDisplayName=4.4
bamboo_repository_revision_number=f00804ef72ba7a0ba6da0cba18675d4b8e2ea2df
bamboo_capability_daily_xfer=
bamboo_resultsUrl=https://bamboo.igniterealtime.org/browse/SMACK-NIGHTLYSTABLE-JOB1-170
bamboo_build_working_directory=/var/atlassian/bamboo-home/xml-data/build-dir/SMACK-NIGHTLYSTABLE-JOB1
bamboo_capability_system_builder_command_Gradle=/opt/gradle/bin/gradle
bamboo_planRepository_1_name=Smack (4.4)
bamboo_buildKey=SMACK-NIGHTLYSTABLE-JOB1
bamboo_repository_65241089_revision_number=f00804ef72ba7a0ba6da0cba18675d4b8e2ea2df
bamboo_repository_65241089_git_repositoryUrl=https://github.com/igniterealtime/Smack.git
bamboo_repository_65241089_previous_revision_number=89c5895ab334770f826b00714fb27406b536d5a9
bamboo_repository_65241089_git_username=
bamboo_shortPlanName=Nightly Binary Distribution Build (stable-branch)
bamboo_planRepository_name=Smack (4.4)
bamboo_capability_system_jdk_JDK_1_6_0_20=/opt/java/sdk/Sun/jdk1.6.0_20
bamboo_buildNumber=170
bamboo_shortJobName=Default Job
bamboo_buildResultsUrl=https://bamboo.igniterealtime.org/browse/SMACK-NIGHTLYSTABLE-JOB1-170
bamboo_capability_system_builder_command_Gradle__Faketime_=/opt/gradle-faketime
bamboo_planRepository_repositoryUrl=https://github.com/igniterealtime/Smack.git
bamboo_repository_65241089_branch_name=4.4
bamboo_agentId=131073
bamboo_planName=Smack - Nightly Binary Distribution Build (stable-branch)
bamboo_shortPlanKey=NIGHTLYSTABLE
bamboo_capability_system_builder_command_Gradle_4_9=/opt/gradle-4.9/bin/gradle
bamboo_shortJobKey=JOB1
bamboo_planRepository_revision=f00804ef72ba7a0ba6da0cba18675d4b8e2ea2df
bamboo_repository_65241089_git_branch=4.4
bamboo_buildTimeStamp=2020-08-12T01:00:03.516Z
bamboo_repository_previous_revision_number=89c5895ab334770f826b00714fb27406b536d5a9
bamboo_capability_system_builder_mvn2_Maven_2=/opt/maven/apache-maven-2.2.1
bamboo_planRepository_previousRevision=89c5895ab334770f826b00714fb27406b536d5a9
bamboo_capability_rpm=
bamboo_capability_system_builder_ant_Ant_1_9_4=/opt/apache-ant-1.9.4
bamboo_repository_65241089_name=Smack (4.4)
bamboo_repository_git_branch=4.4
bamboo_buildResultKey=SMACK-NIGHTLYSTABLE-JOB1-170
bamboo_repository_branch_name=4.4
bamboo_buildPlanName=Smack - Nightly Binary Distribution Build (stable-branch) - Default Job
bamboo_capability_Install4j=7.0.7
bamboo_planRepository_1_revision=f00804ef72ba7a0ba6da0cba18675d4b8e2ea2df
bamboo_capability_system_builder_ant_Ant_1_7_1=/opt/apache-ant-1.7.1
bamboo_repository_name=Smack (4.4)
bamboo_capability_system_builder_mvn2_Maven_2_2_1=/opt/maven/apache-maven-2.2.1
bamboo_buildFailed=false
bamboo_planRepository_branch=4.4
bamboo_capability_system_jdk_JDK_1_7_0_51=/opt/java/sdk/1.7
bamboo_capability_system_builder_command_Bash=/bin/bash
bamboo_agentWorkingDirectory=/var/atlassian/bamboo-home/xml-data/build-dir
bamboo_capability_system_git_executable=/usr/bin/git
bamboo_repository_git_username=
bamboo_planRepository_1_previousRevision=89c5895ab334770f826b00714fb27406b536d5a9
bamboo_planRepository_branchDisplayName=4.4
bamboo_capability_system_jdk_JDK_11=/usr/lib/jvm/java-11-amazon-corretto.x86_64
bamboo_planRepository_1_type=gitv2
bamboo_planRepository_branchName=4.4
bamboo_capability_flex_sdk=4.6
bamboo_capability_system_builder_mvn3_Maven=/opt/maven
bamboo_capability_system_jdk_JDK=/opt/java/sdk/current
bamboo_capability_android=
bamboo_plan_storageTag=plan-35880993
bamboo_hg_cache_directory=/var/atlassian/bamboo-home/xml-data/build-dir/_hg-repositories-cache
bamboo_planRepository_1_username=
bamboo_planRepository_type=gitv2
bamboo_git_cache_directory=/var/atlassian/bamboo-home/xml-data/build-dir/_git-repositories-cache
bamboo_repository_git_repositoryUrl=https://github.com/igniterealtime/Smack.git
bamboo_build_commandline_com_atlassian_bamboo_plugins_scripttask_task_builder_command_6=/opt/gradle/bin/gradle --stacktrace --no-daemon -Dorg.gradle.java.home=/usr/lib/jvm/java-11-amazon-corretto.x86_64 clean distributionZip javadocAll jacocoRootReport
bamboo_capability_system_builder_ant_Ant=/opt/apache-ant-1.9.7
bamboo_tmp_directory=/var/atlassian/bamboo-home/temp
bamboo_working_directory=/var/atlassian/bamboo-home/xml-data/build-dir/SMACK-NIGHTLYSTABLE-JOB1
bamboo_capability_faketime=
bamboo_planKey=SMACK-NIGHTLYSTABLE
bamboo_planRepository_1_repositoryUrl=https://github.com/igniterealtime/Smack.git
bamboo_planRepository_username=
bamboo_capability_system_jdk_JDK_1_8=/opt/java/sdk/1.8
bamboo_capability_system_builder_ant_Ant_1_8_1=/opt/apache-ant-1.8.1
bamboo_capability_system_jdk_JDK_1_6=/opt/java/sdk/1.6
bamboo_capability_system_jdk_JDK_1_7=/opt/java/sdk/1.7
bamboo_capability_system_builder_ant_Ant_1_6_5=/opt/apache-ant-1.6.5
bamboo_planRepository_1_branchName=4.4
12-Aug-2020 01:06:07 Starting a Gradle Daemon (subsequent builds will be faster)
12-Aug-2020 01:06:18 Maven publication 'mavenJava' pom metadata warnings (silence with 'suppressPomMetadataWarningsFor(variant)'):
12-Aug-2020 01:06:18   - Variant testFixturesApiElements:
12-Aug-2020 01:06:18       - Declares capability org.igniterealtime.smack:smack-android-test-fixtures:4.4.0-beta2-SNAPSHOT which cannot be mapped to Maven
12-Aug-2020 01:06:18   - Variant testFixturesRuntimeElements:
12-Aug-2020 01:06:18       - Declares capability org.igniterealtime.smack:smack-android-test-fixtures:4.4.0-beta2-SNAPSHOT which cannot be mapped to Maven
12-Aug-2020 01:06:18 These issues indicate information that is lost in the published 'pom' metadata file, which may be an issue if the published library is consumed by an old Gradle version or Apache Maven.
12-Aug-2020 01:06:18 The 'module' metadata file, which is used by Gradle 6+ is not affected.
12-Aug-2020 01:06:18 Maven publication 'mavenJava' pom metadata warnings (silence with 'suppressPomMetadataWarningsFor(variant)'):
12-Aug-2020 01:06:18   - Variant testFixturesApiElements:
12-Aug-2020 01:06:18       - Declares capability org.igniterealtime.smack:smack-android-extensions-test-fixtures:4.4.0-beta2-SNAPSHOT which cannot be mapped to Maven
12-Aug-2020 01:06:18   - Variant testFixturesRuntimeElements:
12-Aug-2020 01:06:18       - Declares capability org.igniterealtime.smack:smack-android-extensions-test-fixtures:4.4.0-beta2-SNAPSHOT which cannot be mapped to Maven
12-Aug-2020 01:06:18 These issues indicate information that is lost in the published 'pom' metadata file, which may be an issue if the published library is consumed by an old Gradle version or Apache Maven.
12-Aug-2020 01:06:18 The 'module' metadata file, which is used by Gradle 6+ is not affected.
12-Aug-2020 01:06:18 Maven publication 'mavenJava' pom metadata warnings (silence with 'suppressPomMetadataWarningsFor(variant)'):
12-Aug-2020 01:06:18   - Variant testFixturesApiElements:
12-Aug-2020 01:06:18       - Declares capability org.igniterealtime.smack:smack-bosh-test-fixtures:4.4.0-beta2-SNAPSHOT which cannot be mapped to Maven
12-Aug-2020 01:06:18   - Variant testFixturesRuntimeElements:
12-Aug-2020 01:06:18       - Declares capability org.igniterealtime.smack:smack-bosh-test-fixtures:4.4.0-beta2-SNAPSHOT which cannot be mapped to Maven
12-Aug-2020 01:06:18 These issues indicate information that is lost in the published 'pom' metadata file, which may be an issue if the published library is consumed by an old Gradle version or Apache Maven.
12-Aug-2020 01:06:18 The 'module' metadata file, which is used by Gradle 6+ is not affected.
12-Aug-2020 01:06:18 Maven publication 'mavenJava' pom metadata warnings (silence with 'suppressPomMetadataWarningsFor(variant)'):
12-Aug-2020 01:06:18   - Variant testFixturesApiElements:
12-Aug-2020 01:06:18       - Declares capability org.igniterealtime.smack:smack-core-test-fixtures:4.4.0-beta2-SNAPSHOT which cannot be mapped to Maven
12-Aug-2020 01:06:18   - Variant testFixturesRuntimeElements:
12-Aug-2020 01:06:18       - Declares capability org.igniterealtime.smack:smack-core-test-fixtures:4.4.0-beta2-SNAPSHOT which cannot be mapped to Maven
12-Aug-2020 01:06:18 These issues indicate information that is lost in the published 'pom' metadata file, which may be an issue if the published library is consumed by an old Gradle version or Apache Maven.
12-Aug-2020 01:06:18 The 'module' metadata file, which is used by Gradle 6+ is not affected.
12-Aug-2020 01:06:18 Maven publication 'mavenJava' pom metadata warnings (silence with 'suppressPomMetadataWarningsFor(variant)'):
12-Aug-2020 01:06:18   - Variant testFixturesApiElements:
12-Aug-2020 01:06:18       - Declares capability org.igniterealtime.smack:smack-debug-test-fixtures:4.4.0-beta2-SNAPSHOT which cannot be mapped to Maven
12-Aug-2020 01:06:18   - Variant testFixturesRuntimeElements:
12-Aug-2020 01:06:18       - Declares capability org.igniterealtime.smack:smack-debug-test-fixtures:4.4.0-beta2-SNAPSHOT which cannot be mapped to Maven
12-Aug-2020 01:06:18 These issues indicate information that is lost in the published 'pom' metadata file, which may be an issue if the published library is consumed by an old Gradle version or Apache Maven.
12-Aug-2020 01:06:18 The 'module' metadata file, which is used by Gradle 6+ is not affected.
12-Aug-2020 01:06:18 Maven publication 'mavenJava' pom metadata warnings (silence with 'suppressPomMetadataWarningsFor(variant)'):
12-Aug-2020 01:06:18   - Variant testFixturesApiElements:
12-Aug-2020 01:06:18       - Declares capability org.igniterealtime.smack:smack-debug-slf4j-test-fixtures:4.4.0-beta2-SNAPSHOT which cannot be mapped to Maven
12-Aug-2020 01:06:18   - Variant testFixturesRuntimeElements:
12-Aug-2020 01:06:18       - Declares capability org.igniterealtime.smack:smack-debug-slf4j-test-fixtures:4.4.0-beta2-SNAPSHOT which cannot be mapped to Maven
12-Aug-2020 01:06:18 These issues indicate information that is lost in the published 'pom' metadata file, which may be an issue if the published library is consumed by an old Gradle version or Apache Maven.
12-Aug-2020 01:06:18 The 'module' metadata file, which is used by Gradle 6+ is not affected.
12-Aug-2020 01:06:18 Maven publication 'mavenJava' pom metadata warnings (silence with 'suppressPomMetadataWarningsFor(variant)'):
12-Aug-2020 01:06:18   - Variant testFixturesApiElements:
12-Aug-2020 01:06:18       - Declares capability org.igniterealtime.smack:smack-experimental-test-fixtures:4.4.0-beta2-SNAPSHOT which cannot be mapped to Maven
12-Aug-2020 01:06:18   - Variant testFixturesRuntimeElements:
12-Aug-2020 01:06:18       - Declares capability org.igniterealtime.smack:smack-experimental-test-fixtures:4.4.0-beta2-SNAPSHOT which cannot be mapped to Maven
12-Aug-2020 01:06:18 These issues indicate information that is lost in the published 'pom' metadata file, which may be an issue if the published library is consumed by an old Gradle version or Apache Maven.
12-Aug-2020 01:06:18 The 'module' metadata file, which is used by Gradle 6+ is not affected.
12-Aug-2020 01:06:18 Maven publication 'mavenJava' pom metadata warnings (silence with 'suppressPomMetadataWarningsFor(variant)'):
12-Aug-2020 01:06:18   - Variant testFixturesApiElements:
12-Aug-2020 01:06:18       - Declares capability org.igniterealtime.smack:smack-extensions-test-fixtures:4.4.0-beta2-SNAPSHOT which cannot be mapped to Maven
12-Aug-2020 01:06:18   - Variant testFixturesRuntimeElements:
12-Aug-2020 01:06:18       - Declares capability org.igniterealtime.smack:smack-extensions-test-fixtures:4.4.0-beta2-SNAPSHOT which cannot be mapped to Maven
12-Aug-2020 01:06:18 These issues indicate information that is lost in the published 'pom' metadata file, which may be an issue if the published library is consumed by an old Gradle version or Apache Maven.
12-Aug-2020 01:06:18 The 'module' metadata file, which is used by Gradle 6+ is not affected.
12-Aug-2020 01:06:18 Maven publication 'mavenJava' pom metadata warnings (silence with 'suppressPomMetadataWarningsFor(variant)'):
12-Aug-2020 01:06:18   - Variant testFixturesApiElements:
12-Aug-2020 01:06:18       - Declares capability org.igniterealtime.smack:smack-im-test-fixtures:4.4.0-beta2-SNAPSHOT which cannot be mapped to Maven
12-Aug-2020 01:06:18   - Variant testFixturesRuntimeElements:
12-Aug-2020 01:06:18       - Declares capability org.igniterealtime.smack:smack-im-test-fixtures:4.4.0-beta2-SNAPSHOT which cannot be mapped to Maven
12-Aug-2020 01:06:18 These issues indicate information that is lost in the published 'pom' metadata file, which may be an issue if the published library is consumed by an old Gradle version or Apache Maven.
12-Aug-2020 01:06:18 The 'module' metadata file, which is used by Gradle 6+ is not affected.
12-Aug-2020 01:06:18 Maven publication 'mavenJava' pom metadata warnings (silence with 'suppressPomMetadataWarningsFor(variant)'):
12-Aug-2020 01:06:18   - Variant testFixturesApiElements:
12-Aug-2020 01:06:18       - Declares capability org.igniterealtime.smack:smack-integration-test-test-fixtures:4.4.0-beta2-SNAPSHOT which cannot be mapped to Maven
12-Aug-2020 01:06:18   - Variant testFixturesRuntimeElements:
12-Aug-2020 01:06:18       - Declares capability org.igniterealtime.smack:smack-integration-test-test-fixtures:4.4.0-beta2-SNAPSHOT which cannot be mapped to Maven
12-Aug-2020 01:06:18 These issues indicate information that is lost in the published 'pom' metadata file, which may be an issue if the published library is consumed by an old Gradle version or Apache Maven.
12-Aug-2020 01:06:18 The 'module' metadata file, which is used by Gradle 6+ is not affected.
12-Aug-2020 01:06:18 Maven publication 'mavenJava' pom metadata warnings (silence with 'suppressPomMetadataWarningsFor(variant)'):
12-Aug-2020 01:06:18   - Variant testFixturesApiElements:
12-Aug-2020 01:06:18       - Declares capability org.igniterealtime.smack:smack-java7-test-fixtures:4.4.0-beta2-SNAPSHOT which cannot be mapped to Maven
12-Aug-2020 01:06:18   - Variant testFixturesRuntimeElements:
12-Aug-2020 01:06:18       - Declares capability org.igniterealtime.smack:smack-java7-test-fixtures:4.4.0-beta2-SNAPSHOT which cannot be mapped to Maven
12-Aug-2020 01:06:18 These issues indicate information that is lost in the published 'pom' metadata file, which may be an issue if the published library is consumed by an old Gradle version or Apache Maven.
12-Aug-2020 01:06:18 The 'module' metadata file, which is used by Gradle 6+ is not affected.
12-Aug-2020 01:06:18 Maven publication 'mavenJava' pom metadata warnings (silence with 'suppressPomMetadataWarningsFor(variant)'):
12-Aug-2020 01:06:18   - Variant testFixturesApiElements:
12-Aug-2020 01:06:18       - Declares capability org.igniterealtime.smack:smack-java8-full-test-fixtures:4.4.0-beta2-SNAPSHOT which cannot be mapped to Maven
12-Aug-2020 01:06:18   - Variant testFixturesRuntimeElements:
12-Aug-2020 01:06:18       - Declares capability org.igniterealtime.smack:smack-java8-full-test-fixtures:4.4.0-beta2-SNAPSHOT which cannot be mapped to Maven
12-Aug-2020 01:06:18 These issues indicate information that is lost in the published 'pom' metadata file, which may be an issue if the published library is consumed by an old Gradle version or Apache Maven.
12-Aug-2020 01:06:18 The 'module' metadata file, which is used by Gradle 6+ is not affected.
12-Aug-2020 01:06:18 Maven publication 'mavenJava' pom metadata warnings (silence with 'suppressPomMetadataWarningsFor(variant)'):
12-Aug-2020 01:06:18   - Variant testFixturesApiElements:
12-Aug-2020 01:06:18       - Declares capability org.igniterealtime.smack:smack-jingle-old-test-fixtures:4.4.0-beta2-SNAPSHOT which cannot be mapped to Maven
12-Aug-2020 01:06:18   - Variant testFixturesRuntimeElements:
12-Aug-2020 01:06:18       - Declares capability org.igniterealtime.smack:smack-jingle-old-test-fixtures:4.4.0-beta2-SNAPSHOT which cannot be mapped to Maven
12-Aug-2020 01:06:18 These issues indicate information that is lost in the published 'pom' metadata file, which may be an issue if the published library is consumed by an old Gradle version or Apache Maven.
12-Aug-2020 01:06:18 The 'module' metadata file, which is used by Gradle 6+ is not affected.
12-Aug-2020 01:06:18 Maven publication 'mavenJava' pom metadata warnings (silence with 'suppressPomMetadataWarningsFor(variant)'):
12-Aug-2020 01:06:18   - Variant testFixturesApiElements:
12-Aug-2020 01:06:18       - Declares capability org.igniterealtime.smack:smack-legacy-test-fixtures:4.4.0-beta2-SNAPSHOT which cannot be mapped to Maven
12-Aug-2020 01:06:18   - Variant testFixturesRuntimeElements:
12-Aug-2020 01:06:18       - Declares capability org.igniterealtime.smack:smack-legacy-test-fixtures:4.4.0-beta2-SNAPSHOT which cannot be mapped to Maven
12-Aug-2020 01:06:18 These issues indicate information that is lost in the published 'pom' metadata file, which may be an issue if the published library is consumed by an old Gradle version or Apache Maven.
12-Aug-2020 01:06:18 The 'module' metadata file, which is used by Gradle 6+ is not affected.
12-Aug-2020 01:06:18 Maven publication 'mavenJava' pom metadata warnings (silence with 'suppressPomMetadataWarningsFor(variant)'):
12-Aug-2020 01:06:18   - Variant testFixturesApiElements:
12-Aug-2020 01:06:18       - Declares capability org.igniterealtime.smack:smack-omemo-test-fixtures:4.4.0-beta2-SNAPSHOT which cannot be mapped to Maven
12-Aug-2020 01:06:18   - Variant testFixturesRuntimeElements:
12-Aug-2020 01:06:18       - Declares capability org.igniterealtime.smack:smack-omemo-test-fixtures:4.4.0-beta2-SNAPSHOT which cannot be mapped to Maven
12-Aug-2020 01:06:18 These issues indicate information that is lost in the published 'pom' metadata file, which may be an issue if the published library is consumed by an old Gradle version or Apache Maven.
12-Aug-2020 01:06:18 The 'module' metadata file, which is used by Gradle 6+ is not affected.
12-Aug-2020 01:06:18 Maven publication 'mavenJava' pom metadata warnings (silence with 'suppressPomMetadataWarningsFor(variant)'):
12-Aug-2020 01:06:18   - Variant testFixturesApiElements:
12-Aug-2020 01:06:18       - Declares capability org.igniterealtime.smack:smack-omemo-signal-test-fixtures:4.4.0-beta2-SNAPSHOT which cannot be mapped to Maven
12-Aug-2020 01:06:18   - Variant testFixturesRuntimeElements:
12-Aug-2020 01:06:18       - Declares capability org.igniterealtime.smack:smack-omemo-signal-test-fixtures:4.4.0-beta2-SNAPSHOT which cannot be mapped to Maven
12-Aug-2020 01:06:18 These issues indicate information that is lost in the published 'pom' metadata file, which may be an issue if the published library is consumed by an old Gradle version or Apache Maven.
12-Aug-2020 01:06:18 The 'module' metadata file, which is used by Gradle 6+ is not affected.
12-Aug-2020 01:06:18 Maven publication 'mavenJava' pom metadata warnings (silence with 'suppressPomMetadataWarningsFor(variant)'):
12-Aug-2020 01:06:18   - Variant testFixturesApiElements:
12-Aug-2020 01:06:18       - Declares capability org.igniterealtime.smack:smack-omemo-signal-integration-test-test-fixtures:4.4.0-beta2-SNAPSHOT which cannot be mapped to Maven
12-Aug-2020 01:06:18   - Variant testFixturesRuntimeElements:
12-Aug-2020 01:06:18       - Declares capability org.igniterealtime.smack:smack-omemo-signal-integration-test-test-fixtures:4.4.0-beta2-SNAPSHOT which cannot be mapped to Maven
12-Aug-2020 01:06:18 These issues indicate information that is lost in the published 'pom' metadata file, which may be an issue if the published library is consumed by an old Gradle version or Apache Maven.
12-Aug-2020 01:06:18 The 'module' metadata file, which is used by Gradle 6+ is not affected.
12-Aug-2020 01:06:18 Maven publication 'mavenJava' pom metadata warnings (silence with 'suppressPomMetadataWarningsFor(variant)'):
12-Aug-2020 01:06:18   - Variant testFixturesApiElements:
12-Aug-2020 01:06:18       - Declares capability org.igniterealtime.smack:smack-openpgp-test-fixtures:4.4.0-beta2-SNAPSHOT which cannot be mapped to Maven
12-Aug-2020 01:06:18   - Variant testFixturesRuntimeElements:
12-Aug-2020 01:06:18       - Declares capability org.igniterealtime.smack:smack-openpgp-test-fixtures:4.4.0-beta2-SNAPSHOT which cannot be mapped to Maven
12-Aug-2020 01:06:18 These issues indicate information that is lost in the published 'pom' metadata file, which may be an issue if the published library is consumed by an old Gradle version or Apache Maven.
12-Aug-2020 01:06:18 The 'module' metadata file, which is used by Gradle 6+ is not affected.
12-Aug-2020 01:06:18 Maven publication 'mavenJava' pom metadata warnings (silence with 'suppressPomMetadataWarningsFor(variant)'):
12-Aug-2020 01:06:18   - Variant testFixturesApiElements:
12-Aug-2020 01:06:18       - Declares capability org.igniterealtime.smack:smack-repl-test-fixtures:4.4.0-beta2-SNAPSHOT which cannot be mapped to Maven
12-Aug-2020 01:06:18   - Variant testFixturesRuntimeElements:
12-Aug-2020 01:06:18       - Declares capability org.igniterealtime.smack:smack-repl-test-fixtures:4.4.0-beta2-SNAPSHOT which cannot be mapped to Maven
12-Aug-2020 01:06:18 These issues indicate information that is lost in the published 'pom' metadata file, which may be an issue if the published library is consumed by an old Gradle version or Apache Maven.
12-Aug-2020 01:06:18 The 'module' metadata file, which is used by Gradle 6+ is not affected.
12-Aug-2020 01:06:18 Maven publication 'mavenJava' pom metadata warnings (silence with 'suppressPomMetadataWarningsFor(variant)'):
12-Aug-2020 01:06:18   - Variant testFixturesApiElements:
12-Aug-2020 01:06:18       - Declares capability org.igniterealtime.smack:smack-resolver-dnsjava-test-fixtures:4.4.0-beta2-SNAPSHOT which cannot be mapped to Maven
12-Aug-2020 01:06:18   - Variant testFixturesRuntimeElements:
12-Aug-2020 01:06:18       - Declares capability org.igniterealtime.smack:smack-resolver-dnsjava-test-fixtures:4.4.0-beta2-SNAPSHOT which cannot be mapped to Maven
12-Aug-2020 01:06:18 These issues indicate information that is lost in the published 'pom' metadata file, which may be an issue if the published library is consumed by an old Gradle version or Apache Maven.
12-Aug-2020 01:06:18 The 'module' metadata file, which is used by Gradle 6+ is not affected.
12-Aug-2020 01:06:18 Maven publication 'mavenJava' pom metadata warnings (silence with 'suppressPomMetadataWarningsFor(variant)'):
12-Aug-2020 01:06:18   - Variant testFixturesApiElements:
12-Aug-2020 01:06:18       - Declares capability org.igniterealtime.smack:smack-resolver-javax-test-fixtures:4.4.0-beta2-SNAPSHOT which cannot be mapped to Maven
12-Aug-2020 01:06:18   - Variant testFixturesRuntimeElements:
12-Aug-2020 01:06:18       - Declares capability org.igniterealtime.smack:smack-resolver-javax-test-fixtures:4.4.0-beta2-SNAPSHOT which cannot be mapped to Maven
12-Aug-2020 01:06:18 These issues indicate information that is lost in the published 'pom' metadata file, which may be an issue if the published library is consumed by an old Gradle version or Apache Maven.
12-Aug-2020 01:06:18 The 'module' metadata file, which is used by Gradle 6+ is not affected.
12-Aug-2020 01:06:18 Maven publication 'mavenJava' pom metadata warnings (silence with 'suppressPomMetadataWarningsFor(variant)'):
12-Aug-2020 01:06:18   - Variant testFixturesApiElements:
12-Aug-2020 01:06:18       - Declares capability org.igniterealtime.smack:smack-resolver-minidns-test-fixtures:4.4.0-beta2-SNAPSHOT which cannot be mapped to Maven
12-Aug-2020 01:06:18   - Variant testFixturesRuntimeElements:
12-Aug-2020 01:06:18       - Declares capability org.igniterealtime.smack:smack-resolver-minidns-test-fixtures:4.4.0-beta2-SNAPSHOT which cannot be mapped to Maven
12-Aug-2020 01:06:18 These issues indicate information that is lost in the published 'pom' metadata file, which may be an issue if the published library is consumed by an old Gradle version or Apache Maven.
12-Aug-2020 01:06:18 The 'module' metadata file, which is used by Gradle 6+ is not affected.
12-Aug-2020 01:06:18 Maven publication 'mavenJava' pom metadata warnings (silence with 'suppressPomMetadataWarningsFor(variant)'):
12-Aug-2020 01:06:18   - Variant testFixturesApiElements:
12-Aug-2020 01:06:18       - Declares capability org.igniterealtime.smack:smack-resolver-minidns-dox-test-fixtures:4.4.0-beta2-SNAPSHOT which cannot be mapped to Maven
12-Aug-2020 01:06:18   - Variant testFixturesRuntimeElements:
12-Aug-2020 01:06:18       - Declares capability org.igniterealtime.smack:smack-resolver-minidns-dox-test-fixtures:4.4.0-beta2-SNAPSHOT which cannot be mapped to Maven
12-Aug-2020 01:06:18 These issues indicate information that is lost in the published 'pom' metadata file, which may be an issue if the published library is consumed by an old Gradle version or Apache Maven.
12-Aug-2020 01:06:18 The 'module' metadata file, which is used by Gradle 6+ is not affected.
12-Aug-2020 01:06:18 Maven publication 'mavenJava' pom metadata warnings (silence with 'suppressPomMetadataWarningsFor(variant)'):
12-Aug-2020 01:06:18   - Variant testFixturesApiElements:
12-Aug-2020 01:06:18       - Declares capability org.igniterealtime.smack:smack-sasl-javax-test-fixtures:4.4.0-beta2-SNAPSHOT which cannot be mapped to Maven
12-Aug-2020 01:06:18   - Variant testFixturesRuntimeElements:
12-Aug-2020 01:06:18       - Declares capability org.igniterealtime.smack:smack-sasl-javax-test-fixtures:4.4.0-beta2-SNAPSHOT which cannot be mapped to Maven
12-Aug-2020 01:06:18 These issues indicate information that is lost in the published 'pom' metadata file, which may be an issue if the published library is consumed by an old Gradle version or Apache Maven.
12-Aug-2020 01:06:18 The 'module' metadata file, which is used by Gradle 6+ is not affected.
12-Aug-2020 01:06:18 Maven publication 'mavenJava' pom metadata warnings (silence with 'suppressPomMetadataWarningsFor(variant)'):
12-Aug-2020 01:06:18   - Variant testFixturesApiElements:
12-Aug-2020 01:06:18       - Declares capability org.igniterealtime.smack:smack-sasl-provided-test-fixtures:4.4.0-beta2-SNAPSHOT which cannot be mapped to Maven
12-Aug-2020 01:06:18   - Variant testFixturesRuntimeElements:
12-Aug-2020 01:06:18       - Declares capability org.igniterealtime.smack:smack-sasl-provided-test-fixtures:4.4.0-beta2-SNAPSHOT which cannot be mapped to Maven
12-Aug-2020 01:06:18 These issues indicate information that is lost in the published 'pom' metadata file, which may be an issue if the published library is consumed by an old Gradle version or Apache Maven.
12-Aug-2020 01:06:18 The 'module' metadata file, which is used by Gradle 6+ is not affected.
12-Aug-2020 01:06:18 Maven publication 'mavenJava' pom metadata warnings (silence with 'suppressPomMetadataWarningsFor(variant)'):
12-Aug-2020 01:06:18   - Variant testFixturesApiElements:
12-Aug-2020 01:06:18       - Declares capability org.igniterealtime.smack:smack-tcp-test-fixtures:4.4.0-beta2-SNAPSHOT which cannot be mapped to Maven
12-Aug-2020 01:06:18   - Variant testFixturesRuntimeElements:
12-Aug-2020 01:06:18       - Declares capability org.igniterealtime.smack:smack-tcp-test-fixtures:4.4.0-beta2-SNAPSHOT which cannot be mapped to Maven
12-Aug-2020 01:06:18 These issues indicate information that is lost in the published 'pom' metadata file, which may be an issue if the published library is consumed by an old Gradle version or Apache Maven.
12-Aug-2020 01:06:18 The 'module' metadata file, which is used by Gradle 6+ is not affected.
12-Aug-2020 01:06:18 Maven publication 'mavenJava' pom metadata warnings (silence with 'suppressPomMetadataWarningsFor(variant)'):
12-Aug-2020 01:06:18   - Variant testFixturesApiElements:
12-Aug-2020 01:06:18       - Declares capability org.igniterealtime.smack:smack-xmlparser-test-fixtures:4.4.0-beta2-SNAPSHOT which cannot be mapped to Maven
12-Aug-2020 01:06:18   - Variant testFixturesRuntimeElements:
12-Aug-2020 01:06:18       - Declares capability org.igniterealtime.smack:smack-xmlparser-test-fixtures:4.4.0-beta2-SNAPSHOT which cannot be mapped to Maven
12-Aug-2020 01:06:18 These issues indicate information that is lost in the published 'pom' metadata file, which may be an issue if the published library is consumed by an old Gradle version or Apache Maven.
12-Aug-2020 01:06:18 The 'module' metadata file, which is used by Gradle 6+ is not affected.
12-Aug-2020 01:06:18 Maven publication 'mavenJava' pom metadata warnings (silence with 'suppressPomMetadataWarningsFor(variant)'):
12-Aug-2020 01:06:18   - Variant testFixturesApiElements:
12-Aug-2020 01:06:18       - Declares capability org.igniterealtime.smack:smack-xmlparser-stax-test-fixtures:4.4.0-beta2-SNAPSHOT which cannot be mapped to Maven
12-Aug-2020 01:06:18   - Variant testFixturesRuntimeElements:
12-Aug-2020 01:06:18       - Declares capability org.igniterealtime.smack:smack-xmlparser-stax-test-fixtures:4.4.0-beta2-SNAPSHOT which cannot be mapped to Maven
12-Aug-2020 01:06:18 These issues indicate information that is lost in the published 'pom' metadata file, which may be an issue if the published library is consumed by an old Gradle version or Apache Maven.
12-Aug-2020 01:06:18 The 'module' metadata file, which is used by Gradle 6+ is not affected.
12-Aug-2020 01:06:18 Maven publication 'mavenJava' pom metadata warnings (silence with 'suppressPomMetadataWarningsFor(variant)'):
12-Aug-2020 01:06:18   - Variant testFixturesApiElements:
12-Aug-2020 01:06:18       - Declares capability org.igniterealtime.smack:smack-xmlparser-xpp3-test-fixtures:4.4.0-beta2-SNAPSHOT which cannot be mapped to Maven
12-Aug-2020 01:06:18   - Variant testFixturesRuntimeElements:
12-Aug-2020 01:06:18       - Declares capability org.igniterealtime.smack:smack-xmlparser-xpp3-test-fixtures:4.4.0-beta2-SNAPSHOT which cannot be mapped to Maven
12-Aug-2020 01:06:18 These issues indicate information that is lost in the published 'pom' metadata file, which may be an issue if the published library is consumed by an old Gradle version or Apache Maven.
12-Aug-2020 01:06:18 The 'module' metadata file, which is used by Gradle 6+ is not affected.
12-Aug-2020 01:06:19 > Task :smack-core:createVersionResource UP-TO-DATE
12-Aug-2020 01:06:22 > Task :smack-xmlparser:compileJava
12-Aug-2020 01:06:31 > Task :smack-core:compileJava
12-Aug-2020 01:06:33 > Task :smack-im:compileJava
12-Aug-2020 01:06:43 > Task :smack-extensions:compileJava
12-Aug-2020 01:06:48 > Task :smack-experimental:compileJava
12-Aug-2020 01:06:50 > Task :smack-openpgp:compileJava
12-Aug-2020 01:06:51 > Task :smack-resolver-minidns:compileJava
12-Aug-2020 01:06:52 > Task :smack-sasl-provided:compileJava
12-Aug-2020 01:06:53 > Task :smack-xmlparser-xpp3:compileJava
12-Aug-2020 01:06:54 > Task :smack-android:compileJava
12-Aug-2020 01:06:54 > Task :smack-android:processResources NO-SOURCE
12-Aug-2020 01:06:54 > Task :smack-android:classes
12-Aug-2020 01:06:54 > Task :smack-android:jar
12-Aug-2020 01:06:54 > Task :smack-android:compileTestFixturesJava NO-SOURCE
12-Aug-2020 01:06:54 > Task :smack-android:processTestFixturesResources NO-SOURCE
12-Aug-2020 01:06:54 > Task :smack-android:testFixturesClasses UP-TO-DATE
12-Aug-2020 01:06:54 > Task :smack-android:testFixturesJar UP-TO-DATE
12-Aug-2020 01:06:54 > Task :smack-android:generateMetadataFileForMavenJavaPublication
12-Aug-2020 01:06:54 > Task :smack-android:generatePomFileForMavenJavaPublication
12-Aug-2020 01:06:54 > Task :smack-android:copyJavadocDocFiles NO-SOURCE
12-Aug-2020 01:06:55 > Task :smack-android:javadoc
12-Aug-2020 01:06:55 > Task :smack-android:javadocJar
12-Aug-2020 01:06:55 > Task :smack-android:sourcesJar
12-Aug-2020 01:06:55 > Task :smack-android:compileTestJava NO-SOURCE
12-Aug-2020 01:06:55 > Task :smack-android:processTestResources NO-SOURCE
12-Aug-2020 01:06:55 > Task :smack-android:testClasses UP-TO-DATE
12-Aug-2020 01:06:55 > Task :smack-android:testsJar
12-Aug-2020 01:06:55 > Task :smack-android:signMavenJavaPublication SKIPPED
12-Aug-2020 01:06:56 > Task :smack-android:publishMavenJavaPublicationToCustomRepoRepository FAILED
12-Aug-2020 01:06:56
12-Aug-2020 01:06:56 FAILURE: Build failed with an exception.
12-Aug-2020 01:06:56
12-Aug-2020 01:06:56 * What went wrong:
12-Aug-2020 01:06:56 Execution failed for task ':smack-android:publishMavenJavaPublicationToCustomRepoRepository'.
12-Aug-2020 01:06:56 > Failed to publish publication 'mavenJava' to repository 'customRepo'
12-Aug-2020 01:06:56    > Could not PUT 'https://www.igniterealtime.org/archiva/repository/maven/org/igniterealtime/smack/smack-android/4.4.0-beta2-SNAPSHOT/maven-metadata.xml'. Received status code 401 from server: Unauthorized
12-Aug-2020 01:06:56
12-Aug-2020 01:06:56 * Try:
12-Aug-2020 01:06:56 Run with --stacktrace option to get the stack trace. Run with --info or --debug option to get more log output. Run with --scan to get full insights.
12-Aug-2020 01:06:56
12-Aug-2020 01:06:56 * Get more help at https://help.gradle.org
12-Aug-2020 01:06:56
12-Aug-2020 01:06:56 BUILD FAILED in 49s
12-Aug-2020 01:06:56
12-Aug-2020 01:06:56 Deprecated Gradle features were used in this build, making it incompatible with Gradle 7.0.
12-Aug-2020 01:06:56 Use '--warning-mode all' to show the individual deprecation warnings.
12-Aug-2020 01:06:56 See https://docs.gradle.org/6.4.1/userguide/command_line_interface.html#sec:command_line_warnings
12-Aug-2020 01:06:56 20 actionable tasks: 18 executed, 2 up-to-date
12-Aug-2020 01:06:56 Failing task since return code of [/var/atlassian/bamboo-home/temp/SMACK-NIGHTLYSTABLE-JOB1-170-ScriptBuildTask-8472700085755435653.sh] was 1 while expected 0
12-Aug-2020 01:06:56 Finished task 'Publish artifacts to archiva' with result: Failed
12-Aug-2020 01:06:56 Running post build plugin 'NCover Results Collector'
12-Aug-2020 01:06:56 Running post build plugin 'Artifact Copier'
12-Aug-2020 01:06:56 Publishing an artifact: Project binary files
12-Aug-2020 01:06:56 Finished publishing of artifact Non required shared artifact: [Project binary files], pattern: [*.zip] anchored at: [build/distributions/] in 32.77 ms
12-Aug-2020 01:06:56 Running post build plugin 'npm Cache Cleanup'
12-Aug-2020 01:06:56 Running post build plugin 'Clover Results Collector'
12-Aug-2020 01:06:56 Running post build plugin 'Docker Container Cleanup'
12-Aug-2020 01:06:56 Finalising the build...
12-Aug-2020 01:06:56 Stopping timer.
12-Aug-2020 01:06:56 Build SMACK-NIGHTLYSTABLE-JOB1-170 completed.
12-Aug-2020 01:06:56 Running on server: post build plugin 'NCover Results Collector'
12-Aug-2020 01:06:56 Running on server: post build plugin 'Build Hanging Detection Configuration'
12-Aug-2020 01:06:56 Running on server: post build plugin 'Clover Delta Calculator'
12-Aug-2020 01:06:56 Running on server: post build plugin 'Maven Dependencies Postprocessor'
12-Aug-2020 01:06:56 All post build plugins have finished
12-Aug-2020 01:06:56 Generating build results summary...
12-Aug-2020 01:06:57 Saving build results to disk...
12-Aug-2020 01:06:57 Store variable context...
12-Aug-2020 01:06:57 Indexing build results...
12-Aug-2020 01:06:57 Finished building SMACK-NIGHTLYSTABLE-JOB1-170.